phoenix-commits mailing list archives

Site index · List index
Message view « Date » · « Thread »
Top « Date » · « Thread »
From Apache Jenkins Server <jenk...@builds.apache.org>
Subject Build failed in Jenkins: Phoenix | Master #1601
Date Fri, 21 Apr 2017 02:51:10 GMT
See <https://builds.apache.org/job/Phoenix-master/1601/display/redirect?page=changes>

Changes:

[apurtell] PHOENIX-3801 Demote extremely verbose logs in

------------------------------------------
[...truncated 73.63 KB...]
Running org.apache.phoenix.trace.PhoenixTraceReaderIT
Tests run: 2, Failures: 0, Errors: 0, Skipped: 0, Time elapsed: 3.717 sec - in org.apache.phoenix.trace.PhoenixTraceReaderIT
Running org.apache.phoenix.tx.FlappingTransactionIT
Tests run: 9, Failures: 0, Errors: 0, Skipped: 0, Time elapsed: 45.668 sec - in org.apache.phoenix.iterate.RoundRobinResultIteratorIT
Running org.apache.phoenix.tx.ParameterizedTransactionIT
Tests run: 4, Failures: 0, Errors: 0, Skipped: 0, Time elapsed: 8.92 sec - in org.apache.phoenix.tx.FlappingTransactionIT
Running org.apache.phoenix.tx.TransactionIT
Tests run: 16, Failures: 0, Errors: 0, Skipped: 0, Time elapsed: 303.646 sec - in org.apache.phoenix.end2end.index.DropColumnIT
Running org.apache.phoenix.tx.TxCheckpointIT
Tests run: 99, Failures: 0, Errors: 0, Skipped: 0, Time elapsed: 969.802 sec - in org.apache.phoenix.end2end.HashJoinIT
Tests run: 7, Failures: 0, Errors: 0, Skipped: 0, Time elapsed: 44.99 sec - in org.apache.phoenix.tx.TransactionIT
Tests run: 67, Failures: 0, Errors: 0, Skipped: 0, Time elapsed: 418.923 sec - in org.apache.phoenix.end2end.index.IndexExpressionIT
Tests run: 52, Failures: 0, Errors: 0, Skipped: 4, Time elapsed: 201.344 sec - in org.apache.phoenix.tx.ParameterizedTransactionIT
Tests run: 102, Failures: 0, Errors: 0, Skipped: 0, Time elapsed: 969.493 sec - in org.apache.phoenix.end2end.SortMergeJoinIT
Tests run: 40, Failures: 0, Errors: 0, Skipped: 0, Time elapsed: 290.268 sec - in org.apache.phoenix.tx.TxCheckpointIT
Tests run: 80, Failures: 0, Errors: 0, Skipped: 0, Time elapsed: 1,051.494 sec - in org.apache.phoenix.end2end.index.MutableIndexIT
Tests run: 304, Failures: 0, Errors: 0, Skipped: 0, Time elapsed: 1,872.273 sec - in org.apache.phoenix.end2end.index.IndexIT

Results :

Tests run: 2040, Failures: 0, Errors: 0, Skipped: 4

[INFO] 
[INFO] --- maven-failsafe-plugin:2.19.1:integration-test (ClientManagedTimeTests) @ phoenix-core
---

-------------------------------------------------------
 T E S T S
-------------------------------------------------------
Running org.apache.phoenix.end2end.CreateSchemaIT
Tests run: 1, Failures: 0, Errors: 0, Skipped: 0, Time elapsed: 1.393 sec - in org.apache.phoenix.end2end.CreateSchemaIT
Running org.apache.phoenix.end2end.CreateTableIT
Running org.apache.phoenix.end2end.CustomEntityDataIT
Running org.apache.phoenix.end2end.ArrayIT
Running org.apache.phoenix.end2end.ColumnProjectionOptimizationIT
Running org.apache.phoenix.end2end.AggregateQueryIT
Running org.apache.phoenix.end2end.ClientTimeArithmeticQueryIT
Running org.apache.phoenix.end2end.CaseStatementIT
Tests run: 3, Failures: 0, Errors: 0, Skipped: 0, Time elapsed: 14.5 sec - in org.apache.phoenix.end2end.CustomEntityDataIT
Running org.apache.phoenix.end2end.CastAndCoerceIT
Running org.apache.phoenix.end2end.DerivedTableIT
Tests run: 3, Failures: 0, Errors: 0, Skipped: 0, Time elapsed: 43.1 sec - in org.apache.phoenix.end2end.ColumnProjectionOptimizationIT
Running org.apache.phoenix.end2end.DistinctCountIT
Tests run: 18, Failures: 0, Errors: 0, Skipped: 0, Time elapsed: 44.744 sec - in org.apache.phoenix.end2end.DerivedTableIT
Running org.apache.phoenix.end2end.DropSchemaIT
Tests run: 2, Failures: 0, Errors: 0, Skipped: 0, Time elapsed: 12.339 sec - in org.apache.phoenix.end2end.DropSchemaIT
Running org.apache.phoenix.end2end.ExtendedQueryExecIT
Tests run: 10, Failures: 0, Errors: 0, Skipped: 0, Time elapsed: 28.448 sec - in org.apache.phoenix.end2end.DistinctCountIT
Running org.apache.phoenix.end2end.FunkyNamesIT
Tests run: 4, Failures: 0, Errors: 0, Skipped: 0, Time elapsed: 9.752 sec - in org.apache.phoenix.end2end.ExtendedQueryExecIT
Tests run: 3, Failures: 0, Errors: 0, Skipped: 0, Time elapsed: 6.964 sec - in org.apache.phoenix.end2end.FunkyNamesIT
Running org.apache.phoenix.end2end.GroupByIT
Running org.apache.phoenix.end2end.MutableQueryIT
Tests run: 80, Failures: 0, Errors: 0, Skipped: 0, Time elapsed: 155.868 sec - in org.apache.phoenix.end2end.ArrayIT
Tests run: 56, Failures: 0, Errors: 0, Skipped: 0, Time elapsed: 155.672 sec - in org.apache.phoenix.end2end.CaseStatementIT
Running org.apache.phoenix.end2end.NativeHBaseTypesIT
Tests run: 42, Failures: 0, Errors: 0, Skipped: 0, Time elapsed: 165.9 sec - in org.apache.phoenix.end2end.AggregateQueryIT
Tests run: 49, Failures: 0, Errors: 0, Skipped: 0, Time elapsed: 156.198 sec - in org.apache.phoenix.end2end.CastAndCoerceIT
Running org.apache.phoenix.end2end.ProductMetricsIT
Running org.apache.phoenix.end2end.NotQueryIT
Running org.apache.phoenix.end2end.PointInTimeQueryIT
Tests run: 7, Failures: 0, Errors: 0, Skipped: 0, Time elapsed: 11.669 sec - in org.apache.phoenix.end2end.NativeHBaseTypesIT
Running org.apache.phoenix.end2end.QueryDatabaseMetaDataIT
Tests run: 17, Failures: 0, Errors: 0, Skipped: 0, Time elapsed: 199.793 sec - in org.apache.phoenix.end2end.CreateTableIT
Running org.apache.phoenix.end2end.QueryIT
Tests run: 7, Failures: 0, Errors: 0, Skipped: 0, Time elapsed: 60.819 sec - in org.apache.phoenix.end2end.PointInTimeQueryIT
Running org.apache.phoenix.end2end.ReadIsolationLevelIT
Tests run: 61, Failures: 0, Errors: 0, Skipped: 0, Time elapsed: 68.191 sec - in org.apache.phoenix.end2end.ProductMetricsIT
Tests run: 2, Failures: 0, Errors: 0, Skipped: 0, Time elapsed: 8.133 sec - in org.apache.phoenix.end2end.ReadIsolationLevelIT
Running org.apache.phoenix.end2end.RowValueConstructorIT
Tests run: 91, Failures: 0, Errors: 0, Skipped: 0, Time elapsed: 187.378 sec - in org.apache.phoenix.end2end.GroupByIT
Running org.apache.phoenix.end2end.ScanQueryIT
Tests run: 77, Failures: 0, Errors: 0, Skipped: 0, Time elapsed: 118.626 sec - in org.apache.phoenix.end2end.NotQueryIT
Running org.apache.phoenix.end2end.SequenceBulkAllocationIT
Running org.apache.phoenix.end2end.SequenceIT
Tests run: 245, Failures: 0, Errors: 0, Skipped: 0, Time elapsed: 328.226 sec - in org.apache.phoenix.end2end.ClientTimeArithmeticQueryIT
Tests run: 19, Failures: 0, Errors: 0, Skipped: 0, Time elapsed: 158.972 sec - in org.apache.phoenix.end2end.QueryDatabaseMetaDataIT
Running org.apache.phoenix.end2end.ToNumberFunctionIT
Running org.apache.phoenix.end2end.TopNIT
Tests run: 56, Failures: 0, Errors: 0, Skipped: 0, Time elapsed: 62.03 sec - in org.apache.phoenix.end2end.SequenceBulkAllocationIT
Running org.apache.phoenix.end2end.TruncateFunctionIT
Tests run: 1, Failures: 0, Errors: 0, Skipped: 0, Time elapsed: 5.271 sec - in org.apache.phoenix.end2end.TruncateFunctionIT
Running org.apache.phoenix.end2end.UpsertSelectIT
Tests run: 4, Failures: 0, Errors: 0, Skipped: 0, Time elapsed: 7.731 sec - in org.apache.phoenix.end2end.TopNIT
Tests run: 112, Failures: 0, Errors: 0, Skipped: 0, Time elapsed: 174.952 sec - in org.apache.phoenix.end2end.QueryIT
Running org.apache.phoenix.end2end.UpsertValuesIT
Tests run: 18, Failures: 0, Errors: 0, Skipped: 0, Time elapsed: 11.539 sec - in org.apache.phoenix.end2end.ToNumberFunctionIT
Running org.apache.phoenix.end2end.VariableLengthPKIT
Tests run: 54, Failures: 0, Errors: 0, Skipped: 0, Time elapsed: 56.339 sec - in org.apache.phoenix.end2end.SequenceIT
Running org.apache.phoenix.end2end.salted.SaltedTableIT
Tests run: 112, Failures: 0, Errors: 0, Skipped: 0, Time elapsed: 102.204 sec - in org.apache.phoenix.end2end.ScanQueryIT
Tests run: 8, Failures: 0, Errors: 0, Skipped: 0, Time elapsed: 9.279 sec - in org.apache.phoenix.end2end.salted.SaltedTableIT
Tests run: 112, Failures: 0, Errors: 0, Skipped: 0, Time elapsed: 312.686 sec - in org.apache.phoenix.end2end.MutableQueryIT
Tests run: 46, Failures: 0, Errors: 0, Skipped: 0, Time elapsed: 159.903 sec - in org.apache.phoenix.end2end.RowValueConstructorIT
Running org.apache.phoenix.rpc.UpdateCacheWithScnIT
Tests run: 1, Failures: 0, Errors: 0, Skipped: 0, Time elapsed: 7.141 sec - in org.apache.phoenix.rpc.UpdateCacheWithScnIT
Tests run: 50, Failures: 0, Errors: 0, Skipped: 0, Time elapsed: 62.67 sec - in org.apache.phoenix.end2end.VariableLengthPKIT
Tests run: 25, Failures: 0, Errors: 0, Skipped: 0, Time elapsed: 120.985 sec - in org.apache.phoenix.end2end.UpsertValuesIT
Tests run: 22, Failures: 0, Errors: 0, Skipped: 0, Time elapsed: 139.215 sec - in org.apache.phoenix.end2end.UpsertSelectIT

Results :

Tests run: 1418, Failures: 0, Errors: 0, Skipped: 0

[INFO] 
[INFO] --- maven-failsafe-plugin:2.19.1:integration-test (HBaseManagedTimeTests) @ phoenix-core
---

-------------------------------------------------------
 T E S T S
-------------------------------------------------------

Results :

Tests run: 0, Failures: 0, Errors: 0, Skipped: 0

[INFO] 
[INFO] --- maven-failsafe-plugin:2.19.1:integration-test (NeedTheirOwnClusterTests) @ phoenix-core
---

-------------------------------------------------------
 T E S T S
-------------------------------------------------------
Running org.apache.hadoop.hbase.regionserver.wal.WALReplayWithIndexWritesAndCompressedWALIT
Running org.apache.phoenix.end2end.ConnectionUtilIT
Tests run: 1, Failures: 0, Errors: 0, Skipped: 0, Time elapsed: 76.126 sec - in org.apache.hadoop.hbase.regionserver.wal.WALReplayWithIndexWritesAndCompressedWALIT
Running org.apache.phoenix.end2end.CountDistinctCompressionIT
Running org.apache.phoenix.end2end.AutomaticRebuildIT
Running org.apache.phoenix.end2end.ContextClassloaderIT
Running org.apache.phoenix.end2end.CsvBulkLoadToolIT
Tests run: 3, Failures: 0, Errors: 0, Skipped: 0, Time elapsed: 10.384 sec - in org.apache.phoenix.end2end.ContextClassloaderIT
Tests run: 1, Failures: 0, Errors: 0, Skipped: 0, Time elapsed: 43.055 sec - in org.apache.phoenix.end2end.ConnectionUtilIT
Tests run: 1, Failures: 0, Errors: 0, Skipped: 0, Time elapsed: 14.508 sec - in org.apache.phoenix.end2end.CountDistinctCompressionIT
Running org.apache.phoenix.end2end.FlappingLocalIndexIT
Running org.apache.phoenix.end2end.IndexToolForPartialBuildIT
Running org.apache.phoenix.end2end.IndexExtendedIT
Running org.apache.phoenix.end2end.IndexToolForPartialBuildWithNamespaceEnabledIT
Tests run: 2, Failures: 0, Errors: 0, Skipped: 0, Time elapsed: 51.199 sec - in org.apache.phoenix.end2end.IndexToolForPartialBuildIT
Running org.apache.phoenix.end2end.QueryWithLimitIT
Tests run: 2, Failures: 0, Errors: 0, Skipped: 0, Time elapsed: 44.159 sec - in org.apache.phoenix.end2end.IndexToolForPartialBuildWithNamespaceEnabledIT
Running org.apache.phoenix.end2end.QueryTimeoutIT
Tests run: 8, Failures: 0, Errors: 0, Skipped: 0, Time elapsed: 98.499 sec - in org.apache.phoenix.end2end.FlappingLocalIndexIT
Tests run: 2, Failures: 0, Errors: 0, Skipped: 0, Time elapsed: 11.876 sec - in org.apache.phoenix.end2end.QueryWithLimitIT
Tests run: 11, Failures: 0, Errors: 0, Skipped: 0, Time elapsed: 132.58 sec - in org.apache.phoenix.end2end.CsvBulkLoadToolIT
Tests run: 2, Failures: 0, Errors: 0, Skipped: 0, Time elapsed: 30.305 sec - in org.apache.phoenix.end2end.QueryTimeoutIT
Running org.apache.phoenix.end2end.RegexBulkLoadToolIT
Tests run: 2, Failures: 0, Errors: 0, Skipped: 0, Time elapsed: 176.811 sec - in org.apache.phoenix.end2end.AutomaticRebuildIT
Running org.apache.phoenix.end2end.RenewLeaseIT
Running org.apache.phoenix.end2end.SpillableGroupByIT
Running org.apache.phoenix.end2end.StatsCollectorIT
Running org.apache.phoenix.end2end.SysTableNamespaceMappedStatsCollectorIT
Tests run: 1, Failures: 0, Errors: 0, Skipped: 0, Time elapsed: 32.815 sec - in org.apache.phoenix.end2end.RenewLeaseIT
Tests run: 2, Failures: 0, Errors: 0, Skipped: 0, Time elapsed: 23.482 sec - in org.apache.phoenix.end2end.SpillableGroupByIT
Running org.apache.phoenix.end2end.UserDefinedFunctionsIT
Running org.apache.phoenix.end2end.index.ImmutableIndexIT
Running org.apache.phoenix.end2end.index.LocalIndexIT
Running org.apache.phoenix.end2end.index.MutableIndexFailureIT
Tests run: 10, Failures: 0, Errors: 0, Skipped: 0, Time elapsed: 140.536 sec - in org.apache.phoenix.end2end.RegexBulkLoadToolIT
Tests run: 14, Failures: 0, Errors: 0, Skipped: 0, Time elapsed: 68.138 sec - in org.apache.phoenix.end2end.UserDefinedFunctionsIT
Running org.apache.phoenix.end2end.index.MutableIndexReplicationIT
Running org.apache.phoenix.end2end.index.ReadOnlyIndexFailureIT
Tests run: 1, Failures: 0, Errors: 0, Skipped: 0, Time elapsed: 38.697 sec - in org.apache.phoenix.end2end.index.MutableIndexReplicationIT
Tests run: 2, Failures: 0, Errors: 0, Skipped: 0, Time elapsed: 37.109 sec - in org.apache.phoenix.end2end.index.ReadOnlyIndexFailureIT
Tests run: 80, Failures: 0, Errors: 0, Skipped: 0, Time elapsed: 415.683 sec - in org.apache.phoenix.end2end.IndexExtendedIT
Running org.apache.phoenix.hbase.index.FailForUnsupportedHBaseVersionsIT
Running org.apache.phoenix.end2end.index.txn.TxWriteFailureIT
Tests run: 2, Failures: 0, Errors: 0, Skipped: 0, Time elapsed: 32.969 sec - in org.apache.phoenix.hbase.index.FailForUnsupportedHBaseVersionsIT
Running org.apache.phoenix.execute.PartialCommitIT
Running org.apache.phoenix.hbase.index.covered.EndToEndCoveredColumnsIndexBuilderIT
Tests run: 12, Failures: 0, Errors: 0, Skipped: 0, Time elapsed: 9.804 sec - in org.apache.phoenix.execute.PartialCommitIT
Tests run: 2, Failures: 0, Errors: 0, Skipped: 0, Time elapsed: 16.906 sec - in org.apache.phoenix.hbase.index.covered.EndToEndCoveredColumnsIndexBuilderIT
Tests run: 8, Failures: 0, Errors: 0, Skipped: 0, Time elapsed: 80.675 sec - in org.apache.phoenix.end2end.index.txn.TxWriteFailureIT
Tests run: 30, Failures: 0, Errors: 0, Skipped: 0, Time elapsed: 303.481 sec - in org.apache.phoenix.end2end.index.LocalIndexIT
Tests run: 8, Failures: 2, Errors: 0, Skipped: 0, Time elapsed: 291.283 sec <<< FAILURE!
- in org.apache.phoenix.end2end.index.MutableIndexFailureIT
testWriteFailureDisablesIndex[MutableIndexFailureIT_transactional=false,localIndex=true,isNamespaceMapped=true](org.apache.phoenix.end2end.index.MutableIndexFailureIT)
 Time elapsed: 24.766 sec  <<< FAILURE!
java.lang.AssertionError
	at org.apache.phoenix.end2end.index.MutableIndexFailureIT.helpTestWriteFailureDisablesIndex(MutableIndexFailureIT.java:218)
	at org.apache.phoenix.end2end.index.MutableIndexFailureIT.testWriteFailureDisablesIndex(MutableIndexFailureIT.java:134)

testWriteFailureDisablesIndex[MutableIndexFailureIT_transactional=false,localIndex=true,isNamespaceMapped=false](org.apache.phoenix.end2end.index.MutableIndexFailureIT)
 Time elapsed: 22.28 sec  <<< FAILURE!
java.lang.AssertionError
	at org.apache.phoenix.end2end.index.MutableIndexFailureIT.helpTestWriteFailureDisablesIndex(MutableIndexFailureIT.java:218)
	at org.apache.phoenix.end2end.index.MutableIndexFailureIT.testWriteFailureDisablesIndex(MutableIndexFailureIT.java:134)

Running org.apache.phoenix.hbase.index.covered.example.EndToEndCoveredIndexingIT
Running org.apache.phoenix.hbase.index.covered.example.FailWithoutRetriesIT
Running org.apache.phoenix.hbase.index.covered.example.EndtoEndIndexingWithCompressionIT
Tests run: 120, Failures: 0, Errors: 0, Skipped: 24, Time elapsed: 416.182 sec - in org.apache.phoenix.end2end.StatsCollectorIT
Tests run: 120, Failures: 0, Errors: 0, Skipped: 24, Time elapsed: 411.229 sec - in org.apache.phoenix.end2end.SysTableNamespaceMappedStatsCollectorIT
Tests run: 24, Failures: 0, Errors: 0, Skipped: 0, Time elapsed: 343.165 sec - in org.apache.phoenix.end2end.index.ImmutableIndexIT
Tests run: 1, Failures: 0, Errors: 0, Skipped: 0, Time elapsed: 15.3 sec - in org.apache.phoenix.hbase.index.covered.example.FailWithoutRetriesIT
Running org.apache.phoenix.iterate.RoundRobinResultIteratorWithStatsIT
Running org.apache.phoenix.iterate.ScannerLeaseRenewalIT
Running org.apache.phoenix.monitoring.PhoenixMetricsIT
Running org.apache.phoenix.rpc.PhoenixClientRpcIT
Tests run: 1, Failures: 0, Errors: 0, Skipped: 0, Time elapsed: 18.504 sec - in org.apache.phoenix.iterate.RoundRobinResultIteratorWithStatsIT
Running org.apache.phoenix.rpc.PhoenixServerRpcIT
Tests run: 2, Failures: 0, Errors: 0, Skipped: 0, Time elapsed: 11.403 sec - in org.apache.phoenix.rpc.PhoenixClientRpcIT
Tests run: 1, Failures: 0, Errors: 0, Skipped: 0, Time elapsed: 20.943 sec - in org.apache.phoenix.rpc.PhoenixServerRpcIT
Tests run: 11, Failures: 0, Errors: 0, Skipped: 0, Time elapsed: 145.3 sec - in org.apache.phoenix.hbase.index.covered.example.EndToEndCoveredIndexingIT
Tests run: 11, Failures: 0, Errors: 0, Skipped: 0, Time elapsed: 134.921 sec - in org.apache.phoenix.hbase.index.covered.example.EndtoEndIndexingWithCompressionIT
Tests run: 21, Failures: 0, Errors: 0, Skipped: 0, Time elapsed: 77.24 sec - in org.apache.phoenix.monitoring.PhoenixMetricsIT
Tests run: 2, Failures: 0, Errors: 0, Skipped: 0, Time elapsed: 169.634 sec - in org.apache.phoenix.iterate.ScannerLeaseRenewalIT

Results :

Failed tests: 
  MutableIndexFailureIT.testWriteFailureDisablesIndex:134->helpTestWriteFailureDisablesIndex:218
  MutableIndexFailureIT.testWriteFailureDisablesIndex:134->helpTestWriteFailureDisablesIndex:218

Tests run: 521, Failures: 2, Errors: 0, Skipped: 48

[INFO] 
[INFO] --- maven-failsafe-plugin:2.19.1:verify (ParallelStatsEnabledTest) @ phoenix-core ---
[INFO] ------------------------------------------------------------------------
[INFO] Reactor Summary:
[INFO] 
[INFO] Apache Phoenix ..................................... SUCCESS [  4.750 s]
[INFO] Phoenix Core ....................................... FAILURE [  01:20 h]
[INFO] Phoenix - Flume .................................... SKIPPED
[INFO] Phoenix - Kafka .................................... SKIPPED
[INFO] Phoenix - Pig ...................................... SKIPPED
[INFO] Phoenix Query Server Client ........................ SKIPPED
[INFO] Phoenix Query Server ............................... SKIPPED
[INFO] Phoenix - Pherf .................................... SKIPPED
[INFO] Phoenix - Spark .................................... SKIPPED
[INFO] Phoenix - Hive ..................................... SKIPPED
[INFO] Phoenix Client ..................................... SKIPPED
[INFO] Phoenix Server ..................................... SKIPPED
[INFO] Phoenix Assembly ................................... SKIPPED
[INFO] Phoenix - Tracing Web Application .................. SKIPPED
[INFO] ------------------------------------------------------------------------
[INFO] BUILD FAILURE
[INFO] ------------------------------------------------------------------------
[INFO] Total time: 01:20 h
[INFO] Finished at: 2017-04-21T02:41:27+00:00
[INFO] Final Memory: 62M/1364M
[INFO] ------------------------------------------------------------------------
[ERROR] Failed to execute goal org.apache.maven.plugins:maven-failsafe-plugin:2.19.1:verify
(ParallelStatsEnabledTest) on project phoenix-core: There was a timeout or other error in
the fork -> [Help 1]
[ERROR] 
[ERROR] To see the full stack trace of the errors, re-run Maven with the -e switch.
[ERROR] Re-run Maven using the -X switch to enable full debug logging.
[ERROR] 
[ERROR] For more information about the errors and possible solutions, please read the following
articles:
[ERROR] [Help 1] http://cwiki.apache.org/confluence/display/MAVEN/MojoExecutionException
[ERROR] 
[ERROR] After correcting the problems, you can resume the build with the command
[ERROR]   mvn <goals> -rf :phoenix-core
Build step 'Invoke top-level Maven targets' marked build as failure
Archiving artifacts
[JIRA] Updating issue PHOENIX-3801
Recording test results

Mime
View raw message