phoenix-commits mailing list archives

Site index · List index
Message view « Date » · « Thread »
Top « Date » · « Thread »
From Apache Jenkins Server <jenk...@builds.apache.org>
Subject Build failed in Jenkins: Phoenix-4.x-HBase-1.1 #374
Date Thu, 06 Apr 2017 20:23:55 GMT
See <https://builds.apache.org/job/Phoenix-4.x-HBase-1.1/374/display/redirect?page=changes>

Changes:

[samarth] PHOENIX-3765 NPE in IndexMaintainer when using old client and 4.10

------------------------------------------
[...truncated 65.71 KB...]
Tests run: 33, Failures: 0, Errors: 0, Skipped: 0, Time elapsed: 61.209 sec - in org.apache.phoenix.end2end.RoundFloorCeilFuncIT
Running org.apache.phoenix.end2end.SortMergeJoinMoreIT
Tests run: 5, Failures: 0, Errors: 0, Skipped: 0, Time elapsed: 23.541 sec - in org.apache.phoenix.end2end.SortMergeJoinMoreIT
Running org.apache.phoenix.end2end.SortOrderIT
Tests run: 124, Failures: 0, Errors: 0, Skipped: 0, Time elapsed: 716.989 sec - in org.apache.phoenix.end2end.AlterTableIT
Running org.apache.phoenix.end2end.SpooledTmpFileDeleteIT
Tests run: 1, Failures: 0, Errors: 0, Skipped: 0, Time elapsed: 2.674 sec - in org.apache.phoenix.end2end.SpooledTmpFileDeleteIT
Running org.apache.phoenix.end2end.SqrtFunctionEnd2EndIT
Tests run: 2, Failures: 0, Errors: 0, Skipped: 0, Time elapsed: 7.154 sec - in org.apache.phoenix.end2end.SqrtFunctionEnd2EndIT
Running org.apache.phoenix.end2end.StatementHintsIT
Tests run: 2, Failures: 0, Errors: 0, Skipped: 0, Time elapsed: 1.294 sec - in org.apache.phoenix.end2end.StatementHintsIT
Running org.apache.phoenix.end2end.StddevIT
Tests run: 75, Failures: 0, Errors: 0, Skipped: 0, Time elapsed: 361.175 sec - in org.apache.phoenix.end2end.OnDuplicateKeyIT
Tests run: 4, Failures: 0, Errors: 0, Skipped: 0, Time elapsed: 8.474 sec - in org.apache.phoenix.end2end.StddevIT
Running org.apache.phoenix.end2end.StoreNullsIT
Tests run: 45, Failures: 0, Errors: 0, Skipped: 0, Time elapsed: 112.431 sec - in org.apache.phoenix.end2end.SortOrderIT
Running org.apache.phoenix.end2end.StringIT
Running org.apache.phoenix.end2end.StoreNullsPropIT
Tests run: 1, Failures: 0, Errors: 0, Skipped: 0, Time elapsed: 1.266 sec - in org.apache.phoenix.end2end.StoreNullsPropIT
Running org.apache.phoenix.end2end.StringToArrayFunctionIT
Tests run: 13, Failures: 0, Errors: 0, Skipped: 0, Time elapsed: 40.86 sec - in org.apache.phoenix.end2end.StringIT
Running org.apache.phoenix.end2end.SubqueryIT
Tests run: 22, Failures: 0, Errors: 0, Skipped: 0, Time elapsed: 43.341 sec - in org.apache.phoenix.end2end.StringToArrayFunctionIT
Running org.apache.phoenix.end2end.SubqueryUsingSortMergeJoinIT
Tests run: 28, Failures: 0, Errors: 0, Skipped: 0, Time elapsed: 520.206 sec - in org.apache.phoenix.end2end.InListIT
Java HotSpot(TM) 64-Bit Server VM warning: INFO: os::commit_memory(0x00000007c7f8f000, 200216576,
0) failed; error='Cannot allocate memory' (errno=12)
#
# There is insufficient memory for the Java Runtime Environment to continue.
# Native memory allocation (malloc) failed to allocate 200216576 bytes for committing reserved
memory.
# An error report file with more information is saved as:
# <https://builds.apache.org/job/Phoenix-4.x-HBase-1.1/ws/phoenix-core/hs_err_pid16263.log>

Results :

Tests run: 1027, Failures: 0, Errors: 0, Skipped: 0

[INFO] 
[INFO] --- maven-failsafe-plugin:2.19.1:integration-test (ClientManagedTimeTests) @ phoenix-core
---

-------------------------------------------------------
 T E S T S
-------------------------------------------------------
Running org.apache.phoenix.end2end.AggregateQueryIT
Running org.apache.phoenix.end2end.ColumnProjectionOptimizationIT
Running org.apache.phoenix.end2end.ArrayIT
Running org.apache.phoenix.end2end.CastAndCoerceIT
Running org.apache.phoenix.end2end.CaseStatementIT
Running org.apache.phoenix.end2end.ClientTimeArithmeticQueryIT
Tests run: 3, Failures: 0, Errors: 0, Skipped: 0, Time elapsed: 27.569 sec - in org.apache.phoenix.end2end.ColumnProjectionOptimizationIT
Running org.apache.phoenix.end2end.CreateSchemaIT
Tests run: 1, Failures: 0, Errors: 0, Skipped: 0, Time elapsed: 0.596 sec - in org.apache.phoenix.end2end.CreateSchemaIT
Running org.apache.phoenix.end2end.CreateTableIT
Tests run: 49, Failures: 0, Errors: 0, Skipped: 0, Time elapsed: 88.789 sec - in org.apache.phoenix.end2end.CastAndCoerceIT
Running org.apache.phoenix.end2end.CustomEntityDataIT
Tests run: 56, Failures: 0, Errors: 0, Skipped: 0, Time elapsed: 88.424 sec - in org.apache.phoenix.end2end.CaseStatementIT
Running org.apache.phoenix.end2end.DerivedTableIT
Tests run: 80, Failures: 0, Errors: 0, Skipped: 0, Time elapsed: 94.792 sec - in org.apache.phoenix.end2end.ArrayIT
Running org.apache.phoenix.end2end.DistinctCountIT
Tests run: 3, Failures: 0, Errors: 0, Skipped: 0, Time elapsed: 5.986 sec - in org.apache.phoenix.end2end.CustomEntityDataIT
Running org.apache.phoenix.end2end.DropSchemaIT
Tests run: 42, Failures: 0, Errors: 0, Skipped: 0, Time elapsed: 104.643 sec - in org.apache.phoenix.end2end.AggregateQueryIT
Running org.apache.phoenix.end2end.ExtendedQueryExecIT
Tests run: 4, Failures: 0, Errors: 0, Skipped: 0, Time elapsed: 6.961 sec - in org.apache.phoenix.end2end.ExtendedQueryExecIT
Tests run: 2, Failures: 0, Errors: 0, Skipped: 0, Time elapsed: 12.321 sec - in org.apache.phoenix.end2end.DropSchemaIT
Running org.apache.phoenix.end2end.FunkyNamesIT
Running org.apache.phoenix.end2end.GroupByIT
Tests run: 18, Failures: 0, Errors: 0, Skipped: 0, Time elapsed: 19.654 sec - in org.apache.phoenix.end2end.DerivedTableIT
Tests run: 10, Failures: 0, Errors: 0, Skipped: 0, Time elapsed: 19.27 sec - in org.apache.phoenix.end2end.DistinctCountIT
Tests run: 3, Failures: 0, Errors: 0, Skipped: 0, Time elapsed: 5.402 sec - in org.apache.phoenix.end2end.FunkyNamesIT
Running org.apache.phoenix.end2end.MutableQueryIT
Running org.apache.phoenix.end2end.NotQueryIT
Running org.apache.phoenix.end2end.NativeHBaseTypesIT
Tests run: 7, Failures: 0, Errors: 0, Skipped: 0, Time elapsed: 5.364 sec - in org.apache.phoenix.end2end.NativeHBaseTypesIT
Running org.apache.phoenix.end2end.PointInTimeQueryIT
Tests run: 245, Failures: 0, Errors: 0, Skipped: 0, Time elapsed: 151.619 sec - in org.apache.phoenix.end2end.ClientTimeArithmeticQueryIT
Tests run: 77, Failures: 0, Errors: 0, Skipped: 0, Time elapsed: 57.539 sec - in org.apache.phoenix.end2end.NotQueryIT
Running org.apache.phoenix.end2end.QueryDatabaseMetaDataIT
Tests run: 17, Failures: 0, Errors: 0, Skipped: 0, Time elapsed: 145.469 sec - in org.apache.phoenix.end2end.CreateTableIT
Tests run: 91, Failures: 0, Errors: 0, Skipped: 0, Time elapsed: 64.741 sec - in org.apache.phoenix.end2end.GroupByIT
Running org.apache.phoenix.end2end.ReadIsolationLevelIT
Running org.apache.phoenix.end2end.QueryIT
Tests run: 2, Failures: 0, Errors: 0, Skipped: 0, Time elapsed: 5.099 sec - in org.apache.phoenix.end2end.ReadIsolationLevelIT
Running org.apache.phoenix.end2end.RowValueConstructorIT
Running org.apache.phoenix.end2end.ProductMetricsIT
Tests run: 7, Failures: 0, Errors: 0, Skipped: 0, Time elapsed: 71.886 sec - in org.apache.phoenix.end2end.PointInTimeQueryIT
Tests run: 61, Failures: 0, Errors: 0, Skipped: 0, Time elapsed: 22.417 sec - in org.apache.phoenix.end2end.ProductMetricsIT
Running org.apache.phoenix.end2end.SequenceBulkAllocationIT
Running org.apache.phoenix.end2end.ScanQueryIT
Tests run: 56, Failures: 0, Errors: 0, Skipped: 0, Time elapsed: 35.895 sec - in org.apache.phoenix.end2end.SequenceBulkAllocationIT
Running org.apache.phoenix.end2end.SequenceIT
Tests run: 112, Failures: 0, Errors: 0, Skipped: 0, Time elapsed: 69.275 sec - in org.apache.phoenix.end2end.ScanQueryIT
Tests run: 112, Failures: 0, Errors: 0, Skipped: 0, Time elapsed: 105.009 sec - in org.apache.phoenix.end2end.QueryIT
Running org.apache.phoenix.end2end.ToNumberFunctionIT
Tests run: 54, Failures: 0, Errors: 0, Skipped: 0, Time elapsed: 46.068 sec - in org.apache.phoenix.end2end.SequenceIT
Tests run: 18, Failures: 0, Errors: 0, Skipped: 0, Time elapsed: 8.541 sec - in org.apache.phoenix.end2end.ToNumberFunctionIT
Tests run: 19, Failures: 0, Errors: 0, Skipped: 0, Time elapsed: 120.976 sec - in org.apache.phoenix.end2end.QueryDatabaseMetaDataIT
Running org.apache.phoenix.end2end.UpsertSelectIT
Tests run: 46, Failures: 0, Errors: 0, Skipped: 0, Time elapsed: 119.945 sec - in org.apache.phoenix.end2end.RowValueConstructorIT
Tests run: 112, Failures: 0, Errors: 0, Skipped: 0, Time elapsed: 190.809 sec - in org.apache.phoenix.end2end.MutableQueryIT
Running org.apache.phoenix.end2end.TopNIT
Running org.apache.phoenix.end2end.TruncateFunctionIT
Tests run: 4, Failures: 0, Errors: 0, Skipped: 0, Time elapsed: 6.3 sec - in org.apache.phoenix.end2end.TopNIT
Running org.apache.phoenix.rpc.UpdateCacheWithScnIT
Tests run: 1, Failures: 0, Errors: 0, Skipped: 0, Time elapsed: 4.792 sec - in org.apache.phoenix.end2end.TruncateFunctionIT
Tests run: 1, Failures: 0, Errors: 0, Skipped: 0, Time elapsed: 5.229 sec - in org.apache.phoenix.rpc.UpdateCacheWithScnIT
Running org.apache.phoenix.end2end.UpsertValuesIT
Running org.apache.phoenix.end2end.VariableLengthPKIT
Running org.apache.phoenix.end2end.salted.SaltedTableIT
Tests run: 8, Failures: 0, Errors: 0, Skipped: 0, Time elapsed: 6.736 sec - in org.apache.phoenix.end2end.salted.SaltedTableIT
Tests run: 50, Failures: 0, Errors: 0, Skipped: 0, Time elapsed: 39.635 sec - in org.apache.phoenix.end2end.VariableLengthPKIT
Tests run: 22, Failures: 0, Errors: 0, Skipped: 0, Time elapsed: 124.838 sec - in org.apache.phoenix.end2end.UpsertSelectIT
Tests run: 25, Failures: 0, Errors: 0, Skipped: 0, Time elapsed: 106.356 sec - in org.apache.phoenix.end2end.UpsertValuesIT

Results :

Tests run: 1418, Failures: 0, Errors: 0, Skipped: 0

[INFO] 
[INFO] --- maven-failsafe-plugin:2.19.1:integration-test (HBaseManagedTimeTests) @ phoenix-core
---

-------------------------------------------------------
 T E S T S
-------------------------------------------------------

Results :

Tests run: 0, Failures: 0, Errors: 0, Skipped: 0

[INFO] 
[INFO] --- maven-failsafe-plugin:2.19.1:integration-test (NeedTheirOwnClusterTests) @ phoenix-core
---

-------------------------------------------------------
 T E S T S
-------------------------------------------------------
Running org.apache.hadoop.hbase.regionserver.wal.WALReplayWithIndexWritesAndCompressedWALIT
Running org.apache.phoenix.end2end.ConnectionUtilIT
Tests run: 1, Failures: 0, Errors: 0, Skipped: 0, Time elapsed: 39.09 sec - in org.apache.hadoop.hbase.regionserver.wal.WALReplayWithIndexWritesAndCompressedWALIT
Running org.apache.phoenix.end2end.CountDistinctCompressionIT
Running org.apache.phoenix.end2end.AutomaticRebuildIT
Running org.apache.phoenix.end2end.ContextClassloaderIT
Running org.apache.phoenix.end2end.CsvBulkLoadToolIT
Tests run: 3, Failures: 0, Errors: 0, Skipped: 0, Time elapsed: 5.639 sec - in org.apache.phoenix.end2end.ContextClassloaderIT
Tests run: 1, Failures: 0, Errors: 0, Skipped: 0, Time elapsed: 11.734 sec - in org.apache.phoenix.end2end.CountDistinctCompressionIT
Tests run: 1, Failures: 0, Errors: 0, Skipped: 0, Time elapsed: 28.387 sec - in org.apache.phoenix.end2end.ConnectionUtilIT
Running org.apache.phoenix.end2end.FlappingLocalIndexIT
Running org.apache.phoenix.end2end.IndexToolForPartialBuildIT
Running org.apache.phoenix.end2end.IndexExtendedIT
Running org.apache.phoenix.end2end.IndexToolForPartialBuildWithNamespaceEnabledIT
Tests run: 11, Failures: 0, Errors: 0, Skipped: 0, Time elapsed: 70.275 sec - in org.apache.phoenix.end2end.CsvBulkLoadToolIT
Tests run: 2, Failures: 0, Errors: 0, Skipped: 0, Time elapsed: 29.402 sec - in org.apache.phoenix.end2end.IndexToolForPartialBuildIT
Tests run: 2, Failures: 0, Errors: 0, Skipped: 0, Time elapsed: 29.81 sec - in org.apache.phoenix.end2end.IndexToolForPartialBuildWithNamespaceEnabledIT
Running org.apache.phoenix.end2end.QueryTimeoutIT
Running org.apache.phoenix.end2end.QueryWithLimitIT
Running org.apache.phoenix.end2end.RegexBulkLoadToolIT
Tests run: 8, Failures: 0, Errors: 0, Skipped: 0, Time elapsed: 79.75 sec - in org.apache.phoenix.end2end.FlappingLocalIndexIT
Tests run: 2, Failures: 0, Errors: 0, Skipped: 0, Time elapsed: 10.594 sec - in org.apache.phoenix.end2end.QueryTimeoutIT
Tests run: 2, Failures: 0, Errors: 0, Skipped: 0, Time elapsed: 10.469 sec - in org.apache.phoenix.end2end.QueryWithLimitIT
Tests run: 2, Failures: 0, Errors: 0, Skipped: 0, Time elapsed: 160.303 sec - in org.apache.phoenix.end2end.AutomaticRebuildIT
Running org.apache.phoenix.end2end.RenewLeaseIT
Running org.apache.phoenix.end2end.StatsCollectorIT
Running org.apache.phoenix.end2end.SpillableGroupByIT
Tests run: 2, Failures: 0, Errors: 0, Skipped: 0, Time elapsed: 9.72 sec - in org.apache.phoenix.end2end.SpillableGroupByIT
Tests run: 10, Failures: 0, Errors: 0, Skipped: 0, Time elapsed: 60.883 sec - in org.apache.phoenix.end2end.RegexBulkLoadToolIT
Tests run: 1, Failures: 0, Errors: 0, Skipped: 0, Time elapsed: 27.724 sec - in org.apache.phoenix.end2end.RenewLeaseIT
Running org.apache.phoenix.end2end.SysTableNamespaceMappedStatsCollectorIT
Running org.apache.phoenix.end2end.UserDefinedFunctionsIT
Running org.apache.phoenix.end2end.index.ImmutableIndexIT
Running org.apache.phoenix.end2end.index.LocalIndexIT
Tests run: 14, Failures: 0, Errors: 0, Skipped: 0, Time elapsed: 46.924 sec - in org.apache.phoenix.end2end.UserDefinedFunctionsIT
Tests run: 80, Failures: 0, Errors: 0, Skipped: 0, Time elapsed: 241.912 sec - in org.apache.phoenix.end2end.IndexExtendedIT
Running org.apache.phoenix.end2end.index.MutableIndexFailureIT
Running org.apache.phoenix.end2end.index.MutableIndexReplicationIT
Tests run: 1, Failures: 0, Errors: 0, Skipped: 0, Time elapsed: 26.075 sec - in org.apache.phoenix.end2end.index.MutableIndexReplicationIT
Running org.apache.phoenix.end2end.index.ReadOnlyIndexFailureIT
Tests run: 120, Failures: 0, Errors: 0, Skipped: 24, Time elapsed: 222.18 sec - in org.apache.phoenix.end2end.StatsCollectorIT
Tests run: 120, Failures: 0, Errors: 0, Skipped: 24, Time elapsed: 217.312 sec - in org.apache.phoenix.end2end.SysTableNamespaceMappedStatsCollectorIT
Tests run: 2, Failures: 0, Errors: 0, Skipped: 0, Time elapsed: 32.047 sec - in org.apache.phoenix.end2end.index.ReadOnlyIndexFailureIT
Running org.apache.phoenix.hbase.index.FailForUnsupportedHBaseVersionsIT
Running org.apache.phoenix.end2end.index.txn.TxWriteFailureIT
Tests run: 2, Failures: 0, Errors: 0, Skipped: 0, Time elapsed: 18.854 sec - in org.apache.phoenix.hbase.index.FailForUnsupportedHBaseVersionsIT
Running org.apache.phoenix.hbase.index.covered.EndToEndCoveredColumnsIndexBuilderIT
Running org.apache.phoenix.execute.PartialCommitIT
Tests run: 28, Failures: 0, Errors: 0, Skipped: 0, Time elapsed: 231.092 sec - in org.apache.phoenix.end2end.index.LocalIndexIT
Tests run: 2, Failures: 0, Errors: 0, Skipped: 0, Time elapsed: 18.288 sec - in org.apache.phoenix.hbase.index.covered.EndToEndCoveredColumnsIndexBuilderIT
Tests run: 12, Failures: 0, Errors: 0, Skipped: 0, Time elapsed: 9.795 sec - in org.apache.phoenix.execute.PartialCommitIT
Running org.apache.phoenix.hbase.index.covered.example.FailWithoutRetriesIT
Tests run: 8, Failures: 0, Errors: 0, Skipped: 0, Time elapsed: 57.547 sec - in org.apache.phoenix.end2end.index.txn.TxWriteFailureIT
Tests run: 1, Failures: 0, Errors: 0, Skipped: 0, Time elapsed: 8.29 sec - in org.apache.phoenix.hbase.index.covered.example.FailWithoutRetriesIT
Running org.apache.phoenix.hbase.index.covered.example.EndToEndCoveredIndexingIT
Running org.apache.phoenix.hbase.index.covered.example.EndtoEndIndexingWithCompressionIT
Tests run: 24, Failures: 0, Errors: 0, Skipped: 0, Time elapsed: 281.454 sec - in org.apache.phoenix.end2end.index.ImmutableIndexIT
Running org.apache.phoenix.iterate.RoundRobinResultIteratorWithStatsIT
Tests run: 8, Failures: 0, Errors: 0, Skipped: 0, Time elapsed: 212.252 sec - in org.apache.phoenix.end2end.index.MutableIndexFailureIT
Running org.apache.phoenix.iterate.ScannerLeaseRenewalIT
Tests run: 1, Failures: 0, Errors: 0, Skipped: 0, Time elapsed: 11.494 sec - in org.apache.phoenix.iterate.RoundRobinResultIteratorWithStatsIT
Running org.apache.phoenix.monitoring.PhoenixMetricsIT
Running org.apache.phoenix.rpc.PhoenixClientRpcIT
Running org.apache.phoenix.rpc.PhoenixServerRpcIT
Tests run: 2, Failures: 0, Errors: 0, Skipped: 0, Time elapsed: 11.767 sec - in org.apache.phoenix.rpc.PhoenixClientRpcIT
Tests run: 1, Failures: 0, Errors: 0, Skipped: 0, Time elapsed: 20.149 sec - in org.apache.phoenix.rpc.PhoenixServerRpcIT
Tests run: 21, Failures: 0, Errors: 0, Skipped: 0, Time elapsed: 53.431 sec - in org.apache.phoenix.monitoring.PhoenixMetricsIT
Tests run: 11, Failures: 0, Errors: 0, Skipped: 0, Time elapsed: 119.494 sec - in org.apache.phoenix.hbase.index.covered.example.EndToEndCoveredIndexingIT
Tests run: 11, Failures: 0, Errors: 0, Skipped: 0, Time elapsed: 120.257 sec - in org.apache.phoenix.hbase.index.covered.example.EndtoEndIndexingWithCompressionIT
Tests run: 2, Failures: 0, Errors: 0, Skipped: 0, Time elapsed: 170.64 sec - in org.apache.phoenix.iterate.ScannerLeaseRenewalIT

Results :

Tests run: 519, Failures: 0, Errors: 0, Skipped: 48

[INFO] 
[INFO] --- maven-failsafe-plugin:2.19.1:verify (ParallelStatsEnabledTest) @ phoenix-core ---
[INFO] ------------------------------------------------------------------------
[INFO] Reactor Summary:
[INFO] 
[INFO] Apache Phoenix ..................................... SUCCESS [  3.749 s]
[INFO] Phoenix Core ....................................... FAILURE [40:44 min]
[INFO] Phoenix - Flume .................................... SKIPPED
[INFO] Phoenix - Kafka .................................... SKIPPED
[INFO] Phoenix - Pig ...................................... SKIPPED
[INFO] Phoenix Query Server Client ........................ SKIPPED
[INFO] Phoenix Query Server ............................... SKIPPED
[INFO] Phoenix - Pherf .................................... SKIPPED
[INFO] Phoenix - Spark .................................... SKIPPED
[INFO] Phoenix - Hive ..................................... SKIPPED
[INFO] Phoenix Client ..................................... SKIPPED
[INFO] Phoenix Server ..................................... SKIPPED
[INFO] Phoenix Assembly ................................... SKIPPED
[INFO] Phoenix - Tracing Web Application .................. SKIPPED
[INFO] ------------------------------------------------------------------------
[INFO] BUILD FAILURE
[INFO] ------------------------------------------------------------------------
[INFO] Total time: 40:51 min
[INFO] Finished at: 2017-04-06T20:16:23+00:00
[INFO] Final Memory: 77M/997M
[INFO] ------------------------------------------------------------------------
[ERROR] Failed to execute goal org.apache.maven.plugins:maven-failsafe-plugin:2.19.1:verify
(ParallelStatsEnabledTest) on project phoenix-core: There was a timeout or other error in
the fork -> [Help 1]
[ERROR] 
[ERROR] To see the full stack trace of the errors, re-run Maven with the -e switch.
[ERROR] Re-run Maven using the -X switch to enable full debug logging.
[ERROR] 
[ERROR] For more information about the errors and possible solutions, please read the following
articles:
[ERROR] [Help 1] http://cwiki.apache.org/confluence/display/MAVEN/MojoExecutionException
[ERROR] 
[ERROR] After correcting the problems, you can resume the build with the command
[ERROR]   mvn <goals> -rf :phoenix-core
Build step 'Invoke top-level Maven targets' marked build as failure
Archiving artifacts
Compressed 914.51 MB of artifacts by 24.8% relative to #372
Recording test results

Mime
View raw message