phoenix-commits mailing list archives

Site index · List index
Message view « Date » · « Thread »
Top « Date » · « Thread »
From Apache Jenkins Server <jenk...@builds.apache.org>
Subject Build failed in Jenkins: Phoenix | 4.x-HBase-0.98 #1488
Date Thu, 20 Apr 2017 02:01:07 GMT
See <https://builds.apache.org/job/Phoenix-4.x-HBase-0.98/1488/display/redirect?page=changes>

Changes:

[larsh] Apply Local Indexes batch updates only once.

------------------------------------------
[...truncated 71.76 KB...]
Running org.apache.phoenix.end2end.index.txn.MutableRollbackIT
Tests run: 8, Failures: 0, Errors: 0, Skipped: 0, Time elapsed: 33.736 sec - in org.apache.phoenix.end2end.index.ViewIndexIT
Running org.apache.phoenix.end2end.index.txn.RollbackIT
Tests run: 8, Failures: 0, Errors: 0, Skipped: 0, Time elapsed: 38.981 sec - in org.apache.phoenix.end2end.index.txn.RollbackIT
Running org.apache.phoenix.end2end.salted.SaltedTableUpsertSelectIT
Tests run: 6, Failures: 0, Errors: 0, Skipped: 0, Time elapsed: 47.127 sec - in org.apache.phoenix.end2end.index.txn.MutableRollbackIT
Running org.apache.phoenix.end2end.salted.SaltedTableVarLengthRowKeyIT
Tests run: 1, Failures: 0, Errors: 0, Skipped: 0, Time elapsed: 1.304 sec - in org.apache.phoenix.end2end.salted.SaltedTableVarLengthRowKeyIT
Running org.apache.phoenix.iterate.PhoenixQueryTimeoutIT
Tests run: 2, Failures: 0, Errors: 0, Skipped: 0, Time elapsed: 2.819 sec - in org.apache.phoenix.iterate.PhoenixQueryTimeoutIT
Running org.apache.phoenix.iterate.RoundRobinResultIteratorIT
Tests run: 6, Failures: 0, Errors: 0, Skipped: 0, Time elapsed: 15.13 sec - in org.apache.phoenix.end2end.salted.SaltedTableUpsertSelectIT
Running org.apache.phoenix.rpc.UpdateCacheIT
Tests run: 7, Failures: 0, Errors: 0, Skipped: 0, Time elapsed: 18.903 sec - in org.apache.phoenix.rpc.UpdateCacheIT
Running org.apache.phoenix.trace.PhoenixTableMetricsWriterIT
Tests run: 2, Failures: 0, Errors: 0, Skipped: 0, Time elapsed: 2.081 sec - in org.apache.phoenix.trace.PhoenixTableMetricsWriterIT
Running org.apache.phoenix.trace.PhoenixTraceReaderIT
Tests run: 2, Failures: 0, Errors: 0, Skipped: 0, Time elapsed: 2.101 sec - in org.apache.phoenix.trace.PhoenixTraceReaderIT
Running org.apache.phoenix.trace.PhoenixTracingEndToEndIT
Tests run: 9, Failures: 0, Errors: 0, Skipped: 0, Time elapsed: 37.538 sec - in org.apache.phoenix.iterate.RoundRobinResultIteratorIT
Running org.apache.phoenix.tx.FlappingTransactionIT
Tests run: 4, Failures: 0, Errors: 0, Skipped: 0, Time elapsed: 3.423 sec - in org.apache.phoenix.tx.FlappingTransactionIT
Running org.apache.phoenix.tx.ParameterizedTransactionIT
Tests run: 6, Failures: 0, Errors: 0, Skipped: 0, Time elapsed: 85.505 sec - in org.apache.phoenix.trace.PhoenixTracingEndToEndIT
Running org.apache.phoenix.tx.TransactionIT
Tests run: 7, Failures: 0, Errors: 0, Skipped: 0, Time elapsed: 32.324 sec - in org.apache.phoenix.tx.TransactionIT
Running org.apache.phoenix.tx.TxCheckpointIT
Tests run: 52, Failures: 0, Errors: 0, Skipped: 4, Time elapsed: 133.86 sec - in org.apache.phoenix.tx.ParameterizedTransactionIT
Tests run: 40, Failures: 0, Errors: 0, Skipped: 0, Time elapsed: 208.316 sec - in org.apache.phoenix.tx.TxCheckpointIT
Tests run: 80, Failures: 0, Errors: 0, Skipped: 0, Time elapsed: 906.833 sec - in org.apache.phoenix.end2end.index.MutableIndexIT
Tests run: 304, Failures: 0, Errors: 0, Skipped: 0, Time elapsed: 1,409.545 sec - in org.apache.phoenix.end2end.index.IndexIT

Results :

Tests run: 2040, Failures: 0, Errors: 0, Skipped: 4

[INFO] 
[INFO] --- maven-failsafe-plugin:2.19.1:integration-test (ClientManagedTimeTests) @ phoenix-core
---

-------------------------------------------------------
 T E S T S
-------------------------------------------------------
Running org.apache.phoenix.end2end.ArrayIT
Running org.apache.phoenix.end2end.AggregateQueryIT
Running org.apache.phoenix.end2end.CaseStatementIT
Running org.apache.phoenix.end2end.CastAndCoerceIT
Running org.apache.phoenix.end2end.ClientTimeArithmeticQueryIT
Tests run: 80, Failures: 0, Errors: 0, Skipped: 0, Time elapsed: 57.701 sec - in org.apache.phoenix.end2end.ArrayIT
Running org.apache.phoenix.end2end.ColumnProjectionOptimizationIT
Tests run: 49, Failures: 0, Errors: 0, Skipped: 0, Time elapsed: 56.881 sec - in org.apache.phoenix.end2end.CastAndCoerceIT
Running org.apache.phoenix.end2end.CreateSchemaIT
Tests run: 1, Failures: 0, Errors: 0, Skipped: 0, Time elapsed: 0.3 sec - in org.apache.phoenix.end2end.CreateSchemaIT
Running org.apache.phoenix.end2end.CreateTableIT
Tests run: 56, Failures: 0, Errors: 0, Skipped: 0, Time elapsed: 59.277 sec - in org.apache.phoenix.end2end.CaseStatementIT
Running org.apache.phoenix.end2end.CustomEntityDataIT
Tests run: 3, Failures: 0, Errors: 0, Skipped: 0, Time elapsed: 3.739 sec - in org.apache.phoenix.end2end.CustomEntityDataIT
Running org.apache.phoenix.end2end.DerivedTableIT
Tests run: 3, Failures: 0, Errors: 0, Skipped: 0, Time elapsed: 17.927 sec - in org.apache.phoenix.end2end.ColumnProjectionOptimizationIT
Running org.apache.phoenix.end2end.DistinctCountIT
Tests run: 42, Failures: 0, Errors: 0, Skipped: 0, Time elapsed: 75.597 sec - in org.apache.phoenix.end2end.AggregateQueryIT
Running org.apache.phoenix.end2end.DropSchemaIT
Tests run: 18, Failures: 0, Errors: 0, Skipped: 0, Time elapsed: 12.858 sec - in org.apache.phoenix.end2end.DerivedTableIT
Running org.apache.phoenix.end2end.ExtendedQueryExecIT
Tests run: 2, Failures: 0, Errors: 0, Skipped: 0, Time elapsed: 5.524 sec - in org.apache.phoenix.end2end.DropSchemaIT
Running org.apache.phoenix.end2end.FunkyNamesIT
Tests run: 4, Failures: 0, Errors: 0, Skipped: 0, Time elapsed: 3.64 sec - in org.apache.phoenix.end2end.ExtendedQueryExecIT
Running org.apache.phoenix.end2end.GroupByIT
Tests run: 10, Failures: 0, Errors: 0, Skipped: 0, Time elapsed: 9.939 sec - in org.apache.phoenix.end2end.DistinctCountIT
Tests run: 3, Failures: 0, Errors: 0, Skipped: 0, Time elapsed: 3.651 sec - in org.apache.phoenix.end2end.FunkyNamesIT
Running org.apache.phoenix.end2end.MutableQueryIT
Running org.apache.phoenix.end2end.NativeHBaseTypesIT
Tests run: 7, Failures: 0, Errors: 0, Skipped: 0, Time elapsed: 2.392 sec - in org.apache.phoenix.end2end.NativeHBaseTypesIT
Running org.apache.phoenix.end2end.NotQueryIT
Tests run: 245, Failures: 0, Errors: 0, Skipped: 0, Time elapsed: 131.555 sec - in org.apache.phoenix.end2end.ClientTimeArithmeticQueryIT
Tests run: 91, Failures: 0, Errors: 0, Skipped: 0, Time elapsed: 51.984 sec - in org.apache.phoenix.end2end.GroupByIT
Tests run: 77, Failures: 0, Errors: 0, Skipped: 0, Time elapsed: 39.977 sec - in org.apache.phoenix.end2end.NotQueryIT
Tests run: 17, Failures: 0, Errors: 0, Skipped: 0, Time elapsed: 76.576 sec - in org.apache.phoenix.end2end.CreateTableIT
Running org.apache.phoenix.end2end.ProductMetricsIT
Running org.apache.phoenix.end2end.PointInTimeQueryIT
Tests run: 7, Failures: 0, Errors: 0, Skipped: 0, Time elapsed: 19.886 sec - in org.apache.phoenix.end2end.PointInTimeQueryIT
Running org.apache.phoenix.end2end.ReadIsolationLevelIT
Tests run: 2, Failures: 0, Errors: 0, Skipped: 0, Time elapsed: 3.553 sec - in org.apache.phoenix.end2end.ReadIsolationLevelIT
Running org.apache.phoenix.end2end.RowValueConstructorIT
Tests run: 61, Failures: 0, Errors: 0, Skipped: 0, Time elapsed: 26.306 sec - in org.apache.phoenix.end2end.ProductMetricsIT
Running org.apache.phoenix.end2end.QueryIT
Running org.apache.phoenix.end2end.QueryDatabaseMetaDataIT
Running org.apache.phoenix.end2end.ScanQueryIT
Tests run: 112, Failures: 0, Errors: 0, Skipped: 0, Time elapsed: 47.152 sec - in org.apache.phoenix.end2end.QueryIT
Running org.apache.phoenix.end2end.SequenceBulkAllocationIT
Tests run: 112, Failures: 0, Errors: 0, Skipped: 0, Time elapsed: 125.708 sec - in org.apache.phoenix.end2end.MutableQueryIT
Tests run: 112, Failures: 0, Errors: 0, Skipped: 0, Time elapsed: 54.215 sec - in org.apache.phoenix.end2end.ScanQueryIT
Tests run: 46, Failures: 0, Errors: 0, Skipped: 0, Time elapsed: 68.473 sec - in org.apache.phoenix.end2end.RowValueConstructorIT
Tests run: 56, Failures: 0, Errors: 0, Skipped: 0, Time elapsed: 23.378 sec - in org.apache.phoenix.end2end.SequenceBulkAllocationIT
Tests run: 19, Failures: 0, Errors: 0, Skipped: 0, Time elapsed: 78.167 sec - in org.apache.phoenix.end2end.QueryDatabaseMetaDataIT
Running org.apache.phoenix.end2end.UpsertSelectIT
Running org.apache.phoenix.end2end.SequenceIT
Running org.apache.phoenix.end2end.ToNumberFunctionIT
Tests run: 18, Failures: 0, Errors: 0, Skipped: 0, Time elapsed: 6.836 sec - in org.apache.phoenix.end2end.ToNumberFunctionIT
Running org.apache.phoenix.end2end.UpsertValuesIT
Running org.apache.phoenix.end2end.TopNIT
Tests run: 4, Failures: 0, Errors: 0, Skipped: 0, Time elapsed: 3.835 sec - in org.apache.phoenix.end2end.TopNIT
Running org.apache.phoenix.end2end.TruncateFunctionIT
Running org.apache.phoenix.end2end.VariableLengthPKIT
Tests run: 1, Failures: 0, Errors: 0, Skipped: 0, Time elapsed: 2.908 sec - in org.apache.phoenix.end2end.TruncateFunctionIT
Running org.apache.phoenix.end2end.salted.SaltedTableIT
Tests run: 8, Failures: 0, Errors: 0, Skipped: 0, Time elapsed: 3.731 sec - in org.apache.phoenix.end2end.salted.SaltedTableIT
Running org.apache.phoenix.rpc.UpdateCacheWithScnIT
Tests run: 54, Failures: 0, Errors: 0, Skipped: 0, Time elapsed: 25.848 sec - in org.apache.phoenix.end2end.SequenceIT
Tests run: 1, Failures: 0, Errors: 0, Skipped: 0, Time elapsed: 3.47 sec - in org.apache.phoenix.rpc.UpdateCacheWithScnIT
Tests run: 50, Failures: 0, Errors: 0, Skipped: 0, Time elapsed: 36.658 sec - in org.apache.phoenix.end2end.VariableLengthPKIT
Tests run: 22, Failures: 0, Errors: 0, Skipped: 0, Time elapsed: 69.026 sec - in org.apache.phoenix.end2end.UpsertSelectIT
Tests run: 25, Failures: 0, Errors: 0, Skipped: 0, Time elapsed: 60.503 sec - in org.apache.phoenix.end2end.UpsertValuesIT

Results :

Tests run: 1418, Failures: 0, Errors: 0, Skipped: 0

[INFO] 
[INFO] --- maven-failsafe-plugin:2.19.1:integration-test (HBaseManagedTimeTests) @ phoenix-core
---

-------------------------------------------------------
 T E S T S
-------------------------------------------------------

Results :

Tests run: 0, Failures: 0, Errors: 0, Skipped: 0

[INFO] 
[INFO] --- maven-failsafe-plugin:2.19.1:integration-test (NeedTheirOwnClusterTests) @ phoenix-core
---

-------------------------------------------------------
 T E S T S
-------------------------------------------------------
Running org.apache.hadoop.hbase.regionserver.wal.WALReplayWithIndexWritesAndCompressedWALIT
Tests run: 1, Failures: 0, Errors: 0, Skipped: 0, Time elapsed: 17.799 sec - in org.apache.hadoop.hbase.regionserver.wal.WALReplayWithIndexWritesAndCompressedWALIT
Running org.apache.phoenix.end2end.ConnectionUtilIT
Running org.apache.phoenix.end2end.AutomaticRebuildIT
Running org.apache.phoenix.end2end.ContextClassloaderIT
Running org.apache.phoenix.end2end.CountDistinctCompressionIT
Tests run: 1, Failures: 0, Errors: 0, Skipped: 0, Time elapsed: 20.306 sec - in org.apache.phoenix.end2end.ConnectionUtilIT
Tests run: 3, Failures: 0, Errors: 0, Skipped: 0, Time elapsed: 10.957 sec - in org.apache.phoenix.end2end.ContextClassloaderIT
Tests run: 1, Failures: 0, Errors: 0, Skipped: 0, Time elapsed: 12.35 sec - in org.apache.phoenix.end2end.CountDistinctCompressionIT
Running org.apache.phoenix.end2end.CsvBulkLoadToolIT
Running org.apache.phoenix.end2end.FlappingLocalIndexIT
Running org.apache.phoenix.end2end.IndexToolForPartialBuildIT
Running org.apache.phoenix.end2end.IndexExtendedIT
Tests run: 2, Failures: 0, Errors: 0, Skipped: 0, Time elapsed: 22.252 sec - in org.apache.phoenix.end2end.IndexToolForPartialBuildIT
Tests run: 11, Failures: 0, Errors: 0, Skipped: 0, Time elapsed: 64.645 sec - in org.apache.phoenix.end2end.CsvBulkLoadToolIT
Tests run: 40, Failures: 0, Errors: 0, Skipped: 16, Time elapsed: 43.035 sec - in org.apache.phoenix.end2end.IndexExtendedIT
Running org.apache.phoenix.end2end.IndexToolForPartialBuildWithNamespaceEnabledIT
Tests run: 8, Failures: 0, Errors: 0, Skipped: 0, Time elapsed: 64.926 sec - in org.apache.phoenix.end2end.FlappingLocalIndexIT
Tests run: 2, Failures: 0, Errors: 0, Skipped: 0, Time elapsed: 21.397 sec - in org.apache.phoenix.end2end.IndexToolForPartialBuildWithNamespaceEnabledIT
Running org.apache.phoenix.end2end.QueryTimeoutIT
Running org.apache.phoenix.end2end.QueryWithLimitIT
Running org.apache.phoenix.end2end.RegexBulkLoadToolIT
Tests run: 2, Failures: 0, Errors: 0, Skipped: 0, Time elapsed: 11.618 sec - in org.apache.phoenix.end2end.QueryTimeoutIT
Tests run: 2, Failures: 0, Errors: 0, Skipped: 0, Time elapsed: 11.702 sec - in org.apache.phoenix.end2end.QueryWithLimitIT
Tests run: 2, Failures: 0, Errors: 0, Skipped: 0, Time elapsed: 153.299 sec - in org.apache.phoenix.end2end.AutomaticRebuildIT
Running org.apache.phoenix.end2end.RenewLeaseIT
Running org.apache.phoenix.end2end.SpillableGroupByIT
Running org.apache.phoenix.end2end.StatsCollectorIT
Tests run: 1, Failures: 0, Errors: 0, Skipped: 0, Time elapsed: 32.225 sec - in org.apache.phoenix.end2end.RenewLeaseIT
Running org.apache.phoenix.end2end.SysTableNamespaceMappedStatsCollectorIT
Tests run: 2, Failures: 0, Errors: 0, Skipped: 0, Time elapsed: 13.067 sec - in org.apache.phoenix.end2end.SpillableGroupByIT
Tests run: 10, Failures: 0, Errors: 0, Skipped: 0, Time elapsed: 55.841 sec - in org.apache.phoenix.end2end.RegexBulkLoadToolIT
Running org.apache.phoenix.end2end.index.ImmutableIndexIT
Running org.apache.phoenix.end2end.UserDefinedFunctionsIT
Running org.apache.phoenix.end2end.index.LocalIndexIT
Tests run: 14, Failures: 0, Errors: 0, Skipped: 0, Time elapsed: 30.999 sec - in org.apache.phoenix.end2end.UserDefinedFunctionsIT
Running org.apache.phoenix.end2end.index.MutableIndexFailureIT
Tests run: 120, Failures: 0, Errors: 0, Skipped: 24, Time elapsed: 181.447 sec - in org.apache.phoenix.end2end.StatsCollectorIT
Tests run: 120, Failures: 0, Errors: 0, Skipped: 24, Time elapsed: 179.983 sec - in org.apache.phoenix.end2end.SysTableNamespaceMappedStatsCollectorIT
Running org.apache.phoenix.end2end.index.MutableIndexReplicationIT
Running org.apache.phoenix.end2end.index.ReadOnlyIndexFailureIT
Tests run: 1, Failures: 0, Errors: 0, Skipped: 0, Time elapsed: 16.895 sec - in org.apache.phoenix.end2end.index.MutableIndexReplicationIT
Tests run: 2, Failures: 0, Errors: 0, Skipped: 0, Time elapsed: 25.87 sec - in org.apache.phoenix.end2end.index.ReadOnlyIndexFailureIT
Running org.apache.phoenix.end2end.index.txn.TxWriteFailureIT
Tests run: 30, Failures: 0, Errors: 0, Skipped: 0, Time elapsed: 207.174 sec - in org.apache.phoenix.end2end.index.LocalIndexIT
Running org.apache.phoenix.hbase.index.FailForUnsupportedHBaseVersionsIT
Running org.apache.phoenix.execute.PartialCommitIT
Tests run: 2, Failures: 0, Errors: 0, Skipped: 0, Time elapsed: 18.364 sec - in org.apache.phoenix.hbase.index.FailForUnsupportedHBaseVersionsIT
Tests run: 12, Failures: 0, Errors: 0, Skipped: 0, Time elapsed: 4.57 sec - in org.apache.phoenix.execute.PartialCommitIT
Running org.apache.phoenix.hbase.index.covered.EndToEndCoveredColumnsIndexBuilderIT
Tests run: 2, Failures: 0, Errors: 0, Skipped: 0, Time elapsed: 7.979 sec - in org.apache.phoenix.hbase.index.covered.EndToEndCoveredColumnsIndexBuilderIT
Running org.apache.phoenix.hbase.index.covered.example.EndToEndCoveredIndexingIT
Tests run: 8, Failures: 0, Errors: 0, Skipped: 0, Time elapsed: 51.541 sec - in org.apache.phoenix.end2end.index.txn.TxWriteFailureIT
Tests run: 24, Failures: 0, Errors: 0, Skipped: 0, Time elapsed: 271.195 sec - in org.apache.phoenix.end2end.index.ImmutableIndexIT
Running org.apache.phoenix.hbase.index.covered.example.FailWithoutRetriesIT
Running org.apache.phoenix.hbase.index.covered.example.EndtoEndIndexingWithCompressionIT
Tests run: 1, Failures: 0, Errors: 0, Skipped: 0, Time elapsed: 8.284 sec - in org.apache.phoenix.hbase.index.covered.example.FailWithoutRetriesIT
Running org.apache.phoenix.iterate.RoundRobinResultIteratorWithStatsIT
Tests run: 8, Failures: 0, Errors: 0, Skipped: 0, Time elapsed: 247.682 sec - in org.apache.phoenix.end2end.index.MutableIndexFailureIT
Running org.apache.phoenix.iterate.ScannerLeaseRenewalIT
Tests run: 1, Failures: 0, Errors: 0, Skipped: 0, Time elapsed: 12.033 sec - in org.apache.phoenix.iterate.RoundRobinResultIteratorWithStatsIT
Tests run: 11, Failures: 0, Errors: 0, Skipped: 0, Time elapsed: 62.808 sec - in org.apache.phoenix.hbase.index.covered.example.EndToEndCoveredIndexingIT
Running org.apache.phoenix.monitoring.PhoenixMetricsIT
Running org.apache.phoenix.rpc.PhoenixClientRpcIT
Tests run: 2, Failures: 0, Errors: 0, Skipped: 0, Time elapsed: 5.236 sec - in org.apache.phoenix.rpc.PhoenixClientRpcIT
Tests run: 11, Failures: 0, Errors: 0, Skipped: 0, Time elapsed: 62.071 sec - in org.apache.phoenix.hbase.index.covered.example.EndtoEndIndexingWithCompressionIT
Running org.apache.phoenix.rpc.PhoenixServerRpcIT
Tests run: 1, Failures: 0, Errors: 0, Skipped: 0, Time elapsed: 15.417 sec - in org.apache.phoenix.rpc.PhoenixServerRpcIT
Tests run: 21, Failures: 0, Errors: 0, Skipped: 0, Time elapsed: 48.048 sec - in org.apache.phoenix.monitoring.PhoenixMetricsIT
Tests run: 2, Failures: 0, Errors: 0, Skipped: 0, Time elapsed: 162.941 sec - in org.apache.phoenix.iterate.ScannerLeaseRenewalIT

Results :

Tests run: 481, Failures: 0, Errors: 0, Skipped: 64

[INFO] 
[INFO] --- maven-failsafe-plugin:2.19.1:verify (ParallelStatsEnabledTest) @ phoenix-core ---
[INFO] ------------------------------------------------------------------------
[INFO] Reactor Summary:
[INFO] 
[INFO] Apache Phoenix ..................................... SUCCESS [  2.642 s]
[INFO] Phoenix Core ....................................... FAILURE [  01:08 h]
[INFO] Phoenix - Flume .................................... SKIPPED
[INFO] Phoenix - Kafka .................................... SKIPPED
[INFO] Phoenix - Pig ...................................... SKIPPED
[INFO] Phoenix Query Server Client ........................ SKIPPED
[INFO] Phoenix Query Server ............................... SKIPPED
[INFO] Phoenix - Pherf .................................... SKIPPED
[INFO] Phoenix - Spark .................................... SKIPPED
[INFO] Phoenix - Hive ..................................... SKIPPED
[INFO] Phoenix Client ..................................... SKIPPED
[INFO] Phoenix Server ..................................... SKIPPED
[INFO] Phoenix Assembly ................................... SKIPPED
[INFO] Phoenix - Tracing Web Application .................. SKIPPED
[INFO] ------------------------------------------------------------------------
[INFO] BUILD FAILURE
[INFO] ------------------------------------------------------------------------
[INFO] Total time: 01:08 h
[INFO] Finished at: 2017-04-20T01:54:28+00:00
[INFO] Final Memory: 60M/1198M
[INFO] ------------------------------------------------------------------------
[ERROR] Failed to execute goal org.apache.maven.plugins:maven-failsafe-plugin:2.19.1:verify
(ParallelStatsEnabledTest) on project phoenix-core: There was a timeout or other error in
the fork -> [Help 1]
[ERROR] 
[ERROR] To see the full stack trace of the errors, re-run Maven with the -e switch.
[ERROR] Re-run Maven using the -X switch to enable full debug logging.
[ERROR] 
[ERROR] For more information about the errors and possible solutions, please read the following
articles:
[ERROR] [Help 1] http://cwiki.apache.org/confluence/display/MAVEN/MojoExecutionException
[ERROR] 
[ERROR] After correcting the problems, you can resume the build with the command
[ERROR]   mvn <goals> -rf :phoenix-core
Build step 'Invoke top-level Maven targets' marked build as failure
Archiving artifacts
Compressed 1.49 GB of artifacts by 59.4% relative to #1487
Recording test results

Mime
View raw message