phoenix-commits mailing list archives

Site index · List index
Message view « Date » · « Thread »
Top « Date » · « Thread »
From Apache Jenkins Server <jenk...@builds.apache.org>
Subject Build failed in Jenkins: Phoenix-Calcite #107
Date Wed, 26 Apr 2017 08:58:03 GMT
See <https://builds.apache.org/job/Phoenix-calcite/107/display/redirect?page=changes>

Changes:

[rajeshbabu] Fix compilation issue because of DEFAULT Keyword changed in Calcite

------------------------------------------
[...truncated 3.18 MB...]
testGlobalPhoenixMetricsForUpsertSelect(org.apache.phoenix.monitoring.PhoenixMetricsIT)  Time
elapsed: 4.96 sec  <<< FAILURE!
java.lang.AssertionError: expected:<10> but was:<20>
	at org.apache.phoenix.monitoring.PhoenixMetricsIT.testGlobalPhoenixMetricsForUpsertSelect(PhoenixMetricsIT.java:164)

testGlobalPhoenixMetricsForMutations(org.apache.phoenix.monitoring.PhoenixMetricsIT)  Time
elapsed: 1.427 sec  <<< FAILURE!
java.lang.AssertionError: expected:<10> but was:<0>
	at org.apache.phoenix.monitoring.PhoenixMetricsIT.testGlobalPhoenixMetricsForMutations(PhoenixMetricsIT.java:140)

testMetricsForDeleteWithAutoCommit(org.apache.phoenix.monitoring.PhoenixMetricsIT)  Time elapsed:
3.134 sec  <<< FAILURE!
java.lang.AssertionError: The two metrics have different or unequal number of table names

	at org.apache.phoenix.monitoring.PhoenixMetricsIT.assertMetricsAreSame(PhoenixMetricsIT.java:649)
	at org.apache.phoenix.monitoring.PhoenixMetricsIT.testMetricsForDeleteWithAutoCommit(PhoenixMetricsIT.java:439)

testMetricsForUpsertSelect(org.apache.phoenix.monitoring.PhoenixMetricsIT)  Time elapsed:
5.039 sec  <<< FAILURE!
java.lang.AssertionError: Mutation batch sizes didn't match! expected:<10> but was:<20>
	at org.apache.phoenix.monitoring.PhoenixMetricsIT.assertMutationMetrics(PhoenixMetricsIT.java:816)
	at org.apache.phoenix.monitoring.PhoenixMetricsIT.testMetricsForUpsertSelect(PhoenixMetricsIT.java:303)

Tests run: 2, Failures: 0, Errors: 0, Skipped: 0, Time elapsed: 165.021 sec - in org.apache.phoenix.iterate.ScannerLeaseRenewalIT

Results :

Failed tests: 
  FlappingLocalIndexIT.testLocalIndexScanWithSmallChunks:104->BaseTest.assertEquals:1786
expected:<[z]> but was:<[a]>
  FlappingLocalIndexIT.testLocalIndexScanWithSmallChunks:104->BaseTest.assertEquals:1786
expected:<[z]> but was:<[a]>
  FlappingLocalIndexIT.testLocalIndexScan:164->BaseTest.assertEquals:1830 expected:<3>
but was:<0>
  FlappingLocalIndexIT.testLocalIndexScan:164->BaseTest.assertEquals:1830 expected:<3>
but was:<0>
  IndexExtendedIT.testLocalIndexScanAfterRegionsMerge:557->BaseTest.assertEquals:1786 expected:<[z]>
but was:<[a]>
  QueryTimeoutIT.testQueryTimeout:136 Total time of query was 16398 ms, but expected to be
greater than 1000
  QueryTimeoutIT.testSetRPCTimeOnConnection:102
  StatsCollectorIT.testUpdateStatsWithMultipleTables:301->upsertValues:341->upsertStmt:406
  StatsCollectorIT.testUpdateStatsWithMultipleTables:301->upsertValues:341->upsertStmt:406
  StatsCollectorIT.testUpdateStatsWithMultipleTables:301->upsertValues:341->upsertStmt:406
  StatsCollectorIT.testUpdateStatsWithMultipleTables:301->upsertValues:341->upsertStmt:406
  StatsCollectorIT.testUpdateStatsWithMultipleTables:301->upsertValues:341->upsertStmt:406
  StatsCollectorIT.testUpdateStatsWithMultipleTables:301->upsertValues:341->upsertStmt:406
  StatsCollectorIT.testUpdateStatsWithMultipleTables:301->upsertValues:341->upsertStmt:406
  StatsCollectorIT.testUpdateStatsWithMultipleTables:301->upsertValues:341->upsertStmt:406
  StatsCollectorIT.testUpdateStatsWithMultipleTables:301->upsertValues:341->upsertStmt:406
  StatsCollectorIT.testUpdateStatsWithMultipleTables:301->upsertValues:341->upsertStmt:406
  StatsCollectorIT.testUpdateStatsWithMultipleTables:301->upsertValues:341->upsertStmt:406
  StatsCollectorIT.testUpdateStatsWithMultipleTables:301->upsertValues:341->upsertStmt:406
  StatsCollectorIT.testUpdateStats:234->upsertValues:341->upsertStmt:406
  StatsCollectorIT.testUpdateStats:234->upsertValues:341->upsertStmt:406
  StatsCollectorIT.testUpdateStats:234->upsertValues:341->upsertStmt:406
  StatsCollectorIT.testUpdateStats:234->upsertValues:341->upsertStmt:406
  StatsCollectorIT.testUpdateStats:234->upsertValues:341->upsertStmt:406
  StatsCollectorIT.testUpdateStats:234->upsertValues:341->upsertStmt:406
  StatsCollectorIT.testUpdateStats:234->upsertValues:341->upsertStmt:406
  StatsCollectorIT.testUpdateStats:234->upsertValues:341->upsertStmt:406
  StatsCollectorIT.testUpdateStats:234->upsertValues:341->upsertStmt:406
  StatsCollectorIT.testUpdateStats:234->upsertValues:341->upsertStmt:406
  StatsCollectorIT.testUpdateStats:234->upsertValues:341->upsertStmt:406
  StatsCollectorIT.testUpdateStats:234->upsertValues:341->upsertStmt:406
  StatsCollectorIT.testWithMultiCF:559->BaseTest.assertEquals:1830 expected:<12>
but was:<13>
  StatsCollectorIT.testWithMultiCF:559->BaseTest.assertEquals:1830 expected:<12>
but was:<13>
  StatsCollectorIT.testWithMultiCF:559->BaseTest.assertEquals:1830 expected:<12>
but was:<13>
  StatsCollectorIT.testWithMultiCF:559->BaseTest.assertEquals:1830 expected:<12>
but was:<13>
  SysTableNamespaceMappedStatsCollectorIT>StatsCollectorIT.testUpdateStatsWithMultipleTables:301->StatsCollectorIT.upsertValues:341->StatsCollectorIT.upsertStmt:406
  SysTableNamespaceMappedStatsCollectorIT>StatsCollectorIT.testUpdateStatsWithMultipleTables:301->StatsCollectorIT.upsertValues:341->StatsCollectorIT.upsertStmt:406
  SysTableNamespaceMappedStatsCollectorIT>StatsCollectorIT.testUpdateStatsWithMultipleTables:301->StatsCollectorIT.upsertValues:341->StatsCollectorIT.upsertStmt:406
  SysTableNamespaceMappedStatsCollectorIT>StatsCollectorIT.testUpdateStatsWithMultipleTables:301->StatsCollectorIT.upsertValues:341->StatsCollectorIT.upsertStmt:406
  SysTableNamespaceMappedStatsCollectorIT>StatsCollectorIT.testUpdateStatsWithMultipleTables:301->StatsCollectorIT.upsertValues:341->StatsCollectorIT.upsertStmt:406
  SysTableNamespaceMappedStatsCollectorIT>StatsCollectorIT.testUpdateStatsWithMultipleTables:301->StatsCollectorIT.upsertValues:341->StatsCollectorIT.upsertStmt:406
  SysTableNamespaceMappedStatsCollectorIT>StatsCollectorIT.testUpdateStatsWithMultipleTables:301->StatsCollectorIT.upsertValues:341->StatsCollectorIT.upsertStmt:406
  SysTableNamespaceMappedStatsCollectorIT>StatsCollectorIT.testUpdateStatsWithMultipleTables:301->StatsCollectorIT.upsertValues:341->StatsCollectorIT.upsertStmt:406
  SysTableNamespaceMappedStatsCollectorIT>StatsCollectorIT.testUpdateStatsWithMultipleTables:301->StatsCollectorIT.upsertValues:341->StatsCollectorIT.upsertStmt:406
  SysTableNamespaceMappedStatsCollectorIT>StatsCollectorIT.testUpdateStatsWithMultipleTables:301->StatsCollectorIT.upsertValues:341->StatsCollectorIT.upsertStmt:406
  SysTableNamespaceMappedStatsCollectorIT>StatsCollectorIT.testUpdateStatsWithMultipleTables:301->StatsCollectorIT.upsertValues:341->StatsCollectorIT.upsertStmt:406
  SysTableNamespaceMappedStatsCollectorIT>StatsCollectorIT.testUpdateStatsWithMultipleTables:301->StatsCollectorIT.upsertValues:341->StatsCollectorIT.upsertStmt:406
  SysTableNamespaceMappedStatsCollectorIT>StatsCollectorIT.testUpdateStats:234->StatsCollectorIT.upsertValues:341->StatsCollectorIT.upsertStmt:406
  SysTableNamespaceMappedStatsCollectorIT>StatsCollectorIT.testUpdateStats:234->StatsCollectorIT.upsertValues:341->StatsCollectorIT.upsertStmt:406
  SysTableNamespaceMappedStatsCollectorIT>StatsCollectorIT.testUpdateStats:234->StatsCollectorIT.upsertValues:341->StatsCollectorIT.upsertStmt:406
  SysTableNamespaceMappedStatsCollectorIT>StatsCollectorIT.testUpdateStats:234->StatsCollectorIT.upsertValues:341->StatsCollectorIT.upsertStmt:406
  SysTableNamespaceMappedStatsCollectorIT>StatsCollectorIT.testUpdateStats:234->StatsCollectorIT.upsertValues:341->StatsCollectorIT.upsertStmt:406
  SysTableNamespaceMappedStatsCollectorIT>StatsCollectorIT.testUpdateStats:234->StatsCollectorIT.upsertValues:341->StatsCollectorIT.upsertStmt:406
  SysTableNamespaceMappedStatsCollectorIT>StatsCollectorIT.testUpdateStats:234->StatsCollectorIT.upsertValues:341->StatsCollectorIT.upsertStmt:406
  SysTableNamespaceMappedStatsCollectorIT>StatsCollectorIT.testUpdateStats:234->StatsCollectorIT.upsertValues:341->StatsCollectorIT.upsertStmt:406
  SysTableNamespaceMappedStatsCollectorIT>StatsCollectorIT.testUpdateStats:234->StatsCollectorIT.upsertValues:341->StatsCollectorIT.upsertStmt:406
  SysTableNamespaceMappedStatsCollectorIT>StatsCollectorIT.testUpdateStats:234->StatsCollectorIT.upsertValues:341->StatsCollectorIT.upsertStmt:406
  SysTableNamespaceMappedStatsCollectorIT>StatsCollectorIT.testUpdateStats:234->StatsCollectorIT.upsertValues:341->StatsCollectorIT.upsertStmt:406
  SysTableNamespaceMappedStatsCollectorIT>StatsCollectorIT.testUpdateStats:234->StatsCollectorIT.upsertValues:341->StatsCollectorIT.upsertStmt:406
  SysTableNamespaceMappedStatsCollectorIT>StatsCollectorIT.testWithMultiCF:559->BaseTest.assertEquals:1830
expected:<12> but was:<13>
  SysTableNamespaceMappedStatsCollectorIT>StatsCollectorIT.testWithMultiCF:559->BaseTest.assertEquals:1830
expected:<12> but was:<13>
  SysTableNamespaceMappedStatsCollectorIT>StatsCollectorIT.testWithMultiCF:559->BaseTest.assertEquals:1830
expected:<12> but was:<13>
  SysTableNamespaceMappedStatsCollectorIT>StatsCollectorIT.testWithMultiCF:559->BaseTest.assertEquals:1830
expected:<12> but was:<13>
  UserDefinedFunctionsIT.testTemporaryFunctions:603 FunctionNotFoundException should be thrown
  ImmutableIndexIT.testDropIfImmutableKeyValueColumn:150
  ImmutableIndexIT.testDropIfImmutableKeyValueColumn:150
  ImmutableIndexIT.testDropIfImmutableKeyValueColumn:150
  ImmutableIndexIT.testDropIfImmutableKeyValueColumn:150
  ImmutableIndexIT.testDropIfImmutableKeyValueColumn:150
  ImmutableIndexIT.testDropIfImmutableKeyValueColumn:150
  ImmutableIndexIT.testDropIfImmutableKeyValueColumn:150
  ImmutableIndexIT.testDropIfImmutableKeyValueColumn:150
  LocalIndexIT.testLocalIndexScanJoinColumnsFromDataTable:286->BaseTest.assertEquals:1830
expected:<3> but was:<0>
  LocalIndexIT.testLocalIndexScanJoinColumnsFromDataTable:286->BaseTest.assertEquals:1830
expected:<3> but was:<0>
  LocalIndexIT.testLocalIndexesOnTableWithImmutableRows:505->BaseTest.assertEquals:1786
expected:<[a]> but was:<[z]>
  LocalIndexIT.testLocalIndexesOnTableWithImmutableRows:505->BaseTest.assertEquals:1786
expected:<[a]> but was:<[z]>
  PhoenixMetricsIT.testGlobalPhoenixMetricsForMutations:140->BaseTest.assertEquals:1830
expected:<10> but was:<0>
  PhoenixMetricsIT.testGlobalPhoenixMetricsForQueries:120->BaseTest.assertEquals:1830 expected:<1>
but was:<0>
  PhoenixMetricsIT.testGlobalPhoenixMetricsForUpsertSelect:164->BaseTest.assertEquals:1830
expected:<10> but was:<20>
  PhoenixMetricsIT.testMetricsForDelete:328->assertReadMetricsForMutatingSql:784 No read
metrics present when there should have been!
  PhoenixMetricsIT.testMetricsForDeleteWithAutoCommit:439->assertMetricsAreSame:649 The
two metrics have different or unequal number of table names 
  PhoenixMetricsIT.testMetricsForUpsertSelect:303->assertMutationMetrics:816->BaseTest.assertEquals:1826
Mutation batch sizes didn't match! expected:<10> but was:<20>
Tests in error: 
  AutomaticRebuildIT.testSecondaryAutomaticRebuildIndex:158 » SQL Error while ex...
  AutomaticRebuildIT.testSecondaryAutomaticRebuildIndex:158 » SQL Error while ex...
  CsvBulkLoadToolIT.testFullOptionImport:153 » SQL Error while executing SQL "SE...
  CsvBulkLoadToolIT.testImportInImmutableTable:393 » SQL Error while executing S...
  CsvBulkLoadToolIT.testImportOneIndexTable:283->testImportOneIndexTable:318 » SQL
  CsvBulkLoadToolIT.testImportOneLocalIndexTable:288->testImportOneIndexTable:318 » SQL
  CsvBulkLoadToolIT.testImportWithIndex:232 » SQL Error while executing SQL "SEL...
  CsvBulkLoadToolIT.testMultipleInputFiles:191 » SQL Error while executing SQL "...
  IndexExtendedIT.testMutableIndexWithUpdates:163 » SQL Error while executing SQ...
  IndexExtendedIT.testMutableIndexWithUpdates:163 » SQL Error while executing SQ...
  IndexExtendedIT.testMutableIndexWithUpdates:163 » SQL Error while executing SQ...
  IndexExtendedIT.testMutableIndexWithUpdates:163 » SQL Error while executing SQ...
  IndexExtendedIT.testSecondaryIndex:246 » SQL Error while executing SQL "EXPLAI...
  IndexExtendedIT.testSecondaryIndex:246 » SQL Error while executing SQL "EXPLAI...
  IndexExtendedIT.testSecondaryIndex:246 » SQL Error while executing SQL "EXPLAI...
  IndexExtendedIT.testSecondaryIndex:246 » SQL Error while executing SQL "EXPLAI...
  IndexExtendedIT.testSecondaryIndex:246 » SQL Error while executing SQL "EXPLAI...
  IndexExtendedIT.testSecondaryIndex:246 » SQL Error while executing SQL "EXPLAI...
  IndexExtendedIT.testSecondaryIndex:246 » SQL Error while executing SQL "EXPLAI...
  IndexExtendedIT.testSecondaryIndex:246 » SQL Error while executing SQL "EXPLAI...
  IndexExtendedIT.testSecondaryIndex:246 » SQL Error while executing SQL "EXPLAI...
  IndexExtendedIT.testSecondaryIndex:246 » SQL Error while executing SQL "EXPLAI...
  IndexExtendedIT.testSecondaryIndex:246 » SQL Error while executing SQL "EXPLAI...
  IndexExtendedIT.testSecondaryIndex:246 » SQL Error while executing SQL "EXPLAI...
  IndexExtendedIT.testSecondaryIndex:246 » SQL Error while executing SQL "EXPLAI...
  IndexExtendedIT.testSecondaryIndex:246 » SQL Error while executing SQL "EXPLAI...
  IndexExtendedIT.testSecondaryIndex:246 » SQL Error while executing SQL "EXPLAI...
  IndexExtendedIT.testSecondaryIndex:246 » SQL Error while executing SQL "EXPLAI...
  IndexToolForPartialBuildIT.testSecondaryIndex:165 » SQL Error while executing ...
  IndexToolForPartialBuildIT.testSecondaryIndex:165 » SQL Error while executing ...
  IndexToolForPartialBuildWithNamespaceEnabledIT>IndexToolForPartialBuildIT.testSecondaryIndex:165
» SQL
  IndexToolForPartialBuildWithNamespaceEnabledIT>IndexToolForPartialBuildIT.testSecondaryIndex:165
» SQL
  RegexBulkLoadToolIT.testFullOptionImport:121 » SQL Error while executing SQL "...
  RegexBulkLoadToolIT.testImportOneIndexTable:250->testImportOneIndexTable:286 » SQL
  RegexBulkLoadToolIT.testImportOneLocalIndexTable:255->testImportOneIndexTable:286 »
SQL
  RegexBulkLoadToolIT.testImportWithIndex:202 » SQL Error while executing SQL "S...
  RegexBulkLoadToolIT.testMultipleInputFiles:160 » SQL Error while executing SQL...
  SpillableGroupByIT.testScanUri:120 » SQL Error while executing SQL "select cou...
  StatsCollectorIT.testRowCountAndByteCounts:635 » SQL Error while executing SQL...
  StatsCollectorIT.testRowCountAndByteCounts:635 » SQL Error while executing SQL...
  StatsCollectorIT.testRowCountAndByteCounts:635 » SQL Error while executing SQL...
  StatsCollectorIT.testRowCountAndByteCounts:635 » SQL Error while executing SQL...
  StatsCollectorIT.testRowCountAndByteCounts:635 » SQL Error while executing SQL...
  StatsCollectorIT.testRowCountAndByteCounts:635 » SQL Error while executing SQL...
  StatsCollectorIT.testRowCountAndByteCounts:635 » SQL Error while executing SQL...
  StatsCollectorIT.testRowCountAndByteCounts:635 » SQL Error while executing SQL...
  StatsCollectorIT.testRowCountAndByteCounts:635 » SQL Error while executing SQL...
  StatsCollectorIT.testRowCountAndByteCounts:635 » SQL Error while executing SQL...
  StatsCollectorIT.testRowCountAndByteCounts:635 » SQL Error while executing SQL...
  StatsCollectorIT.testRowCountAndByteCounts:635 » SQL Error while executing SQL...
  StatsCollectorIT.testWithMultiCF:561 » SQL Error while executing SQL "SELECT C...
  StatsCollectorIT.testWithMultiCF:561 » SQL Error while executing SQL "SELECT C...
  StatsCollectorIT.testWithMultiCF:561 » SQL Error while executing SQL "SELECT C...
  StatsCollectorIT.testWithMultiCF:561 » SQL Error while executing SQL "SELECT C...
  StatsCollectorIT.testWithMultiCF:561 » SQL Error while executing SQL "SELECT C...
  StatsCollectorIT.testWithMultiCF:561 » SQL Error while executing SQL "SELECT C...
  StatsCollectorIT.testWithMultiCF:561 » SQL Error while executing SQL "SELECT C...
  StatsCollectorIT.testWithMultiCF:561 » SQL Error while executing SQL "SELECT C...
  SysTableNamespaceMappedStatsCollectorIT>StatsCollectorIT.testRowCountAndByteCounts:635
» SQL
  SysTableNamespaceMappedStatsCollectorIT>StatsCollectorIT.testRowCountAndByteCounts:635
» SQL
  SysTableNamespaceMappedStatsCollectorIT>StatsCollectorIT.testRowCountAndByteCounts:635
» SQL
  SysTableNamespaceMappedStatsCollectorIT>StatsCollectorIT.testRowCountAndByteCounts:635
» SQL
  SysTableNamespaceMappedStatsCollectorIT>StatsCollectorIT.testRowCountAndByteCounts:635
» SQL
  SysTableNamespaceMappedStatsCollectorIT>StatsCollectorIT.testRowCountAndByteCounts:635
» SQL
  SysTableNamespaceMappedStatsCollectorIT>StatsCollectorIT.testRowCountAndByteCounts:635
» SQL
  SysTableNamespaceMappedStatsCollectorIT>StatsCollectorIT.testRowCountAndByteCounts:635
» SQL
  SysTableNamespaceMappedStatsCollectorIT>StatsCollectorIT.testRowCountAndByteCounts:635
» SQL
  SysTableNamespaceMappedStatsCollectorIT>StatsCollectorIT.testRowCountAndByteCounts:635
» SQL
  SysTableNamespaceMappedStatsCollectorIT>StatsCollectorIT.testRowCountAndByteCounts:635
» SQL
  SysTableNamespaceMappedStatsCollectorIT>StatsCollectorIT.testRowCountAndByteCounts:635
» SQL
  SysTableNamespaceMappedStatsCollectorIT>StatsCollectorIT.testWithMultiCF:561 » SQL
  SysTableNamespaceMappedStatsCollectorIT>StatsCollectorIT.testWithMultiCF:561 » SQL
  SysTableNamespaceMappedStatsCollectorIT>StatsCollectorIT.testWithMultiCF:561 » SQL
  SysTableNamespaceMappedStatsCollectorIT>StatsCollectorIT.testWithMultiCF:561 » SQL
  SysTableNamespaceMappedStatsCollectorIT>StatsCollectorIT.testWithMultiCF:561 » SQL
  SysTableNamespaceMappedStatsCollectorIT>StatsCollectorIT.testWithMultiCF:561 » SQL
  SysTableNamespaceMappedStatsCollectorIT>StatsCollectorIT.testWithMultiCF:561 » SQL
  SysTableNamespaceMappedStatsCollectorIT>StatsCollectorIT.testWithMultiCF:561 » SQL
  UserDefinedFunctionsIT.testCreateFunction:395 » SQL Error while executing SQL ...
  UserDefinedFunctionsIT.testDeleteJar:303 » SQL Error while executing SQL "sele...
  UserDefinedFunctionsIT.testDropFunction:639 » SQL Error while executing SQL "s...
  UserDefinedFunctionsIT.testFunctionalIndexesWithUDFFunction:765 » FunctionNotFound
  UserDefinedFunctionsIT.testListJars:283 » SQL Error while executing SQL "selec...
  UserDefinedFunctionsIT.testUDFsWhenTimestampManagedAtClient:691 » SQL Error wh...
  UserDefinedFunctionsIT.testUDFsWithMultipleConnections:515 » SQL Error while e...
  ImmutableIndexIT.testCreateIndexDuringUpsertSelect:181->BaseTest.upsertRows:1622->BaseTest.upsertRow:1649
» SQL
  ImmutableIndexIT.testCreateIndexDuringUpsertSelect:181->BaseTest.upsertRows:1622->BaseTest.upsertRow:1649
» SQL
  ImmutableIndexIT.testCreateIndexDuringUpsertSelect:181->BaseTest.upsertRows:1622->BaseTest.upsertRow:1649
» SQL
  ImmutableIndexIT.testCreateIndexDuringUpsertSelect:181->BaseTest.upsertRows:1622->BaseTest.upsertRow:1649
» SQL
  RoundRobinResultIteratorWithStatsIT.testRoundRobinBehavior:87 » SQL Cannot cal...
  PhoenixMetricsIT.testNoMetricsCollectedForConnection:348 » SQL does not implem...
  PhoenixMetricsIT.testReadMetricsForSelect:227 » SQL does not implement 'class ...
  PhoenixClientRpcIT.testIndexQos:107 NullPointer
  PhoenixClientRpcIT.testMetadataQos:121 NullPointer
  PhoenixServerRpcIT.testIndexQos:164 NullPointer

Tests run: 519, Failures: 82, Errors: 95, Skipped: 48

[INFO] 
[INFO] --- maven-failsafe-plugin:2.19.1:verify (ParallelStatsEnabledTest) @ phoenix-core ---
[INFO] ------------------------------------------------------------------------
[INFO] Reactor Summary:
[INFO] 
[INFO] Apache Phoenix ..................................... SUCCESS [  4.574 s]
[INFO] Phoenix Core ....................................... FAILURE [  01:23 h]
[INFO] Phoenix - Flume .................................... SKIPPED
[INFO] Phoenix - Kafka .................................... SKIPPED
[INFO] Phoenix - Pig ...................................... SKIPPED
[INFO] Phoenix Query Server Client ........................ SKIPPED
[INFO] Phoenix Query Server ............................... SKIPPED
[INFO] Phoenix - Pherf .................................... SKIPPED
[INFO] Phoenix - Spark .................................... SKIPPED
[INFO] Phoenix - Hive ..................................... SKIPPED
[INFO] Phoenix Client ..................................... SKIPPED
[INFO] Phoenix Server ..................................... SKIPPED
[INFO] Phoenix Assembly ................................... SKIPPED
[INFO] Phoenix - Tracing Web Application .................. SKIPPED
[INFO] ------------------------------------------------------------------------
[INFO] BUILD FAILURE
[INFO] ------------------------------------------------------------------------
[INFO] Total time: 01:24 h
[INFO] Finished at: 2017-04-26T08:55:11+00:00
[INFO] Final Memory: 72M/1067M
[INFO] ------------------------------------------------------------------------
[ERROR] Failed to execute goal org.apache.maven.plugins:maven-failsafe-plugin:2.19.1:verify
(ParallelStatsEnabledTest) on project phoenix-core: There was a timeout or other error in
the fork -> [Help 1]
[ERROR] 
[ERROR] To see the full stack trace of the errors, re-run Maven with the -e switch.
[ERROR] Re-run Maven using the -X switch to enable full debug logging.
[ERROR] 
[ERROR] For more information about the errors and possible solutions, please read the following
articles:
[ERROR] [Help 1] http://cwiki.apache.org/confluence/display/MAVEN/MojoExecutionException
[ERROR] 
[ERROR] After correcting the problems, you can resume the build with the command
[ERROR]   mvn <goals> -rf :phoenix-core
Build step 'Invoke top-level Maven targets' marked build as failure
Archiving artifacts
No prior successful build to compare, so performing full copy of artifacts
Recording test results
Not sending mail to unregistered user sergey.soldatov@gmail.com
Not sending mail to unregistered user gabrielr@ngdata.com
Not sending mail to unregistered user ankitsinghal59@gmail.com
Not sending mail to unregistered user kliewkliew@users.noreply.github.com
Not sending mail to unregistered user twdsilva@gmail.com

Mime
View raw message