phoenix-commits mailing list archives

Site index · List index
Message view « Date » · « Thread »
Top « Date » · « Thread »
From Apache Jenkins Server <jenk...@builds.apache.org>
Subject Build failed in Jenkins: Phoenix Compile Compatibility with HBase #272
Date Sat, 29 Apr 2017 09:35:13 GMT
See <https://builds.apache.org/job/Phoenix_Compile_Compat_wHBase/272/display/redirect>

------------------------------------------
Started by timer
[EnvInject] - Loading node environment variables.
Building remotely on qnode3 (ubuntu) in workspace <https://builds.apache.org/job/Phoenix_Compile_Compat_wHBase/ws/>
[Phoenix_Compile_Compat_wHBase] $ /bin/bash /tmp/hudson6758861958325443872.sh
core file size          (blocks, -c) 0
data seg size           (kbytes, -d) unlimited
scheduling priority             (-e) 0
file size               (blocks, -f) unlimited
pending signals                 (-i) 128341
max locked memory       (kbytes, -l) 64
max memory size         (kbytes, -m) unlimited
open files                      (-n) 60000
pipe size            (512 bytes, -p) 8
POSIX message queues     (bytes, -q) 819200
real-time priority              (-r) 0
stack size              (kbytes, -s) 8192
cpu time               (seconds, -t) unlimited
max user processes              (-u) 10240
virtual memory          (kbytes, -v) unlimited
file locks                      (-x) unlimited
core id		: 0
core id		: 1
core id		: 2
core id		: 3
core id		: 4
core id		: 5
core id		: 6
core id		: 7
physical id	: 0
MemTotal:       32865152 kB
MemFree:        11207516 kB
Filesystem      Size  Used Avail Use% Mounted on
none             16G     0   16G   0% /dev
tmpfs           3.2G  342M  2.9G  11% /run
/dev/nbd0        46G   27G   17G  62% /
tmpfs            16G     0   16G   0% /dev/shm
tmpfs           5.0M     0  5.0M   0% /run/lock
tmpfs            16G     0   16G   0% /sys/fs/cgroup
/dev/sda1       235G  110G  113G  50% /home
tmpfs           3.2G     0  3.2G   0% /run/user/9997
apache-maven-2.2.1
apache-maven-3.0.4
apache-maven-3.0.5
apache-maven-3.2.1
apache-maven-3.2.5
apache-maven-3.3.3
apache-maven-3.3.9
latest
latest2
latest3


===========================================================================================
Verifying compile level compatibility with HBase 0.98 with Phoenix 4.x-HBase-0.98
===========================================================================================

Cloning into 'hbase'...
Switched to a new branch '0.98'
Branch 0.98 set up to track remote branch 0.98 from origin.

main:
     [exec] ~/jenkins-slave/workspace/Phoenix_Compile_Compat_wHBase/hbase/hbase-common ~/jenkins-slave/workspace/Phoenix_Compile_Compat_wHBase/hbase/hbase-common
     [exec] ~/jenkins-slave/workspace/Phoenix_Compile_Compat_wHBase/hbase/hbase-common

main:
    [mkdir] Created dir: <https://builds.apache.org/job/Phoenix_Compile_Compat_wHBase/ws/hbase/hbase-common/target/nativelib>
     [exec] tar: hadoop-snappy-nativelibs.tar: Cannot open: No such file or directory
     [exec] tar: Error is not recoverable: exiting now
     [exec] Result: 2

main:
    [mkdir] Created dir: <https://builds.apache.org/job/Phoenix_Compile_Compat_wHBase/ws/hbase/hbase-server/target/hbase-webapps>
     [copy] Copying 20 files to <https://builds.apache.org/job/Phoenix_Compile_Compat_wHBase/ws/hbase/hbase-server/target/hbase-webapps>
    [mkdir] Created dir: <https://builds.apache.org/job/Phoenix_Compile_Compat_wHBase/ws/hbase/hbase-server/target/hbase-webapps/master/WEB-INF>
    [mkdir] Created dir: <https://builds.apache.org/job/Phoenix_Compile_Compat_wHBase/ws/hbase/hbase-server/target/hbase-webapps/regionserver/WEB-INF>

main:
    [mkdir] Created dir: <https://builds.apache.org/job/Phoenix_Compile_Compat_wHBase/ws/hbase/hbase-thrift/target/hbase-webapps>
     [copy] Copying 17 files to <https://builds.apache.org/job/Phoenix_Compile_Compat_wHBase/ws/hbase/hbase-thrift/target/hbase-webapps>
    [mkdir] Created dir: <https://builds.apache.org/job/Phoenix_Compile_Compat_wHBase/ws/hbase/hbase-thrift/target/hbase-webapps/thrift/WEB-INF>

main:
    [mkdir] Created dir: <https://builds.apache.org/job/Phoenix_Compile_Compat_wHBase/ws/hbase/hbase-rest/target/hbase-webapps>
     [copy] Copying 1 file to <https://builds.apache.org/job/Phoenix_Compile_Compat_wHBase/ws/hbase/hbase-rest/target/hbase-webapps>
    [mkdir] Created dir: <https://builds.apache.org/job/Phoenix_Compile_Compat_wHBase/ws/hbase/hbase-rest/target/hbase-webapps/rest/WEB-INF>

HBase pom.xml:

Got HBase version as 0.98.25-SNAPSHOT
Cloning into 'phoenix'...
Switched to a new branch '4.x-HBase-0.98'
Branch 4.x-HBase-0.98 set up to track remote branch 4.x-HBase-0.98 from origin.
ANTLR Parser Generator  Version 3.5.2
Output file <https://builds.apache.org/job/Phoenix_Compile_Compat_wHBase/ws/phoenix/phoenix-core/target/generated-sources/antlr3/org/apache/phoenix/parse/PhoenixSQLParser.java>
does not exist: must build <https://builds.apache.org/job/Phoenix_Compile_Compat_wHBase/ws/phoenix/phoenix-core/src/main/antlr3/PhoenixSQL.g>
PhoenixSQL.g


===========================================================================================
Verifying compile level compatibility with HBase branch-1.2 with Phoenix master
===========================================================================================

Cloning into 'hbase'...
Switched to a new branch 'branch-1.2'
Branch branch-1.2 set up to track remote branch branch-1.2 from origin.

main:
     [exec] ~/jenkins-slave/workspace/Phoenix_Compile_Compat_wHBase/phoenix/hbase/hbase-common
~/jenkins-slave/workspace/Phoenix_Compile_Compat_wHBase/phoenix/hbase/hbase-common
     [exec] ~/jenkins-slave/workspace/Phoenix_Compile_Compat_wHBase/phoenix/hbase/hbase-common

main:

main:
    [mkdir] Created dir: <https://builds.apache.org/job/Phoenix_Compile_Compat_wHBase/ws/phoenix/hbase/hbase-server/target/hbase-webapps>
     [copy] Copying 20 files to <https://builds.apache.org/job/Phoenix_Compile_Compat_wHBase/ws/phoenix/hbase/hbase-server/target/hbase-webapps>
    [mkdir] Created dir: <https://builds.apache.org/job/Phoenix_Compile_Compat_wHBase/ws/phoenix/hbase/hbase-server/target/hbase-webapps/master/WEB-INF>
    [mkdir] Created dir: <https://builds.apache.org/job/Phoenix_Compile_Compat_wHBase/ws/phoenix/hbase/hbase-server/target/hbase-webapps/regionserver/WEB-INF>

main:

main:

main:
    [mkdir] Created dir: <https://builds.apache.org/job/Phoenix_Compile_Compat_wHBase/ws/phoenix/hbase/hbase-thrift/target/hbase-webapps>
     [copy] Copying 17 files to <https://builds.apache.org/job/Phoenix_Compile_Compat_wHBase/ws/phoenix/hbase/hbase-thrift/target/hbase-webapps>
    [mkdir] Created dir: <https://builds.apache.org/job/Phoenix_Compile_Compat_wHBase/ws/phoenix/hbase/hbase-thrift/target/hbase-webapps/thrift/WEB-INF>

main:
    [mkdir] Created dir: <https://builds.apache.org/job/Phoenix_Compile_Compat_wHBase/ws/phoenix/hbase/hbase-rest/target/hbase-webapps>
     [copy] Copying 1 file to <https://builds.apache.org/job/Phoenix_Compile_Compat_wHBase/ws/phoenix/hbase/hbase-rest/target/hbase-webapps>
    [mkdir] Created dir: <https://builds.apache.org/job/Phoenix_Compile_Compat_wHBase/ws/phoenix/hbase/hbase-rest/target/hbase-webapps/rest/WEB-INF>

HBase pom.xml:

Got HBase version as 1.2.6-SNAPSHOT
Cloning into 'phoenix'...
Already on 'master'
Your branch is up-to-date with 'origin/master'.
ANTLR Parser Generator  Version 3.5.2
Output file <https://builds.apache.org/job/Phoenix_Compile_Compat_wHBase/ws/phoenix/phoenix/phoenix-core/target/generated-sources/antlr3/org/apache/phoenix/parse/PhoenixSQLParser.java>
does not exist: must build <https://builds.apache.org/job/Phoenix_Compile_Compat_wHBase/ws/phoenix/phoenix/phoenix-core/src/main/antlr3/PhoenixSQL.g>
PhoenixSQL.g
[ERROR] COMPILATION ERROR : 
[ERROR] <https://builds.apache.org/job/Phoenix_Compile_Compat_wHBase/ws/phoenix/phoenix/phoenix-core/src/main/java/org/apache/phoenix/execute/DelegateHTable.java>:[284,17]
cannot find symbol
  symbol:   method setOperationTimeout(int)
  location: variable delegate of type org.apache.hadoop.hbase.client.HTableInterface
[ERROR] <https://builds.apache.org/job/Phoenix_Compile_Compat_wHBase/ws/phoenix/phoenix/phoenix-core/src/main/java/org/apache/phoenix/execute/DelegateHTable.java>:[282,5]
method does not override or implement a method from a supertype
[ERROR] <https://builds.apache.org/job/Phoenix_Compile_Compat_wHBase/ws/phoenix/phoenix/phoenix-core/src/main/java/org/apache/phoenix/execute/DelegateHTable.java>:[289,24]
cannot find symbol
  symbol:   method getOperationTimeout()
  location: variable delegate of type org.apache.hadoop.hbase.client.HTableInterface
[ERROR] <https://builds.apache.org/job/Phoenix_Compile_Compat_wHBase/ws/phoenix/phoenix/phoenix-core/src/main/java/org/apache/phoenix/execute/DelegateHTable.java>:[287,5]
method does not override or implement a method from a supertype
[ERROR] <https://builds.apache.org/job/Phoenix_Compile_Compat_wHBase/ws/phoenix/phoenix/phoenix-core/src/main/java/org/apache/phoenix/execute/DelegateHTable.java>:[294,17]
cannot find symbol
  symbol:   method setRpcTimeout(int)
  location: variable delegate of type org.apache.hadoop.hbase.client.HTableInterface
[ERROR] <https://builds.apache.org/job/Phoenix_Compile_Compat_wHBase/ws/phoenix/phoenix/phoenix-core/src/main/java/org/apache/phoenix/execute/DelegateHTable.java>:[292,5]
method does not override or implement a method from a supertype
[ERROR] <https://builds.apache.org/job/Phoenix_Compile_Compat_wHBase/ws/phoenix/phoenix/phoenix-core/src/main/java/org/apache/phoenix/execute/DelegateHTable.java>:[299,24]
cannot find symbol
  symbol:   method getRpcTimeout()
  location: variable delegate of type org.apache.hadoop.hbase.client.HTableInterface
[ERROR] <https://builds.apache.org/job/Phoenix_Compile_Compat_wHBase/ws/phoenix/phoenix/phoenix-core/src/main/java/org/apache/phoenix/execute/DelegateHTable.java>:[297,5]
method does not override or implement a method from a supertype
[ERROR] <https://builds.apache.org/job/Phoenix_Compile_Compat_wHBase/ws/phoenix/phoenix/phoenix-core/src/main/java/org/apache/hadoop/hbase/ipc/PhoenixRpcScheduler.java>:[120,24]
cannot find symbol
  symbol:   method getNumGeneralCallsDropped()
  location: variable delegate of type org.apache.hadoop.hbase.ipc.RpcScheduler
[ERROR] <https://builds.apache.org/job/Phoenix_Compile_Compat_wHBase/ws/phoenix/phoenix/phoenix-core/src/main/java/org/apache/hadoop/hbase/ipc/PhoenixRpcScheduler.java>:[118,5]
method does not override or implement a method from a supertype
[ERROR] <https://builds.apache.org/job/Phoenix_Compile_Compat_wHBase/ws/phoenix/phoenix/phoenix-core/src/main/java/org/apache/hadoop/hbase/ipc/PhoenixRpcScheduler.java>:[125,24]
cannot find symbol
  symbol:   method getNumLifoModeSwitches()
  location: variable delegate of type org.apache.hadoop.hbase.ipc.RpcScheduler
[ERROR] <https://builds.apache.org/job/Phoenix_Compile_Compat_wHBase/ws/phoenix/phoenix/phoenix-core/src/main/java/org/apache/hadoop/hbase/ipc/PhoenixRpcScheduler.java>:[123,5]
method does not override or implement a method from a supertype
[ERROR] Failed to execute goal org.apache.maven.plugins:maven-compiler-plugin:3.0:compile
(default-compile) on project phoenix-core: Compilation failure: Compilation failure:
[ERROR] <https://builds.apache.org/job/Phoenix_Compile_Compat_wHBase/ws/phoenix/phoenix/phoenix-core/src/main/java/org/apache/phoenix/execute/DelegateHTable.java>:[284,17]
cannot find symbol
[ERROR] symbol:   method setOperationTimeout(int)
[ERROR] location: variable delegate of type org.apache.hadoop.hbase.client.HTableInterface
[ERROR] <https://builds.apache.org/job/Phoenix_Compile_Compat_wHBase/ws/phoenix/phoenix/phoenix-core/src/main/java/org/apache/phoenix/execute/DelegateHTable.java>:[282,5]
method does not override or implement a method from a supertype
[ERROR] <https://builds.apache.org/job/Phoenix_Compile_Compat_wHBase/ws/phoenix/phoenix/phoenix-core/src/main/java/org/apache/phoenix/execute/DelegateHTable.java>:[289,24]
cannot find symbol
[ERROR] symbol:   method getOperationTimeout()
[ERROR] location: variable delegate of type org.apache.hadoop.hbase.client.HTableInterface
[ERROR] <https://builds.apache.org/job/Phoenix_Compile_Compat_wHBase/ws/phoenix/phoenix/phoenix-core/src/main/java/org/apache/phoenix/execute/DelegateHTable.java>:[287,5]
method does not override or implement a method from a supertype
[ERROR] <https://builds.apache.org/job/Phoenix_Compile_Compat_wHBase/ws/phoenix/phoenix/phoenix-core/src/main/java/org/apache/phoenix/execute/DelegateHTable.java>:[294,17]
cannot find symbol
[ERROR] symbol:   method setRpcTimeout(int)
[ERROR] location: variable delegate of type org.apache.hadoop.hbase.client.HTableInterface
[ERROR] <https://builds.apache.org/job/Phoenix_Compile_Compat_wHBase/ws/phoenix/phoenix/phoenix-core/src/main/java/org/apache/phoenix/execute/DelegateHTable.java>:[292,5]
method does not override or implement a method from a supertype
[ERROR] <https://builds.apache.org/job/Phoenix_Compile_Compat_wHBase/ws/phoenix/phoenix/phoenix-core/src/main/java/org/apache/phoenix/execute/DelegateHTable.java>:[299,24]
cannot find symbol
[ERROR] symbol:   method getRpcTimeout()
[ERROR] location: variable delegate of type org.apache.hadoop.hbase.client.HTableInterface
[ERROR] <https://builds.apache.org/job/Phoenix_Compile_Compat_wHBase/ws/phoenix/phoenix/phoenix-core/src/main/java/org/apache/phoenix/execute/DelegateHTable.java>:[297,5]
method does not override or implement a method from a supertype
[ERROR] <https://builds.apache.org/job/Phoenix_Compile_Compat_wHBase/ws/phoenix/phoenix/phoenix-core/src/main/java/org/apache/hadoop/hbase/ipc/PhoenixRpcScheduler.java>:[120,24]
cannot find symbol
[ERROR] symbol:   method getNumGeneralCallsDropped()
[ERROR] location: variable delegate of type org.apache.hadoop.hbase.ipc.RpcScheduler
[ERROR] <https://builds.apache.org/job/Phoenix_Compile_Compat_wHBase/ws/phoenix/phoenix/phoenix-core/src/main/java/org/apache/hadoop/hbase/ipc/PhoenixRpcScheduler.java>:[118,5]
method does not override or implement a method from a supertype
[ERROR] <https://builds.apache.org/job/Phoenix_Compile_Compat_wHBase/ws/phoenix/phoenix/phoenix-core/src/main/java/org/apache/hadoop/hbase/ipc/PhoenixRpcScheduler.java>:[125,24]
cannot find symbol
[ERROR] symbol:   method getNumLifoModeSwitches()
[ERROR] location: variable delegate of type org.apache.hadoop.hbase.ipc.RpcScheduler
[ERROR] <https://builds.apache.org/job/Phoenix_Compile_Compat_wHBase/ws/phoenix/phoenix/phoenix-core/src/main/java/org/apache/hadoop/hbase/ipc/PhoenixRpcScheduler.java>:[123,5]
method does not override or implement a method from a supertype
[ERROR] -> [Help 1]
[ERROR] 
[ERROR] To see the full stack trace of the errors, re-run Maven with the -e switch.
[ERROR] Re-run Maven using the -X switch to enable full debug logging.
[ERROR] 
[ERROR] For more information about the errors and possible solutions, please read the following
articles:
[ERROR] [Help 1] http://cwiki.apache.org/confluence/display/MAVEN/MojoFailureException
[ERROR] 
[ERROR] After correcting the problems, you can resume the build with the command
[ERROR]   mvn <goals> -rf :phoenix-core
Build step 'Execute shell' marked build as failure

Mime
View raw message