phoenix-commits mailing list archives

Site index · List index
Message view « Date » · « Thread »
Top « Date » · « Thread »
From Apache Jenkins Server <jenk...@builds.apache.org>
Subject Build failed in Jenkins: Phoenix | 4.x-HBase-0.98 #1460
Date Wed, 01 Mar 2017 03:26:36 GMT
See <https://builds.apache.org/job/Phoenix-4.x-HBase-0.98/1460/display/redirect?page=changes>

Changes:

[elserj] PHOENIX-3698 No-args constructor for IndexedWALEditCodec

[samarth] PHOENIX-3703 Immutable multitenant tables created as non-encoded

[samarth] PHOENIX-3539 Fix bulkload for StorageScheme -

------------------------------------------
[...truncated 71.31 KB...]
Tests run: 6, Failures: 0, Errors: 0, Skipped: 0, Time elapsed: 46.199 sec - in org.apache.phoenix.end2end.index.txn.MutableRollbackIT
Running org.apache.phoenix.end2end.index.txn.RollbackIT
Tests run: 8, Failures: 0, Errors: 0, Skipped: 0, Time elapsed: 38.45 sec - in org.apache.phoenix.end2end.index.txn.RollbackIT
Running org.apache.phoenix.end2end.salted.SaltedTableUpsertSelectIT
Tests run: 6, Failures: 0, Errors: 0, Skipped: 0, Time elapsed: 15.442 sec - in org.apache.phoenix.end2end.salted.SaltedTableUpsertSelectIT
Running org.apache.phoenix.end2end.salted.SaltedTableVarLengthRowKeyIT
Tests run: 1, Failures: 0, Errors: 0, Skipped: 0, Time elapsed: 1.307 sec - in org.apache.phoenix.end2end.salted.SaltedTableVarLengthRowKeyIT
Running org.apache.phoenix.iterate.PhoenixQueryTimeoutIT
Tests run: 2, Failures: 0, Errors: 0, Skipped: 0, Time elapsed: 2.887 sec - in org.apache.phoenix.iterate.PhoenixQueryTimeoutIT
Running org.apache.phoenix.iterate.RoundRobinResultIteratorIT
Tests run: 9, Failures: 0, Errors: 0, Skipped: 0, Time elapsed: 39.223 sec - in org.apache.phoenix.iterate.RoundRobinResultIteratorIT
Running org.apache.phoenix.rpc.UpdateCacheIT
Tests run: 7, Failures: 0, Errors: 0, Skipped: 0, Time elapsed: 19.377 sec - in org.apache.phoenix.rpc.UpdateCacheIT
Running org.apache.phoenix.trace.PhoenixTableMetricsWriterIT
Tests run: 2, Failures: 0, Errors: 0, Skipped: 0, Time elapsed: 2.666 sec - in org.apache.phoenix.trace.PhoenixTableMetricsWriterIT
Running org.apache.phoenix.trace.PhoenixTraceReaderIT
Tests run: 80, Failures: 0, Errors: 0, Skipped: 24, Time elapsed: 235.147 sec - in org.apache.phoenix.end2end.index.MutableIndexIT
Tests run: 2, Failures: 0, Errors: 0, Skipped: 0, Time elapsed: 2.637 sec - in org.apache.phoenix.trace.PhoenixTraceReaderIT
Running org.apache.phoenix.trace.PhoenixTracingEndToEndIT
Tests run: 67, Failures: 0, Errors: 0, Skipped: 0, Time elapsed: 323.161 sec - in org.apache.phoenix.end2end.index.IndexExpressionIT
Running org.apache.phoenix.tx.FlappingTransactionIT
Tests run: 4, Failures: 0, Errors: 0, Skipped: 0, Time elapsed: 6.747 sec - in org.apache.phoenix.tx.FlappingTransactionIT
Running org.apache.phoenix.tx.ParameterizedTransactionIT
Tests run: 102, Failures: 0, Errors: 0, Skipped: 0, Time elapsed: 763.754 sec - in org.apache.phoenix.end2end.SortMergeJoinIT
Running org.apache.phoenix.tx.TransactionIT
Tests run: 6, Failures: 0, Errors: 0, Skipped: 0, Time elapsed: 90.202 sec - in org.apache.phoenix.trace.PhoenixTracingEndToEndIT
Running org.apache.phoenix.tx.TxCheckpointIT
Tests run: 7, Failures: 0, Errors: 0, Skipped: 0, Time elapsed: 35.456 sec - in org.apache.phoenix.tx.TransactionIT
Tests run: 52, Failures: 0, Errors: 0, Skipped: 4, Time elapsed: 147.572 sec - in org.apache.phoenix.tx.ParameterizedTransactionIT
Tests run: 40, Failures: 0, Errors: 0, Skipped: 0, Time elapsed: 216.515 sec - in org.apache.phoenix.tx.TxCheckpointIT
Tests run: 304, Failures: 0, Errors: 0, Skipped: 0, Time elapsed: 1,486.171 sec - in org.apache.phoenix.end2end.index.IndexIT

Results :

Tests run: 2024, Failures: 0, Errors: 0, Skipped: 28

[INFO] 
[INFO] --- maven-failsafe-plugin:2.19.1:integration-test (ClientManagedTimeTests) @ phoenix-core
---

-------------------------------------------------------
 T E S T S
-------------------------------------------------------
Running org.apache.phoenix.end2end.ArrayIT
Running org.apache.phoenix.end2end.ClientTimeArithmeticQueryIT
Running org.apache.phoenix.end2end.CastAndCoerceIT
Running org.apache.phoenix.end2end.CaseStatementIT
Running org.apache.phoenix.end2end.AggregateQueryIT
Tests run: 80, Failures: 0, Errors: 0, Skipped: 0, Time elapsed: 57.986 sec - in org.apache.phoenix.end2end.ArrayIT
Running org.apache.phoenix.end2end.ColumnProjectionOptimizationIT
Tests run: 49, Failures: 0, Errors: 0, Skipped: 0, Time elapsed: 58.001 sec - in org.apache.phoenix.end2end.CastAndCoerceIT
Running org.apache.phoenix.end2end.CreateSchemaIT
Tests run: 1, Failures: 0, Errors: 0, Skipped: 0, Time elapsed: 0.257 sec - in org.apache.phoenix.end2end.CreateSchemaIT
Running org.apache.phoenix.end2end.CreateTableIT
Tests run: 56, Failures: 0, Errors: 0, Skipped: 0, Time elapsed: 60.681 sec - in org.apache.phoenix.end2end.CaseStatementIT
Running org.apache.phoenix.end2end.CustomEntityDataIT
Tests run: 3, Failures: 0, Errors: 0, Skipped: 0, Time elapsed: 3.669 sec - in org.apache.phoenix.end2end.CustomEntityDataIT
Running org.apache.phoenix.end2end.DerivedTableIT
Tests run: 3, Failures: 0, Errors: 0, Skipped: 0, Time elapsed: 17.849 sec - in org.apache.phoenix.end2end.ColumnProjectionOptimizationIT
Running org.apache.phoenix.end2end.DistinctCountIT
Tests run: 42, Failures: 0, Errors: 0, Skipped: 0, Time elapsed: 75.778 sec - in org.apache.phoenix.end2end.AggregateQueryIT
Running org.apache.phoenix.end2end.DropSchemaIT
Tests run: 18, Failures: 0, Errors: 0, Skipped: 0, Time elapsed: 12.28 sec - in org.apache.phoenix.end2end.DerivedTableIT
Running org.apache.phoenix.end2end.ExtendedQueryExecIT
Tests run: 4, Failures: 0, Errors: 0, Skipped: 0, Time elapsed: 3.54 sec - in org.apache.phoenix.end2end.ExtendedQueryExecIT
Running org.apache.phoenix.end2end.FunkyNamesIT
Tests run: 2, Failures: 0, Errors: 0, Skipped: 0, Time elapsed: 5.685 sec - in org.apache.phoenix.end2end.DropSchemaIT
Tests run: 10, Failures: 0, Errors: 0, Skipped: 0, Time elapsed: 10.839 sec - in org.apache.phoenix.end2end.DistinctCountIT
Running org.apache.phoenix.end2end.GroupByIT
Tests run: 3, Failures: 0, Errors: 0, Skipped: 0, Time elapsed: 3.108 sec - in org.apache.phoenix.end2end.FunkyNamesIT
Running org.apache.phoenix.end2end.MutableQueryIT
Running org.apache.phoenix.end2end.NativeHBaseTypesIT
Tests run: 7, Failures: 0, Errors: 0, Skipped: 0, Time elapsed: 2.488 sec - in org.apache.phoenix.end2end.NativeHBaseTypesIT
Running org.apache.phoenix.end2end.NotQueryIT
Tests run: 245, Failures: 0, Errors: 0, Skipped: 0, Time elapsed: 128.671 sec - in org.apache.phoenix.end2end.ClientTimeArithmeticQueryIT
Tests run: 91, Failures: 0, Errors: 0, Skipped: 0, Time elapsed: 52.064 sec - in org.apache.phoenix.end2end.GroupByIT
Running org.apache.phoenix.end2end.ProductMetricsIT
Tests run: 77, Failures: 0, Errors: 0, Skipped: 0, Time elapsed: 41.499 sec - in org.apache.phoenix.end2end.NotQueryIT
Tests run: 17, Failures: 0, Errors: 0, Skipped: 0, Time elapsed: 78.736 sec - in org.apache.phoenix.end2end.CreateTableIT
Running org.apache.phoenix.end2end.QueryDatabaseMetaDataIT
Running org.apache.phoenix.end2end.PointInTimeQueryIT
Tests run: 61, Failures: 0, Errors: 0, Skipped: 0, Time elapsed: 27.284 sec - in org.apache.phoenix.end2end.ProductMetricsIT
Running org.apache.phoenix.end2end.QueryIT
Tests run: 7, Failures: 0, Errors: 0, Skipped: 0, Time elapsed: 19.502 sec - in org.apache.phoenix.end2end.PointInTimeQueryIT
Running org.apache.phoenix.end2end.RowValueConstructorIT
Running org.apache.phoenix.end2end.ReadIsolationLevelIT
Tests run: 2, Failures: 0, Errors: 0, Skipped: 0, Time elapsed: 3.199 sec - in org.apache.phoenix.end2end.ReadIsolationLevelIT
Running org.apache.phoenix.end2end.ScanQueryIT
Tests run: 112, Failures: 0, Errors: 0, Skipped: 0, Time elapsed: 124.818 sec - in org.apache.phoenix.end2end.MutableQueryIT
Tests run: 112, Failures: 0, Errors: 0, Skipped: 0, Time elapsed: 45.629 sec - in org.apache.phoenix.end2end.QueryIT
Running org.apache.phoenix.end2end.SequenceBulkAllocationIT
Tests run: 19, Failures: 0, Errors: 0, Skipped: 0, Time elapsed: 84.356 sec - in org.apache.phoenix.end2end.QueryDatabaseMetaDataIT
Running org.apache.phoenix.end2end.ToNumberFunctionIT
Tests run: 18, Failures: 0, Errors: 0, Skipped: 0, Time elapsed: 8.42 sec - in org.apache.phoenix.end2end.ToNumberFunctionIT
Running org.apache.phoenix.end2end.TopNIT
Tests run: 46, Failures: 0, Errors: 0, Skipped: 0, Time elapsed: 61.829 sec - in org.apache.phoenix.end2end.RowValueConstructorIT
Tests run: 4, Failures: 0, Errors: 0, Skipped: 0, Time elapsed: 4.407 sec - in org.apache.phoenix.end2end.TopNIT
Running org.apache.phoenix.end2end.TruncateFunctionIT
Running org.apache.phoenix.end2end.UpsertSelectIT
Tests run: 56, Failures: 0, Errors: 0, Skipped: 0, Time elapsed: 18.958 sec - in org.apache.phoenix.end2end.SequenceBulkAllocationIT
Tests run: 1, Failures: 0, Errors: 0, Skipped: 0, Time elapsed: 2.563 sec - in org.apache.phoenix.end2end.TruncateFunctionIT
Running org.apache.phoenix.end2end.UpsertValuesIT
Running org.apache.phoenix.end2end.SequenceIT
Tests run: 112, Failures: 0, Errors: 0, Skipped: 0, Time elapsed: 46.344 sec - in org.apache.phoenix.end2end.ScanQueryIT
Running org.apache.phoenix.end2end.VariableLengthPKIT
Tests run: 54, Failures: 0, Errors: 0, Skipped: 0, Time elapsed: 25.485 sec - in org.apache.phoenix.end2end.SequenceIT
Running org.apache.phoenix.rpc.UpdateCacheWithScnIT
Running org.apache.phoenix.end2end.salted.SaltedTableIT
Tests run: 1, Failures: 0, Errors: 0, Skipped: 0, Time elapsed: 3.519 sec - in org.apache.phoenix.rpc.UpdateCacheWithScnIT
Tests run: 8, Failures: 0, Errors: 0, Skipped: 0, Time elapsed: 5.086 sec - in org.apache.phoenix.end2end.salted.SaltedTableIT
Tests run: 50, Failures: 0, Errors: 0, Skipped: 0, Time elapsed: 39.463 sec - in org.apache.phoenix.end2end.VariableLengthPKIT
Tests run: 25, Failures: 0, Errors: 0, Skipped: 0, Time elapsed: 62.308 sec - in org.apache.phoenix.end2end.UpsertValuesIT
Tests run: 22, Failures: 0, Errors: 0, Skipped: 0, Time elapsed: 72.146 sec - in org.apache.phoenix.end2end.UpsertSelectIT

Results :

Tests run: 1418, Failures: 0, Errors: 0, Skipped: 0

[INFO] 
[INFO] --- maven-failsafe-plugin:2.19.1:integration-test (HBaseManagedTimeTests) @ phoenix-core
---

-------------------------------------------------------
 T E S T S
-------------------------------------------------------

Results :

Tests run: 0, Failures: 0, Errors: 0, Skipped: 0

[INFO] 
[INFO] --- maven-failsafe-plugin:2.19.1:integration-test (NeedTheirOwnClusterTests) @ phoenix-core
---

-------------------------------------------------------
 T E S T S
-------------------------------------------------------
Running org.apache.hadoop.hbase.regionserver.wal.WALReplayWithIndexWritesAndCompressedWALIT
Tests run: 1, Failures: 0, Errors: 0, Skipped: 0, Time elapsed: 16.728 sec - in org.apache.hadoop.hbase.regionserver.wal.WALReplayWithIndexWritesAndCompressedWALIT
Running org.apache.phoenix.end2end.ConnectionUtilIT
Running org.apache.phoenix.end2end.AutomaticRebuildIT
Running org.apache.phoenix.end2end.CountDistinctCompressionIT
Running org.apache.phoenix.end2end.ContextClassloaderIT
Tests run: 1, Failures: 0, Errors: 0, Skipped: 0, Time elapsed: 19.212 sec - in org.apache.phoenix.end2end.ConnectionUtilIT
Tests run: 1, Failures: 0, Errors: 0, Skipped: 0, Time elapsed: 4.274 sec - in org.apache.phoenix.end2end.CountDistinctCompressionIT
Running org.apache.phoenix.end2end.CsvBulkLoadToolIT
Tests run: 3, Failures: 0, Errors: 0, Skipped: 0, Time elapsed: 10.44 sec - in org.apache.phoenix.end2end.ContextClassloaderIT
Running org.apache.phoenix.end2end.FlappingLocalIndexIT
Running org.apache.phoenix.end2end.IndexToolForPartialBuildIT
Running org.apache.phoenix.end2end.IndexExtendedIT
Tests run: 2, Failures: 0, Errors: 0, Skipped: 0, Time elapsed: 21.59 sec - in org.apache.phoenix.end2end.IndexToolForPartialBuildIT
Tests run: 11, Failures: 0, Errors: 0, Skipped: 0, Time elapsed: 66.341 sec - in org.apache.phoenix.end2end.CsvBulkLoadToolIT
Tests run: 40, Failures: 0, Errors: 0, Skipped: 16, Time elapsed: 45.887 sec - in org.apache.phoenix.end2end.IndexExtendedIT
Running org.apache.phoenix.end2end.IndexToolForPartialBuildWithNamespaceEnabledIT
Tests run: 8, Failures: 0, Errors: 0, Skipped: 0, Time elapsed: 63.524 sec - in org.apache.phoenix.end2end.FlappingLocalIndexIT
Running org.apache.phoenix.end2end.QueryTimeoutIT
Running org.apache.phoenix.end2end.QueryWithLimitIT
Running org.apache.phoenix.end2end.RegexBulkLoadToolIT
Tests run: 2, Failures: 0, Errors: 0, Skipped: 0, Time elapsed: 11.38 sec - in org.apache.phoenix.end2end.QueryTimeoutIT
Tests run: 2, Failures: 0, Errors: 0, Skipped: 0, Time elapsed: 12.245 sec - in org.apache.phoenix.end2end.QueryWithLimitIT
Running org.apache.phoenix.end2end.RenewLeaseIT
Tests run: 1, Failures: 0, Errors: 0, Skipped: 1, Time elapsed: 0.001 sec - in org.apache.phoenix.end2end.RenewLeaseIT
Tests run: 2, Failures: 0, Errors: 0, Skipped: 0, Time elapsed: 50.626 sec - in org.apache.phoenix.end2end.IndexToolForPartialBuildWithNamespaceEnabledIT
Tests run: 2, Failures: 0, Errors: 0, Skipped: 0, Time elapsed: 161.732 sec - in org.apache.phoenix.end2end.AutomaticRebuildIT
Running org.apache.phoenix.end2end.SpillableGroupByIT
Running org.apache.phoenix.end2end.StatsCollectorIT
Running org.apache.phoenix.end2end.SysTableNamespaceMappedStatsCollectorIT
Tests run: 2, Failures: 0, Errors: 0, Skipped: 0, Time elapsed: 11.299 sec - in org.apache.phoenix.end2end.SpillableGroupByIT
Tests run: 10, Failures: 0, Errors: 0, Skipped: 0, Time elapsed: 62.115 sec - in org.apache.phoenix.end2end.RegexBulkLoadToolIT
Running org.apache.phoenix.end2end.UserDefinedFunctionsIT
Running org.apache.phoenix.end2end.index.ImmutableIndexIT
Running org.apache.phoenix.end2end.index.LocalIndexIT
Tests run: 14, Failures: 0, Errors: 0, Skipped: 0, Time elapsed: 31.151 sec - in org.apache.phoenix.end2end.UserDefinedFunctionsIT
Running org.apache.phoenix.end2end.index.MutableIndexFailureIT
Tests run: 120, Failures: 0, Errors: 0, Skipped: 24, Time elapsed: 189.738 sec - in org.apache.phoenix.end2end.StatsCollectorIT
Tests run: 120, Failures: 0, Errors: 0, Skipped: 24, Time elapsed: 191.59 sec - in org.apache.phoenix.end2end.SysTableNamespaceMappedStatsCollectorIT
Running org.apache.phoenix.end2end.index.MutableIndexReplicationIT
Running org.apache.phoenix.end2end.index.ReadOnlyIndexFailureIT
Tests run: 1, Failures: 0, Errors: 0, Skipped: 0, Time elapsed: 18.026 sec - in org.apache.phoenix.end2end.index.MutableIndexReplicationIT
Tests run: 2, Failures: 0, Errors: 0, Skipped: 0, Time elapsed: 26.11 sec - in org.apache.phoenix.end2end.index.ReadOnlyIndexFailureIT
Tests run: 28, Failures: 0, Errors: 0, Skipped: 0, Time elapsed: 207.852 sec - in org.apache.phoenix.end2end.index.LocalIndexIT
Running org.apache.phoenix.hbase.index.FailForUnsupportedHBaseVersionsIT
Running org.apache.phoenix.end2end.index.txn.TxWriteFailureIT
Tests run: 2, Failures: 0, Errors: 0, Skipped: 0, Time elapsed: 19.488 sec - in org.apache.phoenix.hbase.index.FailForUnsupportedHBaseVersionsIT
Running org.apache.phoenix.execute.PartialCommitIT
Running org.apache.phoenix.hbase.index.covered.EndToEndCoveredColumnsIndexBuilderIT
Tests run: 12, Failures: 0, Errors: 0, Skipped: 0, Time elapsed: 4.816 sec - in org.apache.phoenix.execute.PartialCommitIT
Tests run: 2, Failures: 0, Errors: 0, Skipped: 0, Time elapsed: 8.099 sec - in org.apache.phoenix.hbase.index.covered.EndToEndCoveredColumnsIndexBuilderIT
Tests run: 24, Failures: 0, Errors: 0, Skipped: 0, Time elapsed: 269.596 sec - in org.apache.phoenix.end2end.index.ImmutableIndexIT
Running org.apache.phoenix.hbase.index.covered.example.EndToEndCoveredIndexingIT
Tests run: 8, Failures: 0, Errors: 0, Skipped: 0, Time elapsed: 51.746 sec - in org.apache.phoenix.end2end.index.txn.TxWriteFailureIT
Running org.apache.phoenix.hbase.index.covered.example.FailWithoutRetriesIT
Running org.apache.phoenix.hbase.index.covered.example.EndtoEndIndexingWithCompressionIT
Tests run: 1, Failures: 0, Errors: 0, Skipped: 0, Time elapsed: 7.942 sec - in org.apache.phoenix.hbase.index.covered.example.FailWithoutRetriesIT
Tests run: 8, Failures: 0, Errors: 0, Skipped: 0, Time elapsed: 245.951 sec - in org.apache.phoenix.end2end.index.MutableIndexFailureIT
Running org.apache.phoenix.iterate.RoundRobinResultIteratorWithStatsIT
Running org.apache.phoenix.iterate.ScannerLeaseRenewalIT
Tests run: 1, Failures: 0, Errors: 0, Skipped: 0, Time elapsed: 11.775 sec - in org.apache.phoenix.iterate.RoundRobinResultIteratorWithStatsIT
Running org.apache.phoenix.monitoring.PhoenixMetricsIT
Tests run: 11, Failures: 0, Errors: 0, Skipped: 0, Time elapsed: 62.85 sec - in org.apache.phoenix.hbase.index.covered.example.EndToEndCoveredIndexingIT
Running org.apache.phoenix.rpc.PhoenixClientRpcIT
Tests run: 2, Failures: 0, Errors: 0, Skipped: 0, Time elapsed: 5.535 sec - in org.apache.phoenix.rpc.PhoenixClientRpcIT
Tests run: 11, Failures: 0, Errors: 0, Skipped: 0, Time elapsed: 62.049 sec - in org.apache.phoenix.hbase.index.covered.example.EndtoEndIndexingWithCompressionIT
Running org.apache.phoenix.rpc.PhoenixServerRpcIT
Tests run: 21, Failures: 0, Errors: 0, Skipped: 0, Time elapsed: 50.744 sec - in org.apache.phoenix.monitoring.PhoenixMetricsIT
Tests run: 1, Failures: 0, Errors: 0, Skipped: 0, Time elapsed: 15.446 sec - in org.apache.phoenix.rpc.PhoenixServerRpcIT
Tests run: 2, Failures: 0, Errors: 0, Skipped: 0, Time elapsed: 161.773 sec - in org.apache.phoenix.iterate.ScannerLeaseRenewalIT

Results :

Tests run: 479, Failures: 0, Errors: 0, Skipped: 65

[INFO] 
[INFO] --- maven-failsafe-plugin:2.19.1:verify (ParallelStatsEnabledTest) @ phoenix-core ---
[INFO] ------------------------------------------------------------------------
[INFO] Reactor Summary:
[INFO] 
[INFO] Apache Phoenix ..................................... SUCCESS [  1.981 s]
[INFO] Phoenix Core ....................................... FAILURE [  01:07 h]
[INFO] Phoenix - Flume .................................... SKIPPED
[INFO] Phoenix - Kafka .................................... SKIPPED
[INFO] Phoenix - Pig ...................................... SKIPPED
[INFO] Phoenix Query Server Client ........................ SKIPPED
[INFO] Phoenix Query Server ............................... SKIPPED
[INFO] Phoenix - Pherf .................................... SKIPPED
[INFO] Phoenix - Spark .................................... SKIPPED
[INFO] Phoenix - Hive ..................................... SKIPPED
[INFO] Phoenix Client ..................................... SKIPPED
[INFO] Phoenix Server ..................................... SKIPPED
[INFO] Phoenix Assembly ................................... SKIPPED
[INFO] Phoenix - Tracing Web Application .................. SKIPPED
[INFO] ------------------------------------------------------------------------
[INFO] BUILD FAILURE
[INFO] ------------------------------------------------------------------------
[INFO] Total time: 01:07 h
[INFO] Finished at: 2017-03-01T03:21:03+00:00
[INFO] Final Memory: 62M/1104M
[INFO] ------------------------------------------------------------------------
[ERROR] Failed to execute goal org.apache.maven.plugins:maven-failsafe-plugin:2.19.1:verify
(ParallelStatsEnabledTest) on project phoenix-core: There was a timeout or other error in
the fork -> [Help 1]
[ERROR] 
[ERROR] To see the full stack trace of the errors, re-run Maven with the -e switch.
[ERROR] Re-run Maven using the -X switch to enable full debug logging.
[ERROR] 
[ERROR] For more information about the errors and possible solutions, please read the following
articles:
[ERROR] [Help 1] http://cwiki.apache.org/confluence/display/MAVEN/MojoExecutionException
[ERROR] 
[ERROR] After correcting the problems, you can resume the build with the command
[ERROR]   mvn <goals> -rf :phoenix-core
Build step 'Invoke top-level Maven targets' marked build as failure
Archiving artifacts
Compressed 1.33 GB of artifacts by 46.1% relative to #1456
Recording test results

Mime
View raw message