phoenix-commits mailing list archives

Site index · List index
Message view « Date » · « Thread »
Top « Date » · « Thread »
From Apache Jenkins Server <jenk...@builds.apache.org>
Subject Build failed in Jenkins: Phoenix-4.x-HBase-1.1 #349
Date Wed, 01 Mar 2017 04:02:52 GMT
See <https://builds.apache.org/job/Phoenix-4.x-HBase-1.1/349/display/redirect?page=changes>

Changes:

[samarth] PHOENIX-3703 Immutable multitenant tables created as non-encoded

[samarth] PHOENIX-3539 Fix bulkload for StorageScheme -

------------------------------------------
[...truncated 445.60 KB...]
Tests run: 2024, Failures: 0, Errors: 0, Skipped: 28

[INFO] 
[INFO] --- maven-failsafe-plugin:2.19.1:integration-test (ClientManagedTimeTests) @ phoenix-core
---

-------------------------------------------------------
 T E S T S
-------------------------------------------------------
Running org.apache.phoenix.end2end.ColumnProjectionOptimizationIT
Running org.apache.phoenix.end2end.ArrayIT
Running org.apache.phoenix.end2end.AggregateQueryIT
Running org.apache.phoenix.end2end.CaseStatementIT
Running org.apache.phoenix.end2end.CastAndCoerceIT
Running org.apache.phoenix.end2end.ClientTimeArithmeticQueryIT
Tests run: 3, Failures: 0, Errors: 0, Skipped: 0, Time elapsed: 31.111 sec - in org.apache.phoenix.end2end.ColumnProjectionOptimizationIT
Running org.apache.phoenix.end2end.CreateSchemaIT
Tests run: 1, Failures: 0, Errors: 0, Skipped: 0, Time elapsed: 0.211 sec - in org.apache.phoenix.end2end.CreateSchemaIT
Running org.apache.phoenix.end2end.CreateTableIT
Tests run: 49, Failures: 0, Errors: 0, Skipped: 0, Time elapsed: 83.632 sec - in org.apache.phoenix.end2end.CastAndCoerceIT
Tests run: 80, Failures: 0, Errors: 0, Skipped: 0, Time elapsed: 88.698 sec - in org.apache.phoenix.end2end.ArrayIT
Running org.apache.phoenix.end2end.CustomEntityDataIT
Tests run: 56, Failures: 0, Errors: 0, Skipped: 0, Time elapsed: 84.744 sec - in org.apache.phoenix.end2end.CaseStatementIT
Running org.apache.phoenix.end2end.DerivedTableIT
Running org.apache.phoenix.end2end.DistinctCountIT
Tests run: 3, Failures: 0, Errors: 0, Skipped: 0, Time elapsed: 6.368 sec - in org.apache.phoenix.end2end.CustomEntityDataIT
Running org.apache.phoenix.end2end.DropSchemaIT
Tests run: 42, Failures: 0, Errors: 0, Skipped: 0, Time elapsed: 101.405 sec - in org.apache.phoenix.end2end.AggregateQueryIT
Tests run: 18, Failures: 0, Errors: 0, Skipped: 0, Time elapsed: 15.829 sec - in org.apache.phoenix.end2end.DerivedTableIT
Running org.apache.phoenix.end2end.ExtendedQueryExecIT
Running org.apache.phoenix.end2end.FunkyNamesIT
Tests run: 2, Failures: 0, Errors: 0, Skipped: 0, Time elapsed: 11.92 sec - in org.apache.phoenix.end2end.DropSchemaIT
Tests run: 10, Failures: 0, Errors: 0, Skipped: 0, Time elapsed: 19.117 sec - in org.apache.phoenix.end2end.DistinctCountIT
Running org.apache.phoenix.end2end.GroupByIT
Tests run: 3, Failures: 0, Errors: 0, Skipped: 0, Time elapsed: 6.218 sec - in org.apache.phoenix.end2end.FunkyNamesIT
Tests run: 4, Failures: 0, Errors: 0, Skipped: 0, Time elapsed: 6.626 sec - in org.apache.phoenix.end2end.ExtendedQueryExecIT
Running org.apache.phoenix.end2end.MutableQueryIT
Running org.apache.phoenix.end2end.NotQueryIT
Running org.apache.phoenix.end2end.NativeHBaseTypesIT
Tests run: 7, Failures: 0, Errors: 0, Skipped: 0, Time elapsed: 4.535 sec - in org.apache.phoenix.end2end.NativeHBaseTypesIT
Running org.apache.phoenix.end2end.PointInTimeQueryIT
Tests run: 245, Failures: 0, Errors: 0, Skipped: 0, Time elapsed: 146.018 sec - in org.apache.phoenix.end2end.ClientTimeArithmeticQueryIT
Tests run: 77, Failures: 0, Errors: 0, Skipped: 0, Time elapsed: 53.688 sec - in org.apache.phoenix.end2end.NotQueryIT
Running org.apache.phoenix.end2end.QueryDatabaseMetaDataIT
Tests run: 91, Failures: 0, Errors: 0, Skipped: 0, Time elapsed: 65.105 sec - in org.apache.phoenix.end2end.GroupByIT
Running org.apache.phoenix.end2end.QueryIT
Running org.apache.phoenix.end2end.ProductMetricsIT
Tests run: 17, Failures: 0, Errors: 0, Skipped: 0, Time elapsed: 157.178 sec - in org.apache.phoenix.end2end.CreateTableIT
Running org.apache.phoenix.end2end.ReadIsolationLevelIT
Tests run: 2, Failures: 0, Errors: 0, Skipped: 0, Time elapsed: 6.12 sec - in org.apache.phoenix.end2end.ReadIsolationLevelIT
Running org.apache.phoenix.end2end.RowValueConstructorIT
Tests run: 61, Failures: 0, Errors: 0, Skipped: 0, Time elapsed: 19.726 sec - in org.apache.phoenix.end2end.ProductMetricsIT
Tests run: 7, Failures: 0, Errors: 0, Skipped: 0, Time elapsed: 73.326 sec - in org.apache.phoenix.end2end.PointInTimeQueryIT
Running org.apache.phoenix.end2end.SequenceBulkAllocationIT
Running org.apache.phoenix.end2end.ScanQueryIT
Tests run: 56, Failures: 0, Errors: 0, Skipped: 0, Time elapsed: 28.508 sec - in org.apache.phoenix.end2end.SequenceBulkAllocationIT
Tests run: 112, Failures: 0, Errors: 0, Skipped: 0, Time elapsed: 66.057 sec - in org.apache.phoenix.end2end.QueryIT
Tests run: 112, Failures: 0, Errors: 0, Skipped: 0, Time elapsed: 56.742 sec - in org.apache.phoenix.end2end.ScanQueryIT
Running org.apache.phoenix.end2end.SequenceIT
Running org.apache.phoenix.end2end.ToNumberFunctionIT
Tests run: 18, Failures: 0, Errors: 0, Skipped: 0, Time elapsed: 8.223 sec - in org.apache.phoenix.end2end.ToNumberFunctionIT
Running org.apache.phoenix.end2end.TruncateFunctionIT
Tests run: 1, Failures: 0, Errors: 0, Skipped: 0, Time elapsed: 5.814 sec - in org.apache.phoenix.end2end.TruncateFunctionIT
Running org.apache.phoenix.end2end.UpsertSelectIT
Tests run: 112, Failures: 0, Errors: 0, Skipped: 0, Time elapsed: 183.007 sec - in org.apache.phoenix.end2end.MutableQueryIT
Running org.apache.phoenix.end2end.TopNIT
Tests run: 19, Failures: 0, Errors: 0, Skipped: 0, Time elapsed: 133.373 sec - in org.apache.phoenix.end2end.QueryDatabaseMetaDataIT
Running org.apache.phoenix.end2end.UpsertValuesIT
Tests run: 4, Failures: 0, Errors: 0, Skipped: 0, Time elapsed: 6.161 sec - in org.apache.phoenix.end2end.TopNIT
Running org.apache.phoenix.end2end.VariableLengthPKIT
Tests run: 54, Failures: 0, Errors: 0, Skipped: 0, Time elapsed: 51.686 sec - in org.apache.phoenix.end2end.SequenceIT
Running org.apache.phoenix.rpc.UpdateCacheWithScnIT
Tests run: 1, Failures: 0, Errors: 0, Skipped: 0, Time elapsed: 6.099 sec - in org.apache.phoenix.rpc.UpdateCacheWithScnIT
Tests run: 46, Failures: 0, Errors: 0, Skipped: 0, Time elapsed: 126.433 sec - in org.apache.phoenix.end2end.RowValueConstructorIT
Running org.apache.phoenix.end2end.salted.SaltedTableIT
Tests run: 8, Failures: 0, Errors: 0, Skipped: 0, Time elapsed: 6.52 sec - in org.apache.phoenix.end2end.salted.SaltedTableIT
Tests run: 50, Failures: 0, Errors: 0, Skipped: 0, Time elapsed: 40.711 sec - in org.apache.phoenix.end2end.VariableLengthPKIT
Tests run: 22, Failures: 0, Errors: 0, Skipped: 0, Time elapsed: 137.75 sec - in org.apache.phoenix.end2end.UpsertSelectIT
Tests run: 25, Failures: 0, Errors: 0, Skipped: 0, Time elapsed: 126.722 sec - in org.apache.phoenix.end2end.UpsertValuesIT

Results :

Tests run: 1418, Failures: 0, Errors: 0, Skipped: 0

[INFO] 
[INFO] --- maven-failsafe-plugin:2.19.1:integration-test (HBaseManagedTimeTests) @ phoenix-core
---

-------------------------------------------------------
 T E S T S
-------------------------------------------------------

Results :

Tests run: 0, Failures: 0, Errors: 0, Skipped: 0

[INFO] 
[INFO] --- maven-failsafe-plugin:2.19.1:integration-test (NeedTheirOwnClusterTests) @ phoenix-core
---

-------------------------------------------------------
 T E S T S
-------------------------------------------------------
Running org.apache.hadoop.hbase.regionserver.wal.WALReplayWithIndexWritesAndCompressedWALIT
Running org.apache.phoenix.end2end.ConnectionUtilIT
Tests run: 1, Failures: 0, Errors: 0, Skipped: 0, Time elapsed: 27.492 sec - in org.apache.hadoop.hbase.regionserver.wal.WALReplayWithIndexWritesAndCompressedWALIT
Running org.apache.phoenix.end2end.AutomaticRebuildIT
Running org.apache.phoenix.end2end.CountDistinctCompressionIT
Running org.apache.phoenix.end2end.ContextClassloaderIT
Running org.apache.phoenix.end2end.CsvBulkLoadToolIT
Tests run: 1, Failures: 0, Errors: 0, Skipped: 0, Time elapsed: 28.259 sec - in org.apache.phoenix.end2end.ConnectionUtilIT
Tests run: 3, Failures: 0, Errors: 0, Skipped: 0, Time elapsed: 5.211 sec - in org.apache.phoenix.end2end.ContextClassloaderIT
Tests run: 1, Failures: 0, Errors: 0, Skipped: 0, Time elapsed: 7.527 sec - in org.apache.phoenix.end2end.CountDistinctCompressionIT
Running org.apache.phoenix.end2end.FlappingLocalIndexIT
Running org.apache.phoenix.end2end.IndexExtendedIT
Running org.apache.phoenix.end2end.IndexToolForPartialBuildIT
Running org.apache.phoenix.end2end.IndexToolForPartialBuildWithNamespaceEnabledIT
Tests run: 2, Failures: 0, Errors: 0, Skipped: 0, Time elapsed: 37.937 sec - in org.apache.phoenix.end2end.IndexToolForPartialBuildIT
Tests run: 11, Failures: 0, Errors: 0, Skipped: 0, Time elapsed: 86.901 sec - in org.apache.phoenix.end2end.CsvBulkLoadToolIT
Tests run: 2, Failures: 0, Errors: 0, Skipped: 0, Time elapsed: 55.091 sec - in org.apache.phoenix.end2end.IndexToolForPartialBuildWithNamespaceEnabledIT
Tests run: 8, Failures: 0, Errors: 0, Skipped: 0, Time elapsed: 87.994 sec - in org.apache.phoenix.end2end.FlappingLocalIndexIT
Running org.apache.phoenix.end2end.QueryTimeoutIT
Running org.apache.phoenix.end2end.QueryWithLimitIT
Running org.apache.phoenix.end2end.RegexBulkLoadToolIT
Tests run: 2, Failures: 0, Errors: 0, Skipped: 0, Time elapsed: 8.393 sec - in org.apache.phoenix.end2end.QueryWithLimitIT
Tests run: 2, Failures: 0, Errors: 0, Skipped: 0, Time elapsed: 17.841 sec - in org.apache.phoenix.end2end.QueryTimeoutIT
Running org.apache.phoenix.end2end.RenewLeaseIT
Tests run: 2, Failures: 0, Errors: 0, Skipped: 0, Time elapsed: 167.941 sec - in org.apache.phoenix.end2end.AutomaticRebuildIT
Tests run: 1, Failures: 0, Errors: 1, Skipped: 0, Time elapsed: 8.505 sec <<< FAILURE!
- in org.apache.phoenix.end2end.RenewLeaseIT
testLeaseDoesNotTimeout(org.apache.phoenix.end2end.RenewLeaseIT)  Time elapsed: 6.63 sec 
<<< ERROR!
org.apache.phoenix.exception.PhoenixIOException: org.apache.phoenix.exception.PhoenixIOException:
Failed after retry of OutOfOrderScannerNextException: was there a rpc timeout?
	at org.apache.phoenix.end2end.RenewLeaseIT.testLeaseDoesNotTimeout(RenewLeaseIT.java:68)
Caused by: java.util.concurrent.ExecutionException: org.apache.phoenix.exception.PhoenixIOException:
Failed after retry of OutOfOrderScannerNextException: was there a rpc timeout?
	at org.apache.phoenix.end2end.RenewLeaseIT.testLeaseDoesNotTimeout(RenewLeaseIT.java:68)
Caused by: org.apache.phoenix.exception.PhoenixIOException: Failed after retry of OutOfOrderScannerNextException:
was there a rpc timeout?
Caused by: org.apache.phoenix.exception.PhoenixIOException: Failed after retry of OutOfOrderScannerNextException:
was there a rpc timeout?
Caused by: org.apache.hadoop.hbase.DoNotRetryIOException: Failed after retry of OutOfOrderScannerNextException:
was there a rpc timeout?
Caused by: org.apache.hadoop.hbase.exceptions.OutOfOrderScannerNextException: 
org.apache.hadoop.hbase.exceptions.OutOfOrderScannerNextException: Expected nextCallSeq: 1
But the nextCallSeq got from client: 0; request=scanner_id: 39 number_of_rows: 2147483647
close_scanner: false next_call_seq: 0 client_handles_partials: true client_handles_heartbeats:
true renew: false
	at org.apache.hadoop.hbase.regionserver.RSRpcServices.scan(RSRpcServices.java:2351)
	at org.apache.hadoop.hbase.protobuf.generated.ClientProtos$ClientService$2.callBlockingMethod(ClientProtos.java:32385)
	at org.apache.hadoop.hbase.ipc.RpcServer.call(RpcServer.java:2137)
	at org.apache.hadoop.hbase.ipc.CallRunner.run(CallRunner.java:107)
	at org.apache.hadoop.hbase.ipc.RpcExecutor.consumerLoop(RpcExecutor.java:133)
	at org.apache.hadoop.hbase.ipc.RpcExecutor$1.run(RpcExecutor.java:108)
	at java.lang.Thread.run(Thread.java:745)

Caused by: org.apache.hadoop.hbase.ipc.RemoteWithExtrasException: 
org.apache.hadoop.hbase.exceptions.OutOfOrderScannerNextException: Expected nextCallSeq: 1
But the nextCallSeq got from client: 0; request=scanner_id: 39 number_of_rows: 2147483647
close_scanner: false next_call_seq: 0 client_handles_partials: true client_handles_heartbeats:
true renew: false
	at org.apache.hadoop.hbase.regionserver.RSRpcServices.scan(RSRpcServices.java:2351)
	at org.apache.hadoop.hbase.protobuf.generated.ClientProtos$ClientService$2.callBlockingMethod(ClientProtos.java:32385)
	at org.apache.hadoop.hbase.ipc.RpcServer.call(RpcServer.java:2137)
	at org.apache.hadoop.hbase.ipc.CallRunner.run(CallRunner.java:107)
	at org.apache.hadoop.hbase.ipc.RpcExecutor.consumerLoop(RpcExecutor.java:133)
	at org.apache.hadoop.hbase.ipc.RpcExecutor$1.run(RpcExecutor.java:108)
	at java.lang.Thread.run(Thread.java:745)


Running org.apache.phoenix.end2end.SpillableGroupByIT
Running org.apache.phoenix.end2end.StatsCollectorIT
Running org.apache.phoenix.end2end.SysTableNamespaceMappedStatsCollectorIT
Tests run: 2, Failures: 0, Errors: 0, Skipped: 0, Time elapsed: 12.762 sec - in org.apache.phoenix.end2end.SpillableGroupByIT
Tests run: 10, Failures: 0, Errors: 0, Skipped: 0, Time elapsed: 79.429 sec - in org.apache.phoenix.end2end.RegexBulkLoadToolIT
Running org.apache.phoenix.end2end.UserDefinedFunctionsIT
Running org.apache.phoenix.end2end.index.ImmutableIndexIT
Running org.apache.phoenix.end2end.index.LocalIndexIT
Tests run: 14, Failures: 0, Errors: 0, Skipped: 0, Time elapsed: 135.644 sec - in org.apache.phoenix.end2end.UserDefinedFunctionsIT
Tests run: 80, Failures: 0, Errors: 0, Skipped: 0, Time elapsed: 344.892 sec - in org.apache.phoenix.end2end.IndexExtendedIT
Running org.apache.phoenix.end2end.index.MutableIndexFailureIT
Running org.apache.phoenix.end2end.index.MutableIndexReplicationIT
Tests run: 1, Failures: 0, Errors: 0, Skipped: 0, Time elapsed: 37.546 sec - in org.apache.phoenix.end2end.index.MutableIndexReplicationIT
Running org.apache.phoenix.end2end.index.ReadOnlyIndexFailureIT
Tests run: 2, Failures: 0, Errors: 0, Skipped: 0, Time elapsed: 32.541 sec - in org.apache.phoenix.end2end.index.ReadOnlyIndexFailureIT
Running org.apache.phoenix.end2end.index.txn.TxWriteFailureIT
Tests run: 120, Failures: 0, Errors: 0, Skipped: 24, Time elapsed: 441.331 sec - in org.apache.phoenix.end2end.StatsCollectorIT
Tests run: 28, Failures: 0, Errors: 0, Skipped: 0, Time elapsed: 419.451 sec - in org.apache.phoenix.end2end.index.LocalIndexIT
Running org.apache.phoenix.hbase.index.FailForUnsupportedHBaseVersionsIT
Tests run: 24, Failures: 0, Errors: 0, Skipped: 0, Time elapsed: 477.859 sec - in org.apache.phoenix.end2end.index.ImmutableIndexIT
Running org.apache.phoenix.execute.PartialCommitIT
Tests run: 12, Failures: 0, Errors: 0, Skipped: 0, Time elapsed: 5.971 sec - in org.apache.phoenix.execute.PartialCommitIT
Tests run: 2, Failures: 0, Errors: 0, Skipped: 0, Time elapsed: 18.591 sec - in org.apache.phoenix.hbase.index.FailForUnsupportedHBaseVersionsIT
Running org.apache.phoenix.hbase.index.covered.EndToEndCoveredColumnsIndexBuilderIT
Tests run: 8, Failures: 0, Errors: 0, Skipped: 0, Time elapsed: 308.918 sec - in org.apache.phoenix.end2end.index.MutableIndexFailureIT
Tests run: 120, Failures: 0, Errors: 0, Skipped: 24, Time elapsed: 533.911 sec - in org.apache.phoenix.end2end.SysTableNamespaceMappedStatsCollectorIT
Tests run: 8, Failures: 0, Errors: 0, Skipped: 0, Time elapsed: 145.117 sec - in org.apache.phoenix.end2end.index.txn.TxWriteFailureIT
Running org.apache.phoenix.hbase.index.covered.example.FailWithoutRetriesIT
Tests run: 2, Failures: 0, Errors: 0, Skipped: 0, Time elapsed: 18.017 sec - in org.apache.phoenix.hbase.index.covered.EndToEndCoveredColumnsIndexBuilderIT
Tests run: 1, Failures: 0, Errors: 0, Skipped: 0, Time elapsed: 8.052 sec - in org.apache.phoenix.hbase.index.covered.example.FailWithoutRetriesIT
Running org.apache.phoenix.hbase.index.covered.example.EndtoEndIndexingWithCompressionIT
Running org.apache.phoenix.hbase.index.covered.example.EndToEndCoveredIndexingIT
Running org.apache.phoenix.iterate.RoundRobinResultIteratorWithStatsIT
Running org.apache.phoenix.iterate.ScannerLeaseRenewalIT
Running org.apache.phoenix.monitoring.PhoenixMetricsIT
Running org.apache.phoenix.rpc.PhoenixClientRpcIT
Tests run: 1, Failures: 0, Errors: 0, Skipped: 0, Time elapsed: 15.968 sec - in org.apache.phoenix.iterate.RoundRobinResultIteratorWithStatsIT
Tests run: 2, Failures: 0, Errors: 0, Skipped: 0, Time elapsed: 12.076 sec - in org.apache.phoenix.rpc.PhoenixClientRpcIT
Running org.apache.phoenix.rpc.PhoenixServerRpcIT
Tests run: 1, Failures: 0, Errors: 0, Skipped: 0, Time elapsed: 11.937 sec - in org.apache.phoenix.rpc.PhoenixServerRpcIT
Tests run: 20, Failures: 0, Errors: 0, Skipped: 0, Time elapsed: 73.921 sec - in org.apache.phoenix.monitoring.PhoenixMetricsIT
Tests run: 11, Failures: 0, Errors: 0, Skipped: 0, Time elapsed: 137.39 sec - in org.apache.phoenix.hbase.index.covered.example.EndtoEndIndexingWithCompressionIT
Tests run: 11, Failures: 0, Errors: 0, Skipped: 0, Time elapsed: 137.356 sec - in org.apache.phoenix.hbase.index.covered.example.EndToEndCoveredIndexingIT
Tests run: 2, Failures: 0, Errors: 0, Skipped: 0, Time elapsed: 166.934 sec - in org.apache.phoenix.iterate.ScannerLeaseRenewalIT

Results :

Tests in error: 
  RenewLeaseIT.testLeaseDoesNotTimeout:68 ยป PhoenixIO org.apache.phoenix.excepti...

Tests run: 518, Failures: 0, Errors: 1, Skipped: 48

[INFO] 
[INFO] --- maven-failsafe-plugin:2.19.1:verify (ParallelStatsEnabledTest) @ phoenix-core ---
[INFO] ------------------------------------------------------------------------
[INFO] Reactor Summary:
[INFO] 
[INFO] Apache Phoenix ..................................... SUCCESS [  1.894 s]
[INFO] Phoenix Core ....................................... FAILURE [  01:28 h]
[INFO] Phoenix - Flume .................................... SKIPPED
[INFO] Phoenix - Kafka .................................... SKIPPED
[INFO] Phoenix - Pig ...................................... SKIPPED
[INFO] Phoenix Query Server Client ........................ SKIPPED
[INFO] Phoenix Query Server ............................... SKIPPED
[INFO] Phoenix - Pherf .................................... SKIPPED
[INFO] Phoenix - Spark .................................... SKIPPED
[INFO] Phoenix - Hive ..................................... SKIPPED
[INFO] Phoenix Client ..................................... SKIPPED
[INFO] Phoenix Server ..................................... SKIPPED
[INFO] Phoenix Assembly ................................... SKIPPED
[INFO] Phoenix - Tracing Web Application .................. SKIPPED
[INFO] ------------------------------------------------------------------------
[INFO] BUILD FAILURE
[INFO] ------------------------------------------------------------------------
[INFO] Total time: 01:28 h
[INFO] Finished at: 2017-03-01T03:57:44+00:00
[INFO] Final Memory: 63M/1497M
[INFO] ------------------------------------------------------------------------
[ERROR] Failed to execute goal org.apache.maven.plugins:maven-failsafe-plugin:2.19.1:verify
(ParallelStatsEnabledTest) on project phoenix-core: There are test failures.
[ERROR] 
[ERROR] Please refer to <https://builds.apache.org/job/Phoenix-4.x-HBase-1.1/ws/phoenix-core/target/failsafe-reports>
for the individual test results.
[ERROR] -> [Help 1]
[ERROR] 
[ERROR] To see the full stack trace of the errors, re-run Maven with the -e switch.
[ERROR] Re-run Maven using the -X switch to enable full debug logging.
[ERROR] 
[ERROR] For more information about the errors and possible solutions, please read the following
articles:
[ERROR] [Help 1] http://cwiki.apache.org/confluence/display/MAVEN/MojoFailureException
[ERROR] 
[ERROR] After correcting the problems, you can resume the build with the command
[ERROR]   mvn <goals> -rf :phoenix-core
Build step 'Invoke top-level Maven targets' marked build as failure
Archiving artifacts
Recording test results

Mime
View raw message