phoenix-commits mailing list archives

Site index · List index
Message view « Date » · « Thread »
Top « Date » · « Thread »
From Apache Jenkins Server <jenk...@builds.apache.org>
Subject Build failed in Jenkins: Phoenix | Master #1587
Date Wed, 15 Mar 2017 00:11:29 GMT
See <https://builds.apache.org/job/Phoenix-master/1587/display/redirect?page=changes>

Changes:

[mujtaba] Set version to 4.11.0-HBase-1.2-SNAPSHOT after release

------------------------------------------
[...truncated 71.84 KB...]
Running org.apache.phoenix.end2end.salted.SaltedTableUpsertSelectIT
Tests run: 16, Failures: 0, Errors: 0, Skipped: 0, Time elapsed: 321.661 sec - in org.apache.phoenix.end2end.index.DropColumnIT
Running org.apache.phoenix.end2end.salted.SaltedTableVarLengthRowKeyIT
Tests run: 1, Failures: 0, Errors: 0, Skipped: 0, Time elapsed: 2.297 sec - in org.apache.phoenix.end2end.salted.SaltedTableVarLengthRowKeyIT
Running org.apache.phoenix.iterate.PhoenixQueryTimeoutIT
Tests run: 6, Failures: 0, Errors: 0, Skipped: 0, Time elapsed: 26.478 sec - in org.apache.phoenix.end2end.salted.SaltedTableUpsertSelectIT
Running org.apache.phoenix.iterate.RoundRobinResultIteratorIT
Tests run: 2, Failures: 0, Errors: 0, Skipped: 0, Time elapsed: 4.948 sec - in org.apache.phoenix.iterate.PhoenixQueryTimeoutIT
Running org.apache.phoenix.replication.SystemCatalogWALEntryFilterIT
Tests run: 2, Failures: 0, Errors: 0, Skipped: 0, Time elapsed: 0.067 sec - in org.apache.phoenix.replication.SystemCatalogWALEntryFilterIT
Running org.apache.phoenix.rpc.UpdateCacheIT
Tests run: 7, Failures: 0, Errors: 0, Skipped: 0, Time elapsed: 27.893 sec - in org.apache.phoenix.rpc.UpdateCacheIT
Running org.apache.phoenix.trace.PhoenixTableMetricsWriterIT
Tests run: 2, Failures: 0, Errors: 0, Skipped: 0, Time elapsed: 3.552 sec - in org.apache.phoenix.trace.PhoenixTableMetricsWriterIT
Running org.apache.phoenix.trace.PhoenixTraceReaderIT
Tests run: 2, Failures: 0, Errors: 0, Skipped: 0, Time elapsed: 4.618 sec - in org.apache.phoenix.trace.PhoenixTraceReaderIT
Running org.apache.phoenix.tx.FlappingTransactionIT
Tests run: 9, Failures: 0, Errors: 0, Skipped: 0, Time elapsed: 50.279 sec - in org.apache.phoenix.iterate.RoundRobinResultIteratorIT
Running org.apache.phoenix.tx.ParameterizedTransactionIT
Tests run: 4, Failures: 0, Errors: 0, Skipped: 0, Time elapsed: 9.462 sec - in org.apache.phoenix.tx.FlappingTransactionIT
Running org.apache.phoenix.tx.TransactionIT
Tests run: 12, Failures: 0, Errors: 0, Skipped: 0, Time elapsed: 424.057 sec - in org.apache.phoenix.end2end.UpgradeIT
Tests run: 99, Failures: 0, Errors: 0, Skipped: 0, Time elapsed: 1,086.215 sec - in org.apache.phoenix.end2end.HashJoinIT
Tests run: 7, Failures: 0, Errors: 0, Skipped: 0, Time elapsed: 54.4 sec - in org.apache.phoenix.tx.TransactionIT
Running org.apache.phoenix.tx.TxCheckpointIT
Tests run: 67, Failures: 0, Errors: 0, Skipped: 0, Time elapsed: 461.294 sec - in org.apache.phoenix.end2end.index.IndexExpressionIT
Tests run: 52, Failures: 0, Errors: 0, Skipped: 4, Time elapsed: 223.929 sec - in org.apache.phoenix.tx.ParameterizedTransactionIT
Tests run: 102, Failures: 0, Errors: 0, Skipped: 0, Time elapsed: 1,120.081 sec - in org.apache.phoenix.end2end.SortMergeJoinIT
Tests run: 40, Failures: 0, Errors: 0, Skipped: 0, Time elapsed: 298.097 sec - in org.apache.phoenix.tx.TxCheckpointIT
Tests run: 80, Failures: 0, Errors: 0, Skipped: 0, Time elapsed: 1,090.124 sec - in org.apache.phoenix.end2end.index.MutableIndexIT
Tests run: 304, Failures: 0, Errors: 0, Skipped: 0, Time elapsed: 2,076.073 sec - in org.apache.phoenix.end2end.index.IndexIT

Results :

Tests run: 2037, Failures: 0, Errors: 0, Skipped: 4

[INFO] 
[INFO] --- maven-failsafe-plugin:2.19.1:integration-test (ClientManagedTimeTests) @ phoenix-core
---

-------------------------------------------------------
 T E S T S
-------------------------------------------------------
Running org.apache.phoenix.end2end.ColumnProjectionOptimizationIT
Running org.apache.phoenix.end2end.ArrayIT
Running org.apache.phoenix.end2end.CreateTableIT
Running org.apache.phoenix.end2end.CreateSchemaIT
Tests run: 1, Failures: 0, Errors: 0, Skipped: 0, Time elapsed: 0.467 sec - in org.apache.phoenix.end2end.CreateSchemaIT
Running org.apache.phoenix.end2end.CustomEntityDataIT
Running org.apache.phoenix.end2end.CaseStatementIT
Running org.apache.phoenix.end2end.CastAndCoerceIT
Running org.apache.phoenix.end2end.AggregateQueryIT
Running org.apache.phoenix.end2end.ClientTimeArithmeticQueryIT
Tests run: 3, Failures: 0, Errors: 0, Skipped: 0, Time elapsed: 7.941 sec - in org.apache.phoenix.end2end.CustomEntityDataIT
Running org.apache.phoenix.end2end.DerivedTableIT
Tests run: 3, Failures: 0, Errors: 0, Skipped: 0, Time elapsed: 28.822 sec - in org.apache.phoenix.end2end.ColumnProjectionOptimizationIT
Tests run: 18, Failures: 0, Errors: 0, Skipped: 0, Time elapsed: 17.316 sec - in org.apache.phoenix.end2end.DerivedTableIT
Running org.apache.phoenix.end2end.DistinctCountIT
Running org.apache.phoenix.end2end.DropSchemaIT
Tests run: 2, Failures: 0, Errors: 0, Skipped: 0, Time elapsed: 11.862 sec - in org.apache.phoenix.end2end.DropSchemaIT
Running org.apache.phoenix.end2end.ExtendedQueryExecIT
Tests run: 4, Failures: 0, Errors: 0, Skipped: 0, Time elapsed: 6.997 sec - in org.apache.phoenix.end2end.ExtendedQueryExecIT
Tests run: 10, Failures: 0, Errors: 0, Skipped: 0, Time elapsed: 19.722 sec - in org.apache.phoenix.end2end.DistinctCountIT
Running org.apache.phoenix.end2end.FunkyNamesIT
Running org.apache.phoenix.end2end.GroupByIT
Tests run: 3, Failures: 0, Errors: 0, Skipped: 0, Time elapsed: 6.292 sec - in org.apache.phoenix.end2end.FunkyNamesIT
Running org.apache.phoenix.end2end.MutableQueryIT
Tests run: 49, Failures: 0, Errors: 0, Skipped: 0, Time elapsed: 83.742 sec - in org.apache.phoenix.end2end.CastAndCoerceIT
Tests run: 56, Failures: 0, Errors: 0, Skipped: 0, Time elapsed: 83.767 sec - in org.apache.phoenix.end2end.CaseStatementIT
Tests run: 80, Failures: 0, Errors: 0, Skipped: 0, Time elapsed: 88.836 sec - in org.apache.phoenix.end2end.ArrayIT
Running org.apache.phoenix.end2end.NotQueryIT
Running org.apache.phoenix.end2end.PointInTimeQueryIT
Running org.apache.phoenix.end2end.NativeHBaseTypesIT
Tests run: 7, Failures: 0, Errors: 0, Skipped: 0, Time elapsed: 4.393 sec - in org.apache.phoenix.end2end.NativeHBaseTypesIT
Running org.apache.phoenix.end2end.ProductMetricsIT
Tests run: 42, Failures: 0, Errors: 0, Skipped: 0, Time elapsed: 101.014 sec - in org.apache.phoenix.end2end.AggregateQueryIT
Running org.apache.phoenix.end2end.QueryDatabaseMetaDataIT
Tests run: 61, Failures: 0, Errors: 0, Skipped: 0, Time elapsed: 24.883 sec - in org.apache.phoenix.end2end.ProductMetricsIT
Tests run: 77, Failures: 0, Errors: 0, Skipped: 0, Time elapsed: 54.374 sec - in org.apache.phoenix.end2end.NotQueryIT
Tests run: 245, Failures: 0, Errors: 0, Skipped: 0, Time elapsed: 142.714 sec - in org.apache.phoenix.end2end.ClientTimeArithmeticQueryIT
Tests run: 91, Failures: 0, Errors: 0, Skipped: 0, Time elapsed: 96.439 sec - in org.apache.phoenix.end2end.GroupByIT
Tests run: 17, Failures: 0, Errors: 0, Skipped: 0, Time elapsed: 158.818 sec - in org.apache.phoenix.end2end.CreateTableIT
Running org.apache.phoenix.end2end.SequenceBulkAllocationIT
Running org.apache.phoenix.end2end.QueryIT
Tests run: 7, Failures: 0, Errors: 0, Skipped: 0, Time elapsed: 74.373 sec - in org.apache.phoenix.end2end.PointInTimeQueryIT
Running org.apache.phoenix.end2end.SequenceIT
Running org.apache.phoenix.end2end.ReadIsolationLevelIT
Running org.apache.phoenix.end2end.RowValueConstructorIT
Tests run: 56, Failures: 0, Errors: 0, Skipped: 0, Time elapsed: 26.998 sec - in org.apache.phoenix.end2end.SequenceBulkAllocationIT
Running org.apache.phoenix.end2end.ScanQueryIT
Running org.apache.phoenix.end2end.ToNumberFunctionIT
Tests run: 2, Failures: 0, Errors: 0, Skipped: 0, Time elapsed: 5.998 sec - in org.apache.phoenix.end2end.ReadIsolationLevelIT
Running org.apache.phoenix.end2end.TopNIT
Tests run: 18, Failures: 0, Errors: 0, Skipped: 0, Time elapsed: 6.865 sec - in org.apache.phoenix.end2end.ToNumberFunctionIT
Running org.apache.phoenix.end2end.TruncateFunctionIT
Tests run: 4, Failures: 0, Errors: 0, Skipped: 0, Time elapsed: 6.158 sec - in org.apache.phoenix.end2end.TopNIT
Running org.apache.phoenix.end2end.UpsertSelectIT
Tests run: 1, Failures: 0, Errors: 0, Skipped: 0, Time elapsed: 5.873 sec - in org.apache.phoenix.end2end.TruncateFunctionIT
Running org.apache.phoenix.end2end.UpsertValuesIT
Tests run: 54, Failures: 0, Errors: 0, Skipped: 0, Time elapsed: 53.202 sec - in org.apache.phoenix.end2end.SequenceIT
Tests run: 112, Failures: 0, Errors: 0, Skipped: 0, Time elapsed: 55.018 sec - in org.apache.phoenix.end2end.QueryIT
Tests run: 112, Failures: 0, Errors: 0, Skipped: 0, Time elapsed: 176.839 sec - in org.apache.phoenix.end2end.MutableQueryIT
Tests run: 19, Failures: 0, Errors: 0, Skipped: 0, Time elapsed: 133.07 sec - in org.apache.phoenix.end2end.QueryDatabaseMetaDataIT
Running org.apache.phoenix.rpc.UpdateCacheWithScnIT
Tests run: 112, Failures: 0, Errors: 0, Skipped: 0, Time elapsed: 56.175 sec - in org.apache.phoenix.end2end.ScanQueryIT
Tests run: 1, Failures: 0, Errors: 0, Skipped: 0, Time elapsed: 6.305 sec - in org.apache.phoenix.rpc.UpdateCacheWithScnIT
Running org.apache.phoenix.end2end.VariableLengthPKIT
Running org.apache.phoenix.end2end.salted.SaltedTableIT
Tests run: 8, Failures: 0, Errors: 0, Skipped: 0, Time elapsed: 6.789 sec - in org.apache.phoenix.end2end.salted.SaltedTableIT
Tests run: 50, Failures: 0, Errors: 0, Skipped: 0, Time elapsed: 44.115 sec - in org.apache.phoenix.end2end.VariableLengthPKIT
Tests run: 46, Failures: 0, Errors: 0, Skipped: 0, Time elapsed: 121.018 sec - in org.apache.phoenix.end2end.RowValueConstructorIT
Tests run: 25, Failures: 0, Errors: 0, Skipped: 0, Time elapsed: 121.511 sec - in org.apache.phoenix.end2end.UpsertValuesIT
Tests run: 22, Failures: 0, Errors: 0, Skipped: 0, Time elapsed: 137.467 sec - in org.apache.phoenix.end2end.UpsertSelectIT

Results :

Tests run: 1418, Failures: 0, Errors: 0, Skipped: 0

[INFO] 
[INFO] --- maven-failsafe-plugin:2.19.1:integration-test (HBaseManagedTimeTests) @ phoenix-core
---

-------------------------------------------------------
 T E S T S
-------------------------------------------------------

Results :

Tests run: 0, Failures: 0, Errors: 0, Skipped: 0

[INFO] 
[INFO] --- maven-failsafe-plugin:2.19.1:integration-test (NeedTheirOwnClusterTests) @ phoenix-core
---

-------------------------------------------------------
 T E S T S
-------------------------------------------------------
Running org.apache.hadoop.hbase.regionserver.wal.WALReplayWithIndexWritesAndCompressedWALIT
Running org.apache.phoenix.end2end.ConnectionUtilIT
Tests run: 1, Failures: 0, Errors: 0, Skipped: 0, Time elapsed: 27.646 sec - in org.apache.hadoop.hbase.regionserver.wal.WALReplayWithIndexWritesAndCompressedWALIT
Running org.apache.phoenix.end2end.AutomaticRebuildIT
Running org.apache.phoenix.end2end.CountDistinctCompressionIT
Running org.apache.phoenix.end2end.CsvBulkLoadToolIT
Running org.apache.phoenix.end2end.ContextClassloaderIT
Tests run: 1, Failures: 0, Errors: 0, Skipped: 0, Time elapsed: 28.281 sec - in org.apache.phoenix.end2end.ConnectionUtilIT
Tests run: 3, Failures: 0, Errors: 0, Skipped: 0, Time elapsed: 5.457 sec - in org.apache.phoenix.end2end.ContextClassloaderIT
Tests run: 1, Failures: 0, Errors: 0, Skipped: 0, Time elapsed: 7.59 sec - in org.apache.phoenix.end2end.CountDistinctCompressionIT
Running org.apache.phoenix.end2end.FlappingLocalIndexIT
Running org.apache.phoenix.end2end.IndexExtendedIT
Running org.apache.phoenix.end2end.IndexToolForPartialBuildIT
Running org.apache.phoenix.end2end.IndexToolForPartialBuildWithNamespaceEnabledIT
Running org.apache.phoenix.end2end.QueryTimeoutIT
Running org.apache.phoenix.end2end.QueryWithLimitIT
Tests run: 2, Failures: 0, Errors: 0, Skipped: 0, Time elapsed: 37.424 sec - in org.apache.phoenix.end2end.IndexToolForPartialBuildIT
Tests run: 2, Failures: 0, Errors: 0, Skipped: 0, Time elapsed: 7.864 sec - in org.apache.phoenix.end2end.QueryWithLimitIT
Tests run: 2, Failures: 0, Errors: 0, Skipped: 0, Time elapsed: 17.807 sec - in org.apache.phoenix.end2end.QueryTimeoutIT
Tests run: 11, Failures: 0, Errors: 0, Skipped: 0, Time elapsed: 77.28 sec - in org.apache.phoenix.end2end.CsvBulkLoadToolIT
Tests run: 8, Failures: 0, Errors: 0, Skipped: 0, Time elapsed: 79.948 sec - in org.apache.phoenix.end2end.FlappingLocalIndexIT
Tests run: 2, Failures: 0, Errors: 0, Skipped: 0, Time elapsed: 56.522 sec - in org.apache.phoenix.end2end.IndexToolForPartialBuildWithNamespaceEnabledIT
Running org.apache.phoenix.end2end.RegexBulkLoadToolIT
Running org.apache.phoenix.end2end.RenewLeaseIT
Running org.apache.phoenix.end2end.SpillableGroupByIT
Running org.apache.phoenix.end2end.StatsCollectorIT
Running org.apache.phoenix.end2end.SysTableNamespaceMappedStatsCollectorIT
Tests run: 2, Failures: 0, Errors: 0, Skipped: 0, Time elapsed: 17.274 sec - in org.apache.phoenix.end2end.SpillableGroupByIT
Tests run: 1, Failures: 0, Errors: 0, Skipped: 0, Time elapsed: 37.115 sec - in org.apache.phoenix.end2end.RenewLeaseIT
Running org.apache.phoenix.end2end.UserDefinedFunctionsIT
Tests run: 2, Failures: 0, Errors: 0, Skipped: 0, Time elapsed: 166.988 sec - in org.apache.phoenix.end2end.AutomaticRebuildIT
Running org.apache.phoenix.end2end.index.ImmutableIndexIT
Tests run: 10, Failures: 0, Errors: 0, Skipped: 0, Time elapsed: 77.09 sec - in org.apache.phoenix.end2end.RegexBulkLoadToolIT
Running org.apache.phoenix.end2end.index.LocalIndexIT
Running org.apache.phoenix.end2end.index.MutableIndexFailureIT
Tests run: 14, Failures: 0, Errors: 0, Skipped: 0, Time elapsed: 53.95 sec - in org.apache.phoenix.end2end.UserDefinedFunctionsIT
Running org.apache.phoenix.end2end.index.MutableIndexReplicationIT
Tests run: 1, Failures: 0, Errors: 0, Skipped: 0, Time elapsed: 26.182 sec - in org.apache.phoenix.end2end.index.MutableIndexReplicationIT
Running org.apache.phoenix.end2end.index.ReadOnlyIndexFailureIT
Tests run: 2, Failures: 0, Errors: 0, Skipped: 0, Time elapsed: 31.258 sec - in org.apache.phoenix.end2end.index.ReadOnlyIndexFailureIT
Running org.apache.phoenix.end2end.index.txn.TxWriteFailureIT
Tests run: 80, Failures: 0, Errors: 0, Skipped: 0, Time elapsed: 267.684 sec - in org.apache.phoenix.end2end.IndexExtendedIT
Running org.apache.phoenix.hbase.index.FailForUnsupportedHBaseVersionsIT
Tests run: 2, Failures: 0, Errors: 0, Skipped: 0, Time elapsed: 18.585 sec - in org.apache.phoenix.hbase.index.FailForUnsupportedHBaseVersionsIT
Running org.apache.phoenix.hbase.index.covered.EndToEndCoveredColumnsIndexBuilderIT
Running org.apache.phoenix.execute.PartialCommitIT
Tests run: 12, Failures: 0, Errors: 0, Skipped: 0, Time elapsed: 4.299 sec - in org.apache.phoenix.execute.PartialCommitIT
Tests run: 2, Failures: 0, Errors: 0, Skipped: 0, Time elapsed: 18.587 sec - in org.apache.phoenix.hbase.index.covered.EndToEndCoveredColumnsIndexBuilderIT
Tests run: 8, Failures: 0, Errors: 0, Skipped: 0, Time elapsed: 66.476 sec - in org.apache.phoenix.end2end.index.txn.TxWriteFailureIT
Running org.apache.phoenix.hbase.index.covered.example.FailWithoutRetriesIT
Running org.apache.phoenix.hbase.index.covered.example.EndToEndCoveredIndexingIT
Tests run: 1, Failures: 0, Errors: 0, Skipped: 0, Time elapsed: 8.079 sec - in org.apache.phoenix.hbase.index.covered.example.FailWithoutRetriesIT
Running org.apache.phoenix.hbase.index.covered.example.EndtoEndIndexingWithCompressionIT
Running org.apache.phoenix.iterate.RoundRobinResultIteratorWithStatsIT
Tests run: 1, Failures: 0, Errors: 0, Skipped: 0, Time elapsed: 9.361 sec - in org.apache.phoenix.iterate.RoundRobinResultIteratorWithStatsIT
Tests run: 120, Failures: 0, Errors: 0, Skipped: 24, Time elapsed: 299.84 sec - in org.apache.phoenix.end2end.StatsCollectorIT
Tests run: 120, Failures: 0, Errors: 0, Skipped: 24, Time elapsed: 303.296 sec - in org.apache.phoenix.end2end.SysTableNamespaceMappedStatsCollectorIT
Tests run: 28, Failures: 0, Errors: 0, Skipped: 0, Time elapsed: 259.235 sec - in org.apache.phoenix.end2end.index.LocalIndexIT
Running org.apache.phoenix.iterate.ScannerLeaseRenewalIT
Running org.apache.phoenix.monitoring.PhoenixMetricsIT
Running org.apache.phoenix.rpc.PhoenixClientRpcIT
Running org.apache.phoenix.rpc.PhoenixServerRpcIT
Tests run: 2, Failures: 0, Errors: 0, Skipped: 0, Time elapsed: 11.289 sec - in org.apache.phoenix.rpc.PhoenixClientRpcIT
Tests run: 24, Failures: 0, Errors: 0, Skipped: 0, Time elapsed: 311.727 sec - in org.apache.phoenix.end2end.index.ImmutableIndexIT
Tests run: 1, Failures: 0, Errors: 0, Skipped: 0, Time elapsed: 20.889 sec - in org.apache.phoenix.rpc.PhoenixServerRpcIT
Tests run: 8, Failures: 0, Errors: 0, Skipped: 0, Time elapsed: 301.917 sec - in org.apache.phoenix.end2end.index.MutableIndexFailureIT
Tests run: 11, Failures: 0, Errors: 0, Skipped: 0, Time elapsed: 147.627 sec - in org.apache.phoenix.hbase.index.covered.example.EndToEndCoveredIndexingIT
Tests run: 11, Failures: 0, Errors: 0, Skipped: 0, Time elapsed: 137.951 sec - in org.apache.phoenix.hbase.index.covered.example.EndtoEndIndexingWithCompressionIT
Tests run: 21, Failures: 0, Errors: 0, Skipped: 0, Time elapsed: 74.816 sec - in org.apache.phoenix.monitoring.PhoenixMetricsIT
Tests run: 2, Failures: 0, Errors: 0, Skipped: 0, Time elapsed: 165.25 sec - in org.apache.phoenix.iterate.ScannerLeaseRenewalIT

Results :

Tests run: 519, Failures: 0, Errors: 0, Skipped: 48

[INFO] 
[INFO] --- maven-failsafe-plugin:2.19.1:verify (ParallelStatsEnabledTest) @ phoenix-core ---
[INFO] ------------------------------------------------------------------------
[INFO] Reactor Summary:
[INFO] 
[INFO] Apache Phoenix ..................................... SUCCESS [  1.909 s]
[INFO] Phoenix Core ....................................... FAILURE [  01:14 h]
[INFO] Phoenix - Flume .................................... SKIPPED
[INFO] Phoenix - Kafka .................................... SKIPPED
[INFO] Phoenix - Pig ...................................... SKIPPED
[INFO] Phoenix Query Server Client ........................ SKIPPED
[INFO] Phoenix Query Server ............................... SKIPPED
[INFO] Phoenix - Pherf .................................... SKIPPED
[INFO] Phoenix - Spark .................................... SKIPPED
[INFO] Phoenix - Hive ..................................... SKIPPED
[INFO] Phoenix Client ..................................... SKIPPED
[INFO] Phoenix Server ..................................... SKIPPED
[INFO] Phoenix Assembly ................................... SKIPPED
[INFO] Phoenix - Tracing Web Application .................. SKIPPED
[INFO] ------------------------------------------------------------------------
[INFO] BUILD FAILURE
[INFO] ------------------------------------------------------------------------
[INFO] Total time: 01:14 h
[INFO] Finished at: 2017-03-15T00:07:51+00:00
[INFO] Final Memory: 60M/955M
[INFO] ------------------------------------------------------------------------
[ERROR] Failed to execute goal org.apache.maven.plugins:maven-failsafe-plugin:2.19.1:verify
(ParallelStatsEnabledTest) on project phoenix-core: There was a timeout or other error in
the fork -> [Help 1]
[ERROR] 
[ERROR] To see the full stack trace of the errors, re-run Maven with the -e switch.
[ERROR] Re-run Maven using the -X switch to enable full debug logging.
[ERROR] 
[ERROR] For more information about the errors and possible solutions, please read the following
articles:
[ERROR] [Help 1] http://cwiki.apache.org/confluence/display/MAVEN/MojoExecutionException
[ERROR] 
[ERROR] After correcting the problems, you can resume the build with the command
[ERROR]   mvn <goals> -rf :phoenix-core
Build step 'Invoke top-level Maven targets' marked build as failure
Archiving artifacts
Compressed 1.11 GB of artifacts by 41.7% relative to #1585
Recording test results

Mime
View raw message