phoenix-commits mailing list archives

Site index · List index
Message view « Date » · « Thread »
Top « Date » · « Thread »
From Apache Jenkins Server <jenk...@builds.apache.org>
Subject Build failed in Jenkins: Phoenix | 4.x-HBase-0.98 #1463
Date Thu, 02 Mar 2017 19:41:15 GMT
See <https://builds.apache.org/job/Phoenix-4.x-HBase-0.98/1463/display/redirect?page=changes>

Changes:

[samarth] PHOENIX-3702 RenewLeaseIT#testLeaseDoesNotTimeout failing on

------------------------------------------
[...truncated 72.70 KB...]
Tests run: 2, Failures: 0, Errors: 0, Skipped: 0, Time elapsed: 2.591 sec - in org.apache.phoenix.trace.PhoenixTableMetricsWriterIT
Running org.apache.phoenix.trace.PhoenixTraceReaderIT
Tests run: 2, Failures: 0, Errors: 0, Skipped: 0, Time elapsed: 2.619 sec - in org.apache.phoenix.trace.PhoenixTraceReaderIT
Running org.apache.phoenix.trace.PhoenixTracingEndToEndIT
Tests run: 67, Failures: 0, Errors: 0, Skipped: 0, Time elapsed: 324.416 sec - in org.apache.phoenix.end2end.index.IndexExpressionIT
Tests run: 102, Failures: 0, Errors: 0, Skipped: 0, Time elapsed: 730.833 sec - in org.apache.phoenix.end2end.SortMergeJoinIT
Tests run: 6, Failures: 0, Errors: 0, Skipped: 0, Time elapsed: 82.591 sec - in org.apache.phoenix.trace.PhoenixTracingEndToEndIT
Running org.apache.phoenix.tx.FlappingTransactionIT
Tests run: 4, Failures: 0, Errors: 0, Skipped: 0, Time elapsed: 4.601 sec - in org.apache.phoenix.tx.FlappingTransactionIT
Running org.apache.phoenix.tx.ParameterizedTransactionIT
Running org.apache.phoenix.tx.TransactionIT
Tests run: 7, Failures: 0, Errors: 0, Skipped: 0, Time elapsed: 33.892 sec - in org.apache.phoenix.tx.TransactionIT
Running org.apache.phoenix.tx.TxCheckpointIT
Tests run: 52, Failures: 0, Errors: 0, Skipped: 4, Time elapsed: 142.785 sec - in org.apache.phoenix.tx.ParameterizedTransactionIT
Tests run: 40, Failures: 0, Errors: 0, Skipped: 0, Time elapsed: 209.216 sec - in org.apache.phoenix.tx.TxCheckpointIT
Tests run: 80, Failures: 0, Errors: 0, Skipped: 0, Time elapsed: 919.957 sec - in org.apache.phoenix.end2end.index.MutableIndexIT
java.lang.OutOfMemoryError: Java heap space
Dumping heap to ./target/java_pid25734.hprof ...
Heap dump file created [3346601019 bytes in 7.631 secs]
Tests run: 304, Failures: 0, Errors: 1, Skipped: 0, Time elapsed: 3,231.164 sec <<<
FAILURE! - in org.apache.phoenix.end2end.index.IndexIT
testUpsertAfterIndexDrop[IndexIT_localIndex=true,mutable=true,transactional=true,columnEncoded=true](org.apache.phoenix.end2end.index.IndexIT)
 Time elapsed: 1,511.359 sec  <<< ERROR!
java.lang.RuntimeException: java.lang.Exception: Thrift error for org.apache.tephra.distributed.TransactionServiceClient$6@373ca407:
Internal error processing abortTx
	at org.apache.phoenix.end2end.index.IndexIT.testUpsertAfterIndexDrop(IndexIT.java:746)
Caused by: java.lang.Exception: Thrift error for org.apache.tephra.distributed.TransactionServiceClient$6@373ca407:
Internal error processing abortTx
	at org.apache.phoenix.end2end.index.IndexIT.testUpsertAfterIndexDrop(IndexIT.java:746)
Caused by: org.apache.thrift.TApplicationException: Internal error processing abortTx
	at org.apache.phoenix.end2end.index.IndexIT.testUpsertAfterIndexDrop(IndexIT.java:746)


Results :

Tests in error: 
  IndexIT.testUpsertAfterIndexDrop:746 ยป Runtime java.lang.Exception: Thrift err...

Tests run: 2024, Failures: 0, Errors: 1, Skipped: 4

[INFO] 
[INFO] --- maven-failsafe-plugin:2.19.1:integration-test (ClientManagedTimeTests) @ phoenix-core
---

-------------------------------------------------------
 T E S T S
-------------------------------------------------------
Running org.apache.phoenix.end2end.ArrayIT
Running org.apache.phoenix.end2end.CastAndCoerceIT
Running org.apache.phoenix.end2end.ClientTimeArithmeticQueryIT
Running org.apache.phoenix.end2end.CaseStatementIT
Running org.apache.phoenix.end2end.AggregateQueryIT
Tests run: 80, Failures: 0, Errors: 0, Skipped: 0, Time elapsed: 55.453 sec - in org.apache.phoenix.end2end.ArrayIT
Running org.apache.phoenix.end2end.ColumnProjectionOptimizationIT
Tests run: 49, Failures: 0, Errors: 0, Skipped: 0, Time elapsed: 58.222 sec - in org.apache.phoenix.end2end.CastAndCoerceIT
Running org.apache.phoenix.end2end.CreateSchemaIT
Tests run: 1, Failures: 0, Errors: 0, Skipped: 0, Time elapsed: 0.241 sec - in org.apache.phoenix.end2end.CreateSchemaIT
Running org.apache.phoenix.end2end.CreateTableIT
Tests run: 56, Failures: 0, Errors: 0, Skipped: 0, Time elapsed: 57.747 sec - in org.apache.phoenix.end2end.CaseStatementIT
Running org.apache.phoenix.end2end.CustomEntityDataIT
Tests run: 3, Failures: 0, Errors: 0, Skipped: 0, Time elapsed: 4.685 sec - in org.apache.phoenix.end2end.CustomEntityDataIT
Running org.apache.phoenix.end2end.DerivedTableIT
Tests run: 3, Failures: 0, Errors: 0, Skipped: 0, Time elapsed: 15.459 sec - in org.apache.phoenix.end2end.ColumnProjectionOptimizationIT
Running org.apache.phoenix.end2end.DistinctCountIT
Tests run: 18, Failures: 0, Errors: 0, Skipped: 0, Time elapsed: 13.496 sec - in org.apache.phoenix.end2end.DerivedTableIT
Running org.apache.phoenix.end2end.DropSchemaIT
Tests run: 42, Failures: 0, Errors: 0, Skipped: 0, Time elapsed: 76.195 sec - in org.apache.phoenix.end2end.AggregateQueryIT
Running org.apache.phoenix.end2end.ExtendedQueryExecIT
Tests run: 10, Failures: 0, Errors: 0, Skipped: 0, Time elapsed: 9.871 sec - in org.apache.phoenix.end2end.DistinctCountIT
Running org.apache.phoenix.end2end.FunkyNamesIT
Tests run: 3, Failures: 0, Errors: 0, Skipped: 0, Time elapsed: 3.022 sec - in org.apache.phoenix.end2end.FunkyNamesIT
Tests run: 4, Failures: 0, Errors: 0, Skipped: 0, Time elapsed: 4.085 sec - in org.apache.phoenix.end2end.ExtendedQueryExecIT
Tests run: 2, Failures: 0, Errors: 0, Skipped: 0, Time elapsed: 4.556 sec - in org.apache.phoenix.end2end.DropSchemaIT
Running org.apache.phoenix.end2end.GroupByIT
Running org.apache.phoenix.end2end.MutableQueryIT
Running org.apache.phoenix.end2end.NativeHBaseTypesIT
Tests run: 7, Failures: 0, Errors: 0, Skipped: 0, Time elapsed: 2.568 sec - in org.apache.phoenix.end2end.NativeHBaseTypesIT
Running org.apache.phoenix.end2end.NotQueryIT
Tests run: 17, Failures: 0, Errors: 0, Skipped: 0, Time elapsed: 74.235 sec - in org.apache.phoenix.end2end.CreateTableIT
Running org.apache.phoenix.end2end.PointInTimeQueryIT
Tests run: 245, Failures: 0, Errors: 0, Skipped: 0, Time elapsed: 134.144 sec - in org.apache.phoenix.end2end.ClientTimeArithmeticQueryIT
Tests run: 77, Failures: 0, Errors: 0, Skipped: 0, Time elapsed: 42.749 sec - in org.apache.phoenix.end2end.NotQueryIT
Running org.apache.phoenix.end2end.ProductMetricsIT
Tests run: 7, Failures: 0, Errors: 0, Skipped: 0, Time elapsed: 22.238 sec - in org.apache.phoenix.end2end.PointInTimeQueryIT
Running org.apache.phoenix.end2end.QueryIT
Running org.apache.phoenix.end2end.QueryDatabaseMetaDataIT
Tests run: 91, Failures: 0, Errors: 0, Skipped: 0, Time elapsed: 82.096 sec - in org.apache.phoenix.end2end.GroupByIT
Tests run: 61, Failures: 0, Errors: 0, Skipped: 0, Time elapsed: 34.339 sec - in org.apache.phoenix.end2end.ProductMetricsIT
Running org.apache.phoenix.end2end.ReadIsolationLevelIT
Tests run: 2, Failures: 0, Errors: 0, Skipped: 0, Time elapsed: 3.948 sec - in org.apache.phoenix.end2end.ReadIsolationLevelIT
Running org.apache.phoenix.end2end.ScanQueryIT
Running org.apache.phoenix.end2end.RowValueConstructorIT
Tests run: 112, Failures: 0, Errors: 0, Skipped: 0, Time elapsed: 143.656 sec - in org.apache.phoenix.end2end.MutableQueryIT
Tests run: 112, Failures: 0, Errors: 0, Skipped: 0, Time elapsed: 72.355 sec - in org.apache.phoenix.end2end.QueryIT
Tests run: 19, Failures: 0, Errors: 0, Skipped: 0, Time elapsed: 85.687 sec - in org.apache.phoenix.end2end.QueryDatabaseMetaDataIT
Running org.apache.phoenix.end2end.ToNumberFunctionIT
Running org.apache.phoenix.end2end.SequenceBulkAllocationIT
Tests run: 112, Failures: 0, Errors: 0, Skipped: 0, Time elapsed: 60.887 sec - in org.apache.phoenix.end2end.ScanQueryIT
Running org.apache.phoenix.end2end.TopNIT
Tests run: 18, Failures: 0, Errors: 0, Skipped: 0, Time elapsed: 9.528 sec - in org.apache.phoenix.end2end.ToNumberFunctionIT
Running org.apache.phoenix.end2end.TruncateFunctionIT
Running org.apache.phoenix.end2end.SequenceIT
Tests run: 4, Failures: 0, Errors: 0, Skipped: 0, Time elapsed: 4.534 sec - in org.apache.phoenix.end2end.TopNIT
Tests run: 1, Failures: 0, Errors: 0, Skipped: 0, Time elapsed: 3.736 sec - in org.apache.phoenix.end2end.TruncateFunctionIT
Running org.apache.phoenix.end2end.UpsertValuesIT
Running org.apache.phoenix.end2end.UpsertSelectIT
Tests run: 56, Failures: 0, Errors: 0, Skipped: 0, Time elapsed: 14.89 sec - in org.apache.phoenix.end2end.SequenceBulkAllocationIT
Running org.apache.phoenix.end2end.VariableLengthPKIT
Tests run: 46, Failures: 0, Errors: 0, Skipped: 0, Time elapsed: 74.134 sec - in org.apache.phoenix.end2end.RowValueConstructorIT
Running org.apache.phoenix.end2end.salted.SaltedTableIT
Tests run: 8, Failures: 0, Errors: 0, Skipped: 0, Time elapsed: 5.955 sec - in org.apache.phoenix.end2end.salted.SaltedTableIT
Running org.apache.phoenix.rpc.UpdateCacheWithScnIT
Tests run: 1, Failures: 0, Errors: 0, Skipped: 0, Time elapsed: 3.697 sec - in org.apache.phoenix.rpc.UpdateCacheWithScnIT
Tests run: 54, Failures: 0, Errors: 0, Skipped: 0, Time elapsed: 29.09 sec - in org.apache.phoenix.end2end.SequenceIT
Tests run: 50, Failures: 0, Errors: 0, Skipped: 0, Time elapsed: 44.357 sec - in org.apache.phoenix.end2end.VariableLengthPKIT
Tests run: 25, Failures: 0, Errors: 0, Skipped: 0, Time elapsed: 67.888 sec - in org.apache.phoenix.end2end.UpsertValuesIT
Tests run: 22, Failures: 0, Errors: 0, Skipped: 0, Time elapsed: 75.741 sec - in org.apache.phoenix.end2end.UpsertSelectIT

Results :

Tests run: 1418, Failures: 0, Errors: 0, Skipped: 0

[INFO] 
[INFO] --- maven-failsafe-plugin:2.19.1:integration-test (HBaseManagedTimeTests) @ phoenix-core
---

-------------------------------------------------------
 T E S T S
-------------------------------------------------------

Results :

Tests run: 0, Failures: 0, Errors: 0, Skipped: 0

[INFO] 
[INFO] --- maven-failsafe-plugin:2.19.1:integration-test (NeedTheirOwnClusterTests) @ phoenix-core
---

-------------------------------------------------------
 T E S T S
-------------------------------------------------------
Running org.apache.hadoop.hbase.regionserver.wal.WALReplayWithIndexWritesAndCompressedWALIT
Tests run: 1, Failures: 0, Errors: 0, Skipped: 0, Time elapsed: 17.384 sec - in org.apache.hadoop.hbase.regionserver.wal.WALReplayWithIndexWritesAndCompressedWALIT
Running org.apache.phoenix.end2end.ConnectionUtilIT
Running org.apache.phoenix.end2end.AutomaticRebuildIT
Running org.apache.phoenix.end2end.ContextClassloaderIT
Running org.apache.phoenix.end2end.CountDistinctCompressionIT
Tests run: 3, Failures: 0, Errors: 0, Skipped: 0, Time elapsed: 3.341 sec - in org.apache.phoenix.end2end.ContextClassloaderIT
Tests run: 1, Failures: 0, Errors: 0, Skipped: 0, Time elapsed: 4.347 sec - in org.apache.phoenix.end2end.CountDistinctCompressionIT
Running org.apache.phoenix.end2end.CsvBulkLoadToolIT
Tests run: 1, Failures: 0, Errors: 0, Skipped: 0, Time elapsed: 27.589 sec - in org.apache.phoenix.end2end.ConnectionUtilIT
Running org.apache.phoenix.end2end.FlappingLocalIndexIT
Running org.apache.phoenix.end2end.IndexToolForPartialBuildIT
Running org.apache.phoenix.end2end.IndexExtendedIT
Tests run: 2, Failures: 0, Errors: 0, Skipped: 0, Time elapsed: 23.085 sec - in org.apache.phoenix.end2end.IndexToolForPartialBuildIT
Tests run: 11, Failures: 0, Errors: 0, Skipped: 0, Time elapsed: 64.997 sec - in org.apache.phoenix.end2end.CsvBulkLoadToolIT
Tests run: 40, Failures: 0, Errors: 0, Skipped: 16, Time elapsed: 45.048 sec - in org.apache.phoenix.end2end.IndexExtendedIT
Running org.apache.phoenix.end2end.IndexToolForPartialBuildWithNamespaceEnabledIT
Tests run: 8, Failures: 0, Errors: 0, Skipped: 0, Time elapsed: 65.282 sec - in org.apache.phoenix.end2end.FlappingLocalIndexIT
Running org.apache.phoenix.end2end.QueryTimeoutIT
Running org.apache.phoenix.end2end.QueryWithLimitIT
Tests run: 2, Failures: 0, Errors: 0, Skipped: 0, Time elapsed: 11.88 sec - in org.apache.phoenix.end2end.QueryTimeoutIT
Tests run: 2, Failures: 0, Errors: 0, Skipped: 0, Time elapsed: 9.176 sec - in org.apache.phoenix.end2end.QueryWithLimitIT
Running org.apache.phoenix.end2end.RegexBulkLoadToolIT
Tests run: 2, Failures: 0, Errors: 0, Skipped: 0, Time elapsed: 51.947 sec - in org.apache.phoenix.end2end.IndexToolForPartialBuildWithNamespaceEnabledIT
Tests run: 2, Failures: 0, Errors: 0, Skipped: 0, Time elapsed: 162.119 sec - in org.apache.phoenix.end2end.AutomaticRebuildIT
Running org.apache.phoenix.end2end.RenewLeaseIT
Running org.apache.phoenix.end2end.SpillableGroupByIT
Running org.apache.phoenix.end2end.StatsCollectorIT
Tests run: 2, Failures: 0, Errors: 0, Skipped: 0, Time elapsed: 13.566 sec - in org.apache.phoenix.end2end.SpillableGroupByIT
Running org.apache.phoenix.end2end.SysTableNamespaceMappedStatsCollectorIT
Tests run: 1, Failures: 0, Errors: 0, Skipped: 0, Time elapsed: 33.746 sec - in org.apache.phoenix.end2end.RenewLeaseIT
Tests run: 10, Failures: 0, Errors: 0, Skipped: 0, Time elapsed: 62.526 sec - in org.apache.phoenix.end2end.RegexBulkLoadToolIT
Running org.apache.phoenix.end2end.index.ImmutableIndexIT
Running org.apache.phoenix.end2end.UserDefinedFunctionsIT
Running org.apache.phoenix.end2end.index.LocalIndexIT
Tests run: 14, Failures: 0, Errors: 0, Skipped: 0, Time elapsed: 33.225 sec - in org.apache.phoenix.end2end.UserDefinedFunctionsIT
Running org.apache.phoenix.end2end.index.MutableIndexFailureIT
Tests run: 120, Failures: 0, Errors: 0, Skipped: 24, Time elapsed: 182.091 sec - in org.apache.phoenix.end2end.StatsCollectorIT
Tests run: 120, Failures: 0, Errors: 0, Skipped: 24, Time elapsed: 184.692 sec - in org.apache.phoenix.end2end.SysTableNamespaceMappedStatsCollectorIT
Running org.apache.phoenix.end2end.index.MutableIndexReplicationIT
Running org.apache.phoenix.end2end.index.ReadOnlyIndexFailureIT
Tests run: 1, Failures: 0, Errors: 0, Skipped: 0, Time elapsed: 16.416 sec - in org.apache.phoenix.end2end.index.MutableIndexReplicationIT
Tests run: 2, Failures: 0, Errors: 0, Skipped: 0, Time elapsed: 25.834 sec - in org.apache.phoenix.end2end.index.ReadOnlyIndexFailureIT
Running org.apache.phoenix.end2end.index.txn.TxWriteFailureIT
Tests run: 28, Failures: 0, Errors: 0, Skipped: 0, Time elapsed: 208.637 sec - in org.apache.phoenix.end2end.index.LocalIndexIT
Running org.apache.phoenix.hbase.index.FailForUnsupportedHBaseVersionsIT
Tests run: 2, Failures: 0, Errors: 0, Skipped: 0, Time elapsed: 17.682 sec - in org.apache.phoenix.hbase.index.FailForUnsupportedHBaseVersionsIT
Running org.apache.phoenix.execute.PartialCommitIT
Tests run: 12, Failures: 0, Errors: 0, Skipped: 0, Time elapsed: 5.029 sec - in org.apache.phoenix.execute.PartialCommitIT
Running org.apache.phoenix.hbase.index.covered.EndToEndCoveredColumnsIndexBuilderIT
Tests run: 2, Failures: 0, Errors: 0, Skipped: 0, Time elapsed: 6.817 sec - in org.apache.phoenix.hbase.index.covered.EndToEndCoveredColumnsIndexBuilderIT
Tests run: 8, Failures: 0, Errors: 0, Skipped: 0, Time elapsed: 51.959 sec - in org.apache.phoenix.end2end.index.txn.TxWriteFailureIT
Running org.apache.phoenix.hbase.index.covered.example.EndToEndCoveredIndexingIT
Tests run: 24, Failures: 0, Errors: 0, Skipped: 0, Time elapsed: 270.031 sec - in org.apache.phoenix.end2end.index.ImmutableIndexIT
Running org.apache.phoenix.hbase.index.covered.example.FailWithoutRetriesIT
Running org.apache.phoenix.hbase.index.covered.example.EndtoEndIndexingWithCompressionIT
Tests run: 1, Failures: 0, Errors: 0, Skipped: 0, Time elapsed: 8.355 sec - in org.apache.phoenix.hbase.index.covered.example.FailWithoutRetriesIT
Running org.apache.phoenix.iterate.RoundRobinResultIteratorWithStatsIT
Tests run: 8, Failures: 0, Errors: 0, Skipped: 0, Time elapsed: 246.22 sec - in org.apache.phoenix.end2end.index.MutableIndexFailureIT
Running org.apache.phoenix.iterate.ScannerLeaseRenewalIT
Tests run: 1, Failures: 0, Errors: 0, Skipped: 0, Time elapsed: 12.235 sec - in org.apache.phoenix.iterate.RoundRobinResultIteratorWithStatsIT
Tests run: 11, Failures: 0, Errors: 0, Skipped: 0, Time elapsed: 52.412 sec - in org.apache.phoenix.hbase.index.covered.example.EndToEndCoveredIndexingIT
Running org.apache.phoenix.rpc.PhoenixClientRpcIT
Running org.apache.phoenix.monitoring.PhoenixMetricsIT
Tests run: 2, Failures: 0, Errors: 0, Skipped: 0, Time elapsed: 5.746 sec - in org.apache.phoenix.rpc.PhoenixClientRpcIT
Tests run: 11, Failures: 0, Errors: 0, Skipped: 0, Time elapsed: 63.096 sec - in org.apache.phoenix.hbase.index.covered.example.EndtoEndIndexingWithCompressionIT
Running org.apache.phoenix.rpc.PhoenixServerRpcIT
Tests run: 1, Failures: 0, Errors: 0, Skipped: 0, Time elapsed: 15.56 sec - in org.apache.phoenix.rpc.PhoenixServerRpcIT
Tests run: 21, Failures: 0, Errors: 0, Skipped: 0, Time elapsed: 44.765 sec - in org.apache.phoenix.monitoring.PhoenixMetricsIT
Tests run: 2, Failures: 0, Errors: 0, Skipped: 0, Time elapsed: 162.599 sec - in org.apache.phoenix.iterate.ScannerLeaseRenewalIT

Results :

Tests run: 479, Failures: 0, Errors: 0, Skipped: 64

[INFO] 
[INFO] --- maven-failsafe-plugin:2.19.1:verify (ParallelStatsEnabledTest) @ phoenix-core ---
[INFO] ------------------------------------------------------------------------
[INFO] Reactor Summary:
[INFO] 
[INFO] Apache Phoenix ..................................... SUCCESS [  1.946 s]
[INFO] Phoenix Core ....................................... FAILURE [  01:37 h]
[INFO] Phoenix - Flume .................................... SKIPPED
[INFO] Phoenix - Kafka .................................... SKIPPED
[INFO] Phoenix - Pig ...................................... SKIPPED
[INFO] Phoenix Query Server Client ........................ SKIPPED
[INFO] Phoenix Query Server ............................... SKIPPED
[INFO] Phoenix - Pherf .................................... SKIPPED
[INFO] Phoenix - Spark .................................... SKIPPED
[INFO] Phoenix - Hive ..................................... SKIPPED
[INFO] Phoenix Client ..................................... SKIPPED
[INFO] Phoenix Server ..................................... SKIPPED
[INFO] Phoenix Assembly ................................... SKIPPED
[INFO] Phoenix - Tracing Web Application .................. SKIPPED
[INFO] ------------------------------------------------------------------------
[INFO] BUILD FAILURE
[INFO] ------------------------------------------------------------------------
[INFO] Total time: 01:37 h
[INFO] Finished at: 2017-03-02T19:32:50+00:00
[INFO] Final Memory: 58M/635M
[INFO] ------------------------------------------------------------------------
[ERROR] Failed to execute goal org.apache.maven.plugins:maven-failsafe-plugin:2.19.1:verify
(ParallelStatsEnabledTest) on project phoenix-core: There was a timeout or other error in
the fork -> [Help 1]
[ERROR] 
[ERROR] To see the full stack trace of the errors, re-run Maven with the -e switch.
[ERROR] Re-run Maven using the -X switch to enable full debug logging.
[ERROR] 
[ERROR] For more information about the errors and possible solutions, please read the following
articles:
[ERROR] [Help 1] http://cwiki.apache.org/confluence/display/MAVEN/MojoExecutionException
[ERROR] 
[ERROR] After correcting the problems, you can resume the build with the command
[ERROR]   mvn <goals> -rf :phoenix-core
Build step 'Invoke top-level Maven targets' marked build as failure
Archiving artifacts
Compressed 1.29 GB of artifacts by 35.5% relative to #1456
Recording test results

Mime
View raw message