phoenix-commits mailing list archives

Site index · List index
Message view « Date » · « Thread »
Top « Date » · « Thread »
From Apache Jenkins Server <jenk...@builds.apache.org>
Subject Build failed in Jenkins: Phoenix-Calcite #76
Date Wed, 22 Feb 2017 07:03:18 GMT
See <https://builds.apache.org/job/Phoenix-calcite/76/display/redirect>

------------------------------------------
[...truncated 2.52 MB...]

testMetricsForDelete(org.apache.phoenix.monitoring.PhoenixMetricsIT)  Time elapsed: 2.344
sec  <<< ERROR!
java.sql.SQLException: 2
	at org.apache.phoenix.monitoring.PhoenixMetricsIT.insertRowsInTable(PhoenixMetricsIT.java:725)
	at org.apache.phoenix.monitoring.PhoenixMetricsIT.testMetricsForDelete(PhoenixMetricsIT.java:314)
Caused by: java.lang.ArrayIndexOutOfBoundsException: 2
	at org.apache.phoenix.monitoring.PhoenixMetricsIT.insertRowsInTable(PhoenixMetricsIT.java:725)
	at org.apache.phoenix.monitoring.PhoenixMetricsIT.testMetricsForDelete(PhoenixMetricsIT.java:314)

testReadMetricsForSelect(org.apache.phoenix.monitoring.PhoenixMetricsIT)  Time elapsed: 2.646
sec  <<< ERROR!
java.sql.SQLException: 2
	at org.apache.phoenix.monitoring.PhoenixMetricsIT.insertRowsInTable(PhoenixMetricsIT.java:725)
	at org.apache.phoenix.monitoring.PhoenixMetricsIT.testReadMetricsForSelect(PhoenixMetricsIT.java:218)
Caused by: java.lang.ArrayIndexOutOfBoundsException: 2
	at org.apache.phoenix.monitoring.PhoenixMetricsIT.insertRowsInTable(PhoenixMetricsIT.java:725)
	at org.apache.phoenix.monitoring.PhoenixMetricsIT.testReadMetricsForSelect(PhoenixMetricsIT.java:218)

testMetricsForUpsert(org.apache.phoenix.monitoring.PhoenixMetricsIT)  Time elapsed: 2.364
sec  <<< ERROR!
java.sql.SQLException: 2
	at org.apache.phoenix.monitoring.PhoenixMetricsIT.insertRowsInTable(PhoenixMetricsIT.java:725)
	at org.apache.phoenix.monitoring.PhoenixMetricsIT.testMetricsForUpsert(PhoenixMetricsIT.java:241)
Caused by: java.lang.ArrayIndexOutOfBoundsException: 2
	at org.apache.phoenix.monitoring.PhoenixMetricsIT.insertRowsInTable(PhoenixMetricsIT.java:725)
	at org.apache.phoenix.monitoring.PhoenixMetricsIT.testMetricsForUpsert(PhoenixMetricsIT.java:241)

testGlobalPhoenixMetricsForUpsertSelect(org.apache.phoenix.monitoring.PhoenixMetricsIT)  Time
elapsed: 4.723 sec  <<< FAILURE!
java.lang.AssertionError: expected:<1> but was:<0>
	at org.apache.phoenix.monitoring.PhoenixMetricsIT.testGlobalPhoenixMetricsForUpsertSelect(PhoenixMetricsIT.java:161)

testGlobalPhoenixMetricsForMutations(org.apache.phoenix.monitoring.PhoenixMetricsIT)  Time
elapsed: 2.313 sec  <<< FAILURE!
java.lang.AssertionError: expected:<10> but was:<0>
	at org.apache.phoenix.monitoring.PhoenixMetricsIT.testGlobalPhoenixMetricsForMutations(PhoenixMetricsIT.java:136)

testMetricsForDeleteWithAutoCommit(org.apache.phoenix.monitoring.PhoenixMetricsIT)  Time elapsed:
2.33 sec  <<< ERROR!
java.sql.SQLException
	at org.apache.phoenix.monitoring.PhoenixMetricsIT.upsertRows(PhoenixMetricsIT.java:388)
	at org.apache.phoenix.monitoring.PhoenixMetricsIT.testMetricsForDeleteWithAutoCommit(PhoenixMetricsIT.java:406)
Caused by: java.lang.ArrayIndexOutOfBoundsException

testMetricsForUpsertSelect(org.apache.phoenix.monitoring.PhoenixMetricsIT)  Time elapsed:
2.346 sec  <<< ERROR!
java.sql.SQLException
	at org.apache.phoenix.monitoring.PhoenixMetricsIT.insertRowsInTable(PhoenixMetricsIT.java:725)
	at org.apache.phoenix.monitoring.PhoenixMetricsIT.testMetricsForUpsertSelect(PhoenixMetricsIT.java:284)
Caused by: java.lang.ArrayIndexOutOfBoundsException

testMetricsForUpsertWithAutoCommit(org.apache.phoenix.monitoring.PhoenixMetricsIT)  Time elapsed:
2.321 sec  <<< ERROR!
java.sql.SQLException
	at org.apache.phoenix.monitoring.PhoenixMetricsIT.upsertRows(PhoenixMetricsIT.java:388)
	at org.apache.phoenix.monitoring.PhoenixMetricsIT.testMetricsForUpsertWithAutoCommit(PhoenixMetricsIT.java:367)
Caused by: java.lang.ArrayIndexOutOfBoundsException

testMetricsForUpsertSelectWithAutoCommit(org.apache.phoenix.monitoring.PhoenixMetricsIT) 
Time elapsed: 4.373 sec  <<< ERROR!
java.sql.SQLException: 2
	at org.apache.phoenix.monitoring.PhoenixMetricsIT.testMetricsForUpsertSelectWithAutoCommit(PhoenixMetricsIT.java:454)
Caused by: java.lang.ArrayIndexOutOfBoundsException: 2
	at org.apache.phoenix.monitoring.PhoenixMetricsIT.testMetricsForUpsertSelectWithAutoCommit(PhoenixMetricsIT.java:454)

Tests run: 11, Failures: 0, Errors: 0, Skipped: 0, Time elapsed: 156.133 sec - in org.apache.phoenix.hbase.index.covered.example.EndtoEndIndexingWithCompressionIT
Tests run: 8, Failures: 0, Errors: 0, Skipped: 0, Time elapsed: 333.531 sec - in org.apache.phoenix.end2end.index.MutableIndexFailureIT
Tests run: 11, Failures: 0, Errors: 0, Skipped: 0, Time elapsed: 174.544 sec - in org.apache.phoenix.hbase.index.covered.example.EndToEndCoveredIndexingIT
Tests run: 2, Failures: 0, Errors: 0, Skipped: 0, Time elapsed: 165.236 sec - in org.apache.phoenix.iterate.ScannerLeaseRenewalIT

Results :

Failed tests: 
  FlappingLocalIndexIT.testLocalIndexScanWithSmallChunks:104->BaseTest.assertEquals:1779
expected:<[z]> but was:<[a]>
  FlappingLocalIndexIT.testLocalIndexScanWithSmallChunks:104->BaseTest.assertEquals:1779
expected:<[z]> but was:<[a]>
  IndexExtendedIT.testLocalIndexScanAfterRegionsMerge:557->BaseTest.assertEquals:1779 expected:<[z]>
but was:<[a]>
  QueryTimeoutIT.testSetRPCTimeOnConnection:100
  StatsCollectorIT.testCompactUpdatesStatsWithMinStatsUpdateFreq:377->testCompactUpdatesStats:413->BaseTest.assertEquals:1823
expected:<10> but was:<-1>
  StatsCollectorIT.testCompactUpdatesStatsWithMinStatsUpdateFreq:377->testCompactUpdatesStats:413->BaseTest.assertEquals:1823
expected:<10> but was:<-1>
  StatsCollectorIT.testCompactUpdatesStatsWithMinStatsUpdateFreq:377->testCompactUpdatesStats:413->BaseTest.assertEquals:1823
expected:<10> but was:<-1>
  StatsCollectorIT.testCompactUpdatesStatsWithMinStatsUpdateFreq:377->testCompactUpdatesStats:413->BaseTest.assertEquals:1823
expected:<10> but was:<-1>
  StatsCollectorIT.testCompactUpdatesStats:372->testCompactUpdatesStats:413->BaseTest.assertEquals:1823
expected:<10> but was:<-1>
  StatsCollectorIT.testCompactUpdatesStats:372->testCompactUpdatesStats:413->BaseTest.assertEquals:1823
expected:<10> but was:<-1>
  StatsCollectorIT.testCompactUpdatesStats:372->testCompactUpdatesStats:413->BaseTest.assertEquals:1823
expected:<10> but was:<-1>
  StatsCollectorIT.testCompactUpdatesStats:372->testCompactUpdatesStats:413->BaseTest.assertEquals:1823
expected:<10> but was:<-1>
  StatsCollectorIT.testUpdateStatsWithMultipleTables:257->upsertValues:297->upsertStmt:362
  StatsCollectorIT.testUpdateStatsWithMultipleTables:257->upsertValues:297->upsertStmt:362
  StatsCollectorIT.testUpdateStatsWithMultipleTables:257->upsertValues:297->upsertStmt:362
  StatsCollectorIT.testUpdateStatsWithMultipleTables:257->upsertValues:297->upsertStmt:362
  StatsCollectorIT.testUpdateStats:189->upsertValues:297->upsertStmt:362
  StatsCollectorIT.testUpdateStats:189->upsertValues:297->upsertStmt:362
  StatsCollectorIT.testUpdateStats:189->upsertValues:297->upsertStmt:362
  StatsCollectorIT.testUpdateStats:189->upsertValues:297->upsertStmt:362
  SysTableNamespaceMappedStatsCollectorIT>StatsCollectorIT.testCompactUpdatesStatsWithMinStatsUpdateFreq:377->StatsCollectorIT.testCompactUpdatesStats:413->BaseTest.assertEquals:1823
expected:<10> but was:<-1>
  SysTableNamespaceMappedStatsCollectorIT>StatsCollectorIT.testCompactUpdatesStatsWithMinStatsUpdateFreq:377->StatsCollectorIT.testCompactUpdatesStats:413->BaseTest.assertEquals:1823
expected:<10> but was:<-1>
  SysTableNamespaceMappedStatsCollectorIT>StatsCollectorIT.testCompactUpdatesStatsWithMinStatsUpdateFreq:377->StatsCollectorIT.testCompactUpdatesStats:413->BaseTest.assertEquals:1823
expected:<10> but was:<-1>
  SysTableNamespaceMappedStatsCollectorIT>StatsCollectorIT.testCompactUpdatesStatsWithMinStatsUpdateFreq:377->StatsCollectorIT.testCompactUpdatesStats:413->BaseTest.assertEquals:1823
expected:<10> but was:<-1>
  SysTableNamespaceMappedStatsCollectorIT>StatsCollectorIT.testCompactUpdatesStats:372->StatsCollectorIT.testCompactUpdatesStats:413->BaseTest.assertEquals:1823
expected:<10> but was:<-1>
  SysTableNamespaceMappedStatsCollectorIT>StatsCollectorIT.testCompactUpdatesStats:372->StatsCollectorIT.testCompactUpdatesStats:413->BaseTest.assertEquals:1823
expected:<10> but was:<-1>
  SysTableNamespaceMappedStatsCollectorIT>StatsCollectorIT.testCompactUpdatesStats:372->StatsCollectorIT.testCompactUpdatesStats:413->BaseTest.assertEquals:1823
expected:<10> but was:<-1>
  SysTableNamespaceMappedStatsCollectorIT>StatsCollectorIT.testCompactUpdatesStats:372->StatsCollectorIT.testCompactUpdatesStats:413->BaseTest.assertEquals:1823
expected:<10> but was:<-1>
  SysTableNamespaceMappedStatsCollectorIT>StatsCollectorIT.testUpdateStatsWithMultipleTables:257->StatsCollectorIT.upsertValues:297->StatsCollectorIT.upsertStmt:362
  SysTableNamespaceMappedStatsCollectorIT>StatsCollectorIT.testUpdateStatsWithMultipleTables:257->StatsCollectorIT.upsertValues:297->StatsCollectorIT.upsertStmt:362
  SysTableNamespaceMappedStatsCollectorIT>StatsCollectorIT.testUpdateStatsWithMultipleTables:257->StatsCollectorIT.upsertValues:297->StatsCollectorIT.upsertStmt:362
  SysTableNamespaceMappedStatsCollectorIT>StatsCollectorIT.testUpdateStatsWithMultipleTables:257->StatsCollectorIT.upsertValues:297->StatsCollectorIT.upsertStmt:362
  SysTableNamespaceMappedStatsCollectorIT>StatsCollectorIT.testUpdateStats:189->StatsCollectorIT.upsertValues:297->StatsCollectorIT.upsertStmt:362
  SysTableNamespaceMappedStatsCollectorIT>StatsCollectorIT.testUpdateStats:189->StatsCollectorIT.upsertValues:297->StatsCollectorIT.upsertStmt:362
  SysTableNamespaceMappedStatsCollectorIT>StatsCollectorIT.testUpdateStats:189->StatsCollectorIT.upsertValues:297->StatsCollectorIT.upsertStmt:362
  SysTableNamespaceMappedStatsCollectorIT>StatsCollectorIT.testUpdateStats:189->StatsCollectorIT.upsertValues:297->StatsCollectorIT.upsertStmt:362
  UserDefinedFunctionsIT.testTemporaryFunctions:602 FunctionNotFoundException should be thrown
  ImmutableIndexIT.testDropIfImmutableKeyValueColumn:142->BaseTest.assertEquals:1823 expected:<1027>
but was:<0>
  ImmutableIndexIT.testDropIfImmutableKeyValueColumn:142->BaseTest.assertEquals:1823 expected:<1027>
but was:<0>
  ImmutableIndexIT.testDropIfImmutableKeyValueColumn:142->BaseTest.assertEquals:1823 expected:<1027>
but was:<0>
  ImmutableIndexIT.testDropIfImmutableKeyValueColumn:142->BaseTest.assertEquals:1823 expected:<1027>
but was:<0>
  LocalIndexIT.testLocalIndexScanJoinColumnsFromDataTable:330->BaseTest.assertEquals:1779
expected:<[f]> but was:<[b]>
  LocalIndexIT.testLocalIndexScanJoinColumnsFromDataTable:330->BaseTest.assertEquals:1779
expected:<[f]> but was:<[b]>
  LocalIndexIT.testLocalIndexesOnTableWithImmutableRows:493->BaseTest.assertEquals:1779
expected:<[a]> but was:<[z]>
  LocalIndexIT.testLocalIndexesOnTableWithImmutableRows:493->BaseTest.assertEquals:1779
expected:<[a]> but was:<[z]>
  PhoenixMetricsIT.testGlobalPhoenixMetricsForMutations:136->BaseTest.assertEquals:1823
expected:<10> but was:<0>
  PhoenixMetricsIT.testGlobalPhoenixMetricsForQueries:116->BaseTest.assertEquals:1823 expected:<1>
but was:<0>
  PhoenixMetricsIT.testGlobalPhoenixMetricsForUpsertSelect:161->BaseTest.assertEquals:1823
expected:<1> but was:<0>
Tests in error: 
  AutomaticRebuildIT.testSecondaryAutomaticRebuildIndex:156 » SQL Error while ex...
  AutomaticRebuildIT.testSecondaryAutomaticRebuildIndex:156 » SQL Error while ex...
  CsvBulkLoadToolIT.testFullOptionImport:153 » SQL Error while executing SQL "SE...
  CsvBulkLoadToolIT.testImportOneIndexTable:283->testImportOneIndexTable:318 » SQL
  CsvBulkLoadToolIT.testImportOneLocalIndexTable:288->testImportOneIndexTable:318 » SQL
  CsvBulkLoadToolIT.testImportWithIndex:232 » SQL Error while executing SQL "SEL...
  CsvBulkLoadToolIT.testMultipleInputFiles:191 » SQL Error while executing SQL "...
  IndexExtendedIT.testDeleteFromImmutable:355 » SQL Error while executing SQL "d...
  IndexExtendedIT.testDeleteFromImmutable:355 » SQL Error while executing SQL "d...
  IndexExtendedIT.testMutableIndexWithUpdates:163 » SQL Error while executing SQ...
  IndexExtendedIT.testMutableIndexWithUpdates:163 » SQL Error while executing SQ...
  IndexExtendedIT.testMutableIndexWithUpdates:163 » SQL Error while executing SQ...
  IndexExtendedIT.testMutableIndexWithUpdates:163 » SQL Error while executing SQ...
  IndexExtendedIT.testSecondaryIndex:246 » SQL Error while executing SQL "EXPLAI...
  IndexExtendedIT.testSecondaryIndex:246 » SQL Error while executing SQL "EXPLAI...
  IndexExtendedIT.testSecondaryIndex:246 » SQL Error while executing SQL "EXPLAI...
  IndexExtendedIT.testSecondaryIndex:246 » SQL Error while executing SQL "EXPLAI...
  IndexExtendedIT.testSecondaryIndex:246 » SQL Error while executing SQL "EXPLAI...
  IndexExtendedIT.testSecondaryIndex:246 » SQL Error while executing SQL "EXPLAI...
  IndexExtendedIT.testSecondaryIndex:246 » SQL Error while executing SQL "EXPLAI...
  IndexExtendedIT.testSecondaryIndex:246 » SQL Error while executing SQL "EXPLAI...
  IndexExtendedIT.testSecondaryIndex:246 » SQL Error while executing SQL "EXPLAI...
  IndexExtendedIT.testSecondaryIndex:246 » SQL Error while executing SQL "EXPLAI...
  IndexExtendedIT.testSecondaryIndex:246 » SQL Error while executing SQL "EXPLAI...
  IndexExtendedIT.testSecondaryIndex:246 » SQL Error while executing SQL "EXPLAI...
  IndexExtendedIT.testSecondaryIndex:246 » SQL Error while executing SQL "EXPLAI...
  IndexExtendedIT.testSecondaryIndex:246 » SQL Error while executing SQL "EXPLAI...
  IndexExtendedIT.testSecondaryIndex:246 » SQL Error while executing SQL "EXPLAI...
  IndexExtendedIT.testSecondaryIndex:246 » SQL Error while executing SQL "EXPLAI...
  IndexToolForPartialBuildIT.testSecondaryIndex:163 » SQL Error while executing ...
  IndexToolForPartialBuildIT.testSecondaryIndex:163 » SQL Error while executing ...
  IndexToolForPartialBuildWithNamespaceEnabledIT>IndexToolForPartialBuildIT.testSecondaryIndex:163
» SQL
  IndexToolForPartialBuildWithNamespaceEnabledIT>IndexToolForPartialBuildIT.testSecondaryIndex:163
» SQL
  QueryTimeoutIT.testQueryTimeout:126 » SQL does not implement 'class org.apache...
  SpillableGroupByIT.testScanUri:120 » SQL Error while executing SQL "select cou...
  SpillableGroupByIT.testStatisticsAreNotWritten:164 » SQL Error while executing...
  StatsCollectorIT.testNoDuplicatesAfterUpdateStatsWithDesc:238->testNoDuplicatesAfterUpdateStats:221
» SQL
  StatsCollectorIT.testNoDuplicatesAfterUpdateStatsWithDesc:238->testNoDuplicatesAfterUpdateStats:221
» SQL
  StatsCollectorIT.testNoDuplicatesAfterUpdateStatsWithDesc:238->testNoDuplicatesAfterUpdateStats:221
» SQL
  StatsCollectorIT.testNoDuplicatesAfterUpdateStatsWithDesc:238->testNoDuplicatesAfterUpdateStats:221
» SQL
  StatsCollectorIT.testNoDuplicatesAfterUpdateStatsWithSplits:233->testNoDuplicatesAfterUpdateStats:221
» SQL
  StatsCollectorIT.testNoDuplicatesAfterUpdateStatsWithSplits:233->testNoDuplicatesAfterUpdateStats:221
» SQL
  StatsCollectorIT.testNoDuplicatesAfterUpdateStatsWithSplits:233->testNoDuplicatesAfterUpdateStats:221
» SQL
  StatsCollectorIT.testNoDuplicatesAfterUpdateStatsWithSplits:233->testNoDuplicatesAfterUpdateStats:221
» SQL
  StatsCollectorIT.testRowCountAndByteCounts:564 » SQL Error while executing SQL...
  StatsCollectorIT.testRowCountAndByteCounts:564 » SQL Error while executing SQL...
  StatsCollectorIT.testRowCountAndByteCounts:564 » SQL Error while executing SQL...
  StatsCollectorIT.testRowCountAndByteCounts:564 » SQL Error while executing SQL...
  StatsCollectorIT.testWithMultiCF:490 » SQL Error while executing SQL "SELECT C...
  StatsCollectorIT.testWithMultiCF:490 » SQL Error while executing SQL "SELECT C...
  StatsCollectorIT.testWithMultiCF:490 » SQL Error while executing SQL "SELECT C...
  StatsCollectorIT.testWithMultiCF:490 » SQL Error while executing SQL "SELECT C...
  SysTableNamespaceMappedStatsCollectorIT>StatsCollectorIT.testNoDuplicatesAfterUpdateStatsWithDesc:238->StatsCollectorIT.testNoDuplicatesAfterUpdateStats:221
» SQL
  SysTableNamespaceMappedStatsCollectorIT>StatsCollectorIT.testNoDuplicatesAfterUpdateStatsWithDesc:238->StatsCollectorIT.testNoDuplicatesAfterUpdateStats:221
» SQL
  SysTableNamespaceMappedStatsCollectorIT>StatsCollectorIT.testNoDuplicatesAfterUpdateStatsWithDesc:238->StatsCollectorIT.testNoDuplicatesAfterUpdateStats:221
» SQL
  SysTableNamespaceMappedStatsCollectorIT>StatsCollectorIT.testNoDuplicatesAfterUpdateStatsWithDesc:238->StatsCollectorIT.testNoDuplicatesAfterUpdateStats:221
» SQL
  SysTableNamespaceMappedStatsCollectorIT>StatsCollectorIT.testNoDuplicatesAfterUpdateStatsWithSplits:233->StatsCollectorIT.testNoDuplicatesAfterUpdateStats:221
» SQL
  SysTableNamespaceMappedStatsCollectorIT>StatsCollectorIT.testNoDuplicatesAfterUpdateStatsWithSplits:233->StatsCollectorIT.testNoDuplicatesAfterUpdateStats:221
» SQL
  SysTableNamespaceMappedStatsCollectorIT>StatsCollectorIT.testNoDuplicatesAfterUpdateStatsWithSplits:233->StatsCollectorIT.testNoDuplicatesAfterUpdateStats:221
» SQL
  SysTableNamespaceMappedStatsCollectorIT>StatsCollectorIT.testNoDuplicatesAfterUpdateStatsWithSplits:233->StatsCollectorIT.testNoDuplicatesAfterUpdateStats:221
» SQL
  SysTableNamespaceMappedStatsCollectorIT>StatsCollectorIT.testRowCountAndByteCounts:564
» SQL
  SysTableNamespaceMappedStatsCollectorIT>StatsCollectorIT.testRowCountAndByteCounts:564
» SQL
  SysTableNamespaceMappedStatsCollectorIT>StatsCollectorIT.testRowCountAndByteCounts:564
» SQL
  SysTableNamespaceMappedStatsCollectorIT>StatsCollectorIT.testRowCountAndByteCounts:564
» SQL
  SysTableNamespaceMappedStatsCollectorIT>StatsCollectorIT.testWithMultiCF:490 » SQL
  SysTableNamespaceMappedStatsCollectorIT>StatsCollectorIT.testWithMultiCF:490 » SQL
  SysTableNamespaceMappedStatsCollectorIT>StatsCollectorIT.testWithMultiCF:490 » SQL
  SysTableNamespaceMappedStatsCollectorIT>StatsCollectorIT.testWithMultiCF:490 » SQL
  UserDefinedFunctionsIT.testCreateFunction:394 » SQL Error while executing SQL ...
  UserDefinedFunctionsIT.testDeleteJar:302 » SQL Error while executing SQL "sele...
  UserDefinedFunctionsIT.testDropFunction:638 » SQL Error while executing SQL "s...
  UserDefinedFunctionsIT.testFunctionalIndexesWithUDFFunction:764 » FunctionNotFound
  UserDefinedFunctionsIT.testListJars:282 » SQL Error while executing SQL "selec...
  UserDefinedFunctionsIT.testUDFsWhenTimestampManagedAtClient:690 » SQL Error wh...
  UserDefinedFunctionsIT.testUDFsWithMultipleConnections:514 » SQL Error while e...
  ImmutableIndexIT.testCreateIndexDuringUpsertSelect:171->BaseTest.upsertRows:1615->BaseTest.upsertRow:1642
» SQL
  ImmutableIndexIT.testCreateIndexDuringUpsertSelect:171->BaseTest.upsertRows:1615->BaseTest.upsertRow:1642
» SQL
  LocalIndexIT.testLocalIndexCreationWithDefaultFamilyOption:554 » SQL Error whi...
  LocalIndexIT.testLocalIndexCreationWithDefaultFamilyOption:554 » SQL Error whi...
  LocalIndexIT.testLocalIndexRowsShouldBeDeletedWhenUserTableRowsDeleted:459 » SQL
  LocalIndexIT.testLocalIndexRowsShouldBeDeletedWhenUserTableRowsDeleted:459 » SQL
  RoundRobinResultIteratorWithStatsIT.testRoundRobinBehavior:87 » SQL Cannot cal...
  PhoenixMetricsIT.testMetricsForDelete:314->insertRowsInTable:725 » SQL 2
  PhoenixMetricsIT.testMetricsForDeleteWithAutoCommit:406->upsertRows:388 » SQL
  PhoenixMetricsIT.testMetricsForUpsert:241->insertRowsInTable:725 » SQL 2
  PhoenixMetricsIT.testMetricsForUpsertSelect:284->insertRowsInTable:725 » SQL
  PhoenixMetricsIT.testMetricsForUpsertSelectWithAutoCommit:454 » SQL 2
  PhoenixMetricsIT.testMetricsForUpsertWithAutoCommit:367->upsertRows:388 » SQL
  PhoenixMetricsIT.testNoMetricsCollectedForConnection:337->insertRowsInTable:725 » SQL
  PhoenixMetricsIT.testReadMetricsForSelect:218->insertRowsInTable:725 » SQL 2
  PhoenixClientRpcIT.testIndexQos:107 NullPointer
  PhoenixClientRpcIT.testMetadataQos:121 NullPointer
  PhoenixServerRpcIT.testIndexQos:164 NullPointer

Tests run: 333, Failures: 48, Errors: 93, Skipped: 0

[INFO] 
[INFO] --- maven-failsafe-plugin:2.19.1:verify (ParallelStatsEnabledTest) @ phoenix-core ---
[INFO] ------------------------------------------------------------------------
[INFO] Reactor Summary:
[INFO] 
[INFO] Apache Phoenix ..................................... SUCCESS [  2.125 s]
[INFO] Phoenix Core ....................................... FAILURE [37:36 min]
[INFO] Phoenix - Flume .................................... SKIPPED
[INFO] Phoenix - Pig ...................................... SKIPPED
[INFO] Phoenix Query Server Client ........................ SKIPPED
[INFO] Phoenix Query Server ............................... SKIPPED
[INFO] Phoenix - Pherf .................................... SKIPPED
[INFO] Phoenix - Spark .................................... SKIPPED
[INFO] Phoenix - Hive ..................................... SKIPPED
[INFO] Phoenix Client ..................................... SKIPPED
[INFO] Phoenix Server ..................................... SKIPPED
[INFO] Phoenix Assembly ................................... SKIPPED
[INFO] Phoenix - Tracing Web Application .................. SKIPPED
[INFO] ------------------------------------------------------------------------
[INFO] BUILD FAILURE
[INFO] ------------------------------------------------------------------------
[INFO] Total time: 37:40 min
[INFO] Finished at: 2017-02-22T07:02:47+00:00
[INFO] Final Memory: 88M/1577M
[INFO] ------------------------------------------------------------------------
[ERROR] Failed to execute goal org.apache.maven.plugins:maven-failsafe-plugin:2.19.1:verify
(ParallelStatsEnabledTest) on project phoenix-core: There was a timeout or other error in
the fork -> [Help 1]
[ERROR] 
[ERROR] To see the full stack trace of the errors, re-run Maven with the -e switch.
[ERROR] Re-run Maven using the -X switch to enable full debug logging.
[ERROR] 
[ERROR] For more information about the errors and possible solutions, please read the following
articles:
[ERROR] [Help 1] http://cwiki.apache.org/confluence/display/MAVEN/MojoExecutionException
[ERROR] 
[ERROR] After correcting the problems, you can resume the build with the command
[ERROR]   mvn <goals> -rf :phoenix-core
Build step 'Invoke top-level Maven targets' marked build as failure
Archiving artifacts
No prior successful build to compare, so performing full copy of artifacts
Recording test results

Mime
View raw message