phoenix-commits mailing list archives

Site index · List index
Message view « Date » · « Thread »
Top « Date » · « Thread »
From Apache Jenkins Server <jenk...@builds.apache.org>
Subject Build failed in Jenkins: Phoenix-Calcite #57
Date Fri, 27 Jan 2017 01:35:06 GMT
See <https://builds.apache.org/job/Phoenix-calcite/57/changes>

Changes:

[ankitsinghal59] PHOENIX-3540 Fix Time data type in Phoenix Spark integration

[tdsilva] PHOENIX-3516 Performance Issues with queries that have compound filters

[elserj] PHOENIX-3505 Avoid NPE on close() in OrderedResultIterator

[elserj] PHOENIX-32451 Support DATE and TIMESTAMP in CONVERT_TZ()

[ankitsinghal59] PHOENIX-2890 Extend IndexTool to allow incremental index rebuilds

[ankitsinghal59] PHOENIX-2890 Extend IndexTool to allow incremental index

[ankitsinghal59] PHOENIX-3544 Fix UNSIGNED_DATE and UNSIGNED_TIME type in phoenix-spark

[tdsilva] PHOENIX-3516 Performance Issues with queries that have compound filters

[jmahonin] PHOENIX-3333 Support Spark 2.0

[elserj] PHOENIX-3557 Provide a good error message when an invalid test pattern

[elserj] PHOENIX-3565 Set failIfNoTests=false on surefire and failsafe

[apurtell] PHOENIX-3563 Ensure we release ZooKeeper resources allocated by the

[samarth] PHOENIX-3584 Expose metrics for ConnectionQueryServices instances and

[jamestaylor] PHOENIX-3553 Zookeeper connection should be closed immediately after

[elserj] PHOENIX-3567 Use argparse for sqlline

[ankitsinghal59] PHOENIX-3134 varbinary fields bulk load difference between MR/psql and

[rajeshbabu] PHOENIX-3468 Double quote SYSTEM, USER,DATE keywords in IT

[rajeshbabu] PHOENIX-3608 KeyRange interset should return EMPTY_RANGE when one of it

[rajeshbabu] PHOENIX-3613 Avoid possible SQL Injection with proper input

[apurtell] PHOENIX-3611 Cache for client connections will expire (and close)

[rajeshbabu] PHOENIX-3351 Implement TODOs in PhoenixTableModify#upsert to allow

[samarth] PHOENIX-541 Make mutable batch size bytes-based instead of row-based

[samarth] PHOENIX-3614 Use unique name for index in

[maryannxue] Adapt SqlNode interface change

------------------------------------------
[...truncated 6559 lines...]
Caused by: org.apache.calcite.sql.validate.SqlValidatorException: Object 'T_T000080' not found
	at org.apache.phoenix.end2end.ViewIT.testUpdatableOnUpdatableView(ViewIT.java:141)

testReadOnlyViewWithCaseSensitiveTableNames[transactional = true](org.apache.phoenix.end2end.ViewIT)
 Time elapsed: 2.333 sec  <<< ERROR!
java.sql.SQLException: Error while executing SQL "UPSERT INTO "v_T000086" VALUES(1)": From
line 1, column 13 to line 1, column 23: Object 'v_T000086' not found
	at org.apache.phoenix.end2end.ViewIT.testReadOnlyViewWithCaseSensitiveTableNames(ViewIT.java:255)
Caused by: org.apache.calcite.runtime.CalciteContextException: From line 1, column 13 to line
1, column 23: Object 'v_T000086' not found
	at org.apache.phoenix.end2end.ViewIT.testReadOnlyViewWithCaseSensitiveTableNames(ViewIT.java:255)
Caused by: org.apache.calcite.sql.validate.SqlValidatorException: Object 'v_T000086' not found
	at org.apache.phoenix.end2end.ViewIT.testReadOnlyViewWithCaseSensitiveTableNames(ViewIT.java:255)

testViewUsesTableLocalIndex[transactional = true](org.apache.phoenix.end2end.ViewIT)  Time
elapsed: 8.508 sec  <<< ERROR!
java.sql.SQLException: Error while executing SQL "UPSERT INTO T_T000094_WITH_LI VALUES(0,100,1,'foo','bas')":
From line 1, column 13 to line 1, column 29: Object 'T_T000094_WITH_LI' not found
	at org.apache.phoenix.end2end.ViewIT.testViewUsesTableIndex(ViewIT.java:529)
	at org.apache.phoenix.end2end.ViewIT.testViewUsesTableLocalIndex(ViewIT.java:506)
Caused by: org.apache.calcite.runtime.CalciteContextException: From line 1, column 13 to line
1, column 29: Object 'T_T000094_WITH_LI' not found
	at org.apache.phoenix.end2end.ViewIT.testViewUsesTableIndex(ViewIT.java:529)
	at org.apache.phoenix.end2end.ViewIT.testViewUsesTableLocalIndex(ViewIT.java:506)
Caused by: org.apache.calcite.sql.validate.SqlValidatorException: Object 'T_T000094_WITH_LI'
not found
	at org.apache.phoenix.end2end.ViewIT.testViewUsesTableIndex(ViewIT.java:529)
	at org.apache.phoenix.end2end.ViewIT.testViewUsesTableLocalIndex(ViewIT.java:506)

testViewUsesTableGlobalIndex[transactional = true](org.apache.phoenix.end2end.ViewIT)  Time
elapsed: 4.84 sec  <<< ERROR!
java.sql.SQLException: Error while executing SQL "UPSERT INTO T_T000100_WITHOUT_LI VALUES(0,100,1,'foo','bas')":
From line 1, column 13 to line 1, column 32: Object 'T_T000100_WITHOUT_LI' not found
	at org.apache.phoenix.end2end.ViewIT.testViewUsesTableIndex(ViewIT.java:529)
	at org.apache.phoenix.end2end.ViewIT.testViewUsesTableGlobalIndex(ViewIT.java:501)
Caused by: org.apache.calcite.runtime.CalciteContextException: From line 1, column 13 to line
1, column 32: Object 'T_T000100_WITHOUT_LI' not found
	at org.apache.phoenix.end2end.ViewIT.testViewUsesTableIndex(ViewIT.java:529)
	at org.apache.phoenix.end2end.ViewIT.testViewUsesTableGlobalIndex(ViewIT.java:501)
Caused by: org.apache.calcite.sql.validate.SqlValidatorException: Object 'T_T000100_WITHOUT_LI'
not found
	at org.apache.phoenix.end2end.ViewIT.testViewUsesTableIndex(ViewIT.java:529)
	at org.apache.phoenix.end2end.ViewIT.testViewUsesTableGlobalIndex(ViewIT.java:501)

testNonSaltedUpdatableViewWithLocalIndex[transactional = true](org.apache.phoenix.end2end.ViewIT)
 Time elapsed: 1.313 sec  <<< ERROR!
java.sql.SQLException: Error while executing SQL "UPSERT INTO T_T000104 VALUES(0,100,1)":
From line 1, column 13 to line 1, column 21: Object 'T_T000104' not found
	at org.apache.phoenix.end2end.ViewIT.testNonSaltedUpdatableViewWithLocalIndex(ViewIT.java:136)
Caused by: org.apache.calcite.runtime.CalciteContextException: From line 1, column 13 to line
1, column 21: Object 'T_T000104' not found
	at org.apache.phoenix.end2end.ViewIT.testNonSaltedUpdatableViewWithLocalIndex(ViewIT.java:136)
Caused by: org.apache.calcite.sql.validate.SqlValidatorException: Object 'T_T000104' not found
	at org.apache.phoenix.end2end.ViewIT.testNonSaltedUpdatableViewWithLocalIndex(ViewIT.java:136)

testCreateViewDefinesPKConstraint[transactional = true](org.apache.phoenix.end2end.ViewIT)
 Time elapsed: 2.27 sec  <<< ERROR!
java.sql.SQLException: 
Error while executing SQL "CREATE VIEW V_T000107(v2 VARCHAR, k3 VARCHAR, k4 INTEGER NOT NULL,
CONSTRAINT PKVEW PRIMARY KEY (k3, k4)) AS SELECT * FROM T_T000106 WHERE K1 = 1": parse failed:
Encountered ", CONSTRAINT" at line 1, column 66.
Was expecting one of:
    ")" ...
    "," <IDENTIFIER> ...
    "," <QUOTED_IDENTIFIER> ...
    "," <BACK_QUOTED_IDENTIFIER> ...
    "," <BRACKET_QUOTED_IDENTIFIER> ...
    "," <UNICODE_QUOTED_IDENTIFIER> ...
    "PRIMARY" ...
    "ASC" ...
    "DESC" ...
    "ROW_TIMESTAMP" ...
    
	at org.apache.phoenix.end2end.ViewIT.testCreateViewDefinesPKConstraint(ViewIT.java:596)
Caused by: java.lang.RuntimeException: 
parse failed: Encountered ", CONSTRAINT" at line 1, column 66.
Was expecting one of:
    ")" ...
    "," <IDENTIFIER> ...
    "," <QUOTED_IDENTIFIER> ...
    "," <BACK_QUOTED_IDENTIFIER> ...
    "," <BRACKET_QUOTED_IDENTIFIER> ...
    "," <UNICODE_QUOTED_IDENTIFIER> ...
    "PRIMARY" ...
    "ASC" ...
    "DESC" ...
    "ROW_TIMESTAMP" ...
    
	at org.apache.phoenix.end2end.ViewIT.testCreateViewDefinesPKConstraint(ViewIT.java:596)
Caused by: org.apache.calcite.sql.parser.SqlParseException: 
Encountered ", CONSTRAINT" at line 1, column 66.
Was expecting one of:
    ")" ...
    "," <IDENTIFIER> ...
    "," <QUOTED_IDENTIFIER> ...
    "," <BACK_QUOTED_IDENTIFIER> ...
    "," <BRACKET_QUOTED_IDENTIFIER> ...
    "," <UNICODE_QUOTED_IDENTIFIER> ...
    "PRIMARY" ...
    "ASC" ...
    "DESC" ...
    "ROW_TIMESTAMP" ...
    
	at org.apache.phoenix.end2end.ViewIT.testCreateViewDefinesPKConstraint(ViewIT.java:596)
Caused by: org.apache.phoenix.calcite.parser.ParseException: 
Encountered ", CONSTRAINT" at line 1, column 66.
Was expecting one of:
    ")" ...
    "," <IDENTIFIER> ...
    "," <QUOTED_IDENTIFIER> ...
    "," <BACK_QUOTED_IDENTIFIER> ...
    "," <BRACKET_QUOTED_IDENTIFIER> ...
    "," <UNICODE_QUOTED_IDENTIFIER> ...
    "PRIMARY" ...
    "ASC" ...
    "DESC" ...
    "ROW_TIMESTAMP" ...
    
	at org.apache.phoenix.end2end.ViewIT.testCreateViewDefinesPKConstraint(ViewIT.java:596)

testReadOnlyViewWithCaseSensitiveColumnNames[transactional = true](org.apache.phoenix.end2end.ViewIT)
 Time elapsed: 2.289 sec  <<< ERROR!
java.sql.SQLException: Error while executing SQL "UPSERT INTO V_T000109 VALUES(1)": From line
1, column 13 to line 1, column 21: Object 'V_T000109' not found
	at org.apache.phoenix.end2end.ViewIT.testReadOnlyViewWithCaseSensitiveColumnNames(ViewIT.java:290)
Caused by: org.apache.calcite.runtime.CalciteContextException: From line 1, column 13 to line
1, column 21: Object 'V_T000109' not found
	at org.apache.phoenix.end2end.ViewIT.testReadOnlyViewWithCaseSensitiveColumnNames(ViewIT.java:290)
Caused by: org.apache.calcite.sql.validate.SqlValidatorException: Object 'V_T000109' not found
	at org.apache.phoenix.end2end.ViewIT.testReadOnlyViewWithCaseSensitiveColumnNames(ViewIT.java:290)

testNonSaltedUpdatableViewWithIndex[transactional = true](org.apache.phoenix.end2end.ViewIT)
 Time elapsed: 2.341 sec  <<< ERROR!
java.sql.SQLException: Error while executing SQL "UPSERT INTO T_T000110 VALUES(0,100,1)":
From line 1, column 13 to line 1, column 21: Object 'T_T000110' not found
	at org.apache.phoenix.end2end.ViewIT.testNonSaltedUpdatableViewWithIndex(ViewIT.java:131)
Caused by: org.apache.calcite.runtime.CalciteContextException: From line 1, column 13 to line
1, column 21: Object 'T_T000110' not found
	at org.apache.phoenix.end2end.ViewIT.testNonSaltedUpdatableViewWithIndex(ViewIT.java:131)
Caused by: org.apache.calcite.sql.validate.SqlValidatorException: Object 'T_T000110' not found
	at org.apache.phoenix.end2end.ViewIT.testNonSaltedUpdatableViewWithIndex(ViewIT.java:131)

testReadOnlyOnReadOnlyView[transactional = true](org.apache.phoenix.end2end.ViewIT)  Time
elapsed: 1.279 sec  <<< ERROR!
java.sql.SQLException: Error while executing SQL "UPSERT INTO V_T000121 VALUES(1)": From line
1, column 13 to line 1, column 21: Object 'V_T000121' not found
	at org.apache.phoenix.end2end.ViewIT.testReadOnlyOnReadOnlyView(ViewIT.java:71)
Caused by: org.apache.calcite.runtime.CalciteContextException: From line 1, column 13 to line
1, column 21: Object 'V_T000121' not found
	at org.apache.phoenix.end2end.ViewIT.testReadOnlyOnReadOnlyView(ViewIT.java:71)
Caused by: org.apache.calcite.sql.validate.SqlValidatorException: Object 'V_T000121' not found
	at org.apache.phoenix.end2end.ViewIT.testReadOnlyOnReadOnlyView(ViewIT.java:71)

testQueryViewStatementOptimization[transactional = true](org.apache.phoenix.end2end.ViewIT)
 Time elapsed: 1.278 sec  <<< ERROR!
java.sql.SQLException: Error while preparing statement [SELECT * FROM V_T000123 order by k1,
k2]
	at org.apache.phoenix.end2end.ViewIT.testQueryViewStatementOptimization(ViewIT.java:686)
Caused by: org.apache.calcite.runtime.CalciteContextException: From line 1, column 15 to line
1, column 23: Object 'V_T000123' not found
	at org.apache.phoenix.end2end.ViewIT.testQueryViewStatementOptimization(ViewIT.java:686)
Caused by: org.apache.calcite.sql.validate.SqlValidatorException: Object 'V_T000123' not found
	at org.apache.phoenix.end2end.ViewIT.testQueryViewStatementOptimization(ViewIT.java:686)

testViewAndTableInDifferentSchemasWithNamespaceMappingEnabled[transactional = true](org.apache.phoenix.end2end.ViewIT)
 Time elapsed: 1.411 sec  <<< ERROR!
java.sql.SQLException: Error while executing SQL "SELECT * FROM V_T000129": From line 1, column
15 to line 1, column 23: Object 'V_T000129' not found
	at org.apache.phoenix.end2end.ViewIT.testViewAndTableInDifferentSchemas(ViewIT.java:372)
	at org.apache.phoenix.end2end.ViewIT.testViewAndTableInDifferentSchemasWithNamespaceMappingEnabled(ViewIT.java:340)
Caused by: org.apache.calcite.runtime.CalciteContextException: From line 1, column 15 to line
1, column 23: Object 'V_T000129' not found
	at org.apache.phoenix.end2end.ViewIT.testViewAndTableInDifferentSchemas(ViewIT.java:372)
	at org.apache.phoenix.end2end.ViewIT.testViewAndTableInDifferentSchemasWithNamespaceMappingEnabled(ViewIT.java:340)
Caused by: org.apache.calcite.sql.validate.SqlValidatorException: Object 'V_T000129' not found
	at org.apache.phoenix.end2end.ViewIT.testViewAndTableInDifferentSchemas(ViewIT.java:372)
	at org.apache.phoenix.end2end.ViewIT.testViewAndTableInDifferentSchemasWithNamespaceMappingEnabled(ViewIT.java:340)

testViewAndTableInDifferentSchemas[transactional = true](org.apache.phoenix.end2end.ViewIT)
 Time elapsed: 2.553 sec  <<< ERROR!
java.sql.SQLException: Error while executing SQL "SELECT * FROM V_T000134": From line 1, column
15 to line 1, column 23: Object 'V_T000134' not found
	at org.apache.phoenix.end2end.ViewIT.testViewAndTableInDifferentSchemas(ViewIT.java:372)
	at org.apache.phoenix.end2end.ViewIT.testViewAndTableInDifferentSchemas(ViewIT.java:345)
Caused by: org.apache.calcite.runtime.CalciteContextException: From line 1, column 15 to line
1, column 23: Object 'V_T000134' not found
	at org.apache.phoenix.end2end.ViewIT.testViewAndTableInDifferentSchemas(ViewIT.java:372)
	at org.apache.phoenix.end2end.ViewIT.testViewAndTableInDifferentSchemas(ViewIT.java:345)
Caused by: org.apache.calcite.sql.validate.SqlValidatorException: Object 'V_T000134' not found
	at org.apache.phoenix.end2end.ViewIT.testViewAndTableInDifferentSchemas(ViewIT.java:372)
	at org.apache.phoenix.end2end.ViewIT.testViewAndTableInDifferentSchemas(ViewIT.java:345)

testCreateViewDefinesPKColumn[transactional = true](org.apache.phoenix.end2end.ViewIT)  Time
elapsed: 1.306 sec  <<< ERROR!
java.sql.SQLException: Error while executing SQL "upsert into T_T000135 (k1, k2, v1) values
(1, 1, 1)": From line 1, column 13 to line 1, column 21: Object 'T_T000135' not found
	at org.apache.phoenix.end2end.ViewIT.testCreateViewDefinesPKColumn(ViewIT.java:574)
Caused by: org.apache.calcite.runtime.CalciteContextException: From line 1, column 13 to line
1, column 21: Object 'T_T000135' not found
	at org.apache.phoenix.end2end.ViewIT.testCreateViewDefinesPKColumn(ViewIT.java:574)
Caused by: org.apache.calcite.sql.validate.SqlValidatorException: Object 'T_T000135' not found
	at org.apache.phoenix.end2end.ViewIT.testCreateViewDefinesPKColumn(ViewIT.java:574)


Results :

Failed tests: 
  StatisticsCollectionRunTrackerIT.testMajorCompactionPreventsUpdateStatsFromRunning:106 Row
count didn't match expected:<-200> but was:<-1>
  StatisticsCollectionRunTrackerIT.testUpdateStatsPreventsAnotherUpdateStatsFromRunning:118
Row count didn't match expected:<-100> but was:<-1>
  TenantSpecificTablesDDLIT.testDisallowDropParentTableWithExistingTenantTable:308->BaseTest.assertEquals:1828
expected:<1010> but was:<0>
Tests in error: 
  StatisticsCollectionRunTrackerIT.testStateBeforeAndAfterMajorCompaction:82 » SQL
  KeyOnlyIT.testKeyOnly:61->initTableValues:154 » SQL Error while preparing stat...
  KeyOnlyIT.testOr:120->initTableValues:154 » SQL Error while preparing statemen...
  KeyOnlyIT.testQueryWithLimitAndStats:137->initTableValues:169 » SQL Error whil...
  MultiCfQueryExecIT.testGuidePostsForMultiCFsOverUnevenDistrib:191 » SQL Error ...
  MultiCfQueryExecIT.testGuidePostsRetrievedForMultiCF:228 » SQL Error while pre...
  ParallelIteratorsIT.testGetSplits:85->createTable:219 » SQL Error while prepar...
  ParallelIteratorsIT.testGuidePostsLifeCycle:151->createTable:219 » SQL Error w...
  ParallelIteratorsIT.testServerNameOnScan:129->createTable:219 » SQL Error whil...
  SaltedViewIT.testSaltedUpdatableViewWithIndex:38->BaseViewIT.testUpdatableViewWithIndex:81->BaseViewIT.testUpdatableView:120
» SQL
  SaltedViewIT.testSaltedUpdatableViewWithIndex:38->BaseViewIT.testUpdatableViewWithIndex:81->BaseViewIT.testUpdatableView:120
» SQL
  SaltedViewIT.testSaltedUpdatableViewWithLocalIndex:43->BaseViewIT.testUpdatableViewWithIndex:81->BaseViewIT.testUpdatableView:120
» SQL
  SaltedViewIT.testSaltedUpdatableViewWithLocalIndex:43->BaseViewIT.testUpdatableViewWithIndex:81->BaseViewIT.testUpdatableView:120
» SQL
  TenantSpecificTablesDDLIT.testAddDropColumn:226 » SQL Error while executing SQ...
  TenantSpecificTablesDMLIT.testBaseTableCanBeUsedInStatementsInMultitenantConnections:415
» SQL
  TenantSpecificTablesDMLIT.testBasicUpsertSelect:54 » SQL Error while executing...
  TenantSpecificTablesDMLIT.testBasicUpsertSelect2:76 » SQL Error while executin...
  TenantSpecificTablesDMLIT.testDeleteAllTenantTableData:291 » SQL Error while e...
  TenantSpecificTablesDMLIT.testDeleteOnlyDeletesTenantData:204 » SQL Error whil...
  TenantSpecificTablesDMLIT.testDeleteOnlyDeletesTenantDataWithNoTenantTypeId:263 » SQL
  TenantSpecificTablesDMLIT.testDeleteWhenImmutableIndex:233 » SQL Error while e...
  TenantSpecificTablesDMLIT.testDropTenantTableDeletesNoData:317 » SQL Error whi...
  TenantSpecificTablesDMLIT.testJoinWithGlobalTable:149 » SQL Error while execut...
  TenantSpecificTablesDMLIT.testSelectOnlySeesTenantData:176 » SQL Error while e...
  TenantSpecificTablesDMLIT.testSelectWithLimit:45 » SQL Error while executing S...
  TenantSpecificTablesDMLIT.testTenantTableCannotBeUsedInStatementsInNonMultitenantConnections:436
» SQL
  TenantSpecificTablesDMLIT.testUpsertSelectOnlyUpsertsTenantData:342 » SQL Erro...
  TenantSpecificTablesDMLIT.testUpsertSelectOnlyUpsertsTenantDataWithDifferentTenantTable:373
» SQL
  TenantSpecificTablesDMLIT.testUpsertValuesOnlyUpsertsTenantData:398 » SQL Erro...
  TenantSpecificTablesDMLIT.testUpsertValuesUsingViewWithNoWhereClause:451 » SQL
  TransactionalViewIT.testInvalidRowsWithStats:94 » SQL Error while executing SQ...
  TransactionalViewIT.testReadOwnWritesWithStats:59 » SQL Error while executing ...
  ViewIT.testCreateViewDefinesPKColumn:574 » SQL Error while executing SQL "upse...
  ViewIT.testCreateViewDefinesPKColumn:574 » SQL Error while executing SQL "upse...
  ViewIT.testCreateViewDefinesPKConstraint:596 » SQL Error while executing SQL "...
  ViewIT.testCreateViewDefinesPKConstraint:596 » SQL Error while executing SQL "...
  ViewIT.testNonSaltedUpdatableViewWithIndex:131->BaseViewIT.testUpdatableViewWithIndex:81->BaseViewIT.testUpdatableView:120
» SQL
  ViewIT.testNonSaltedUpdatableViewWithIndex:131->BaseViewIT.testUpdatableViewWithIndex:81->BaseViewIT.testUpdatableView:120
» SQL
  ViewIT.testNonSaltedUpdatableViewWithLocalIndex:136->BaseViewIT.testUpdatableViewWithIndex:81->BaseViewIT.testUpdatableView:120
» SQL
  ViewIT.testNonSaltedUpdatableViewWithLocalIndex:136->BaseViewIT.testUpdatableViewWithIndex:81->BaseViewIT.testUpdatableView:120
» SQL
  ViewIT.testQueryViewStatementOptimization:686 » SQL Error while preparing stat...
  ViewIT.testQueryViewStatementOptimization:686 » SQL Error while preparing stat...
  ViewIT.testReadOnlyOnReadOnlyView:71 » SQL Error while executing SQL "UPSERT I...
  ViewIT.testReadOnlyOnReadOnlyView:71 » SQL Error while executing SQL "UPSERT I...
  ViewIT.testReadOnlyOnUpdatableView:179->BaseViewIT.testUpdatableView:120 » SQL
  ViewIT.testReadOnlyOnUpdatableView:179->BaseViewIT.testUpdatableView:120 » SQL
  ViewIT.testReadOnlyViewWithCaseSensitiveColumnNames:290 » SQL Error while exec...
  ViewIT.testReadOnlyViewWithCaseSensitiveColumnNames:290 » SQL Error while exec...
  ViewIT.testReadOnlyViewWithCaseSensitiveTableNames:255 » SQL Error while execu...
  ViewIT.testReadOnlyViewWithCaseSensitiveTableNames:255 » SQL Error while execu...
  ViewIT.testUpdatableOnUpdatableView:141->BaseViewIT.testUpdatableView:120 » SQL
  ViewIT.testUpdatableOnUpdatableView:141->BaseViewIT.testUpdatableView:120 » SQL
  ViewIT.testViewAndTableInDifferentSchemasWithNamespaceMappingEnabled:340->testViewAndTableInDifferentSchemas:372
» SQL
  ViewIT.testViewAndTableInDifferentSchemasWithNamespaceMappingEnabled:340->testViewAndTableInDifferentSchemas:372
» SQL
  ViewIT.testViewAndTableInDifferentSchemas:345->testViewAndTableInDifferentSchemas:372
» SQL
  ViewIT.testViewAndTableInDifferentSchemas:345->testViewAndTableInDifferentSchemas:372
» SQL
  ViewIT.testViewUsesTableGlobalIndex:501->testViewUsesTableIndex:529 » SQL Erro...
  ViewIT.testViewUsesTableGlobalIndex:501->testViewUsesTableIndex:529 » SQL Erro...
  ViewIT.testViewUsesTableLocalIndex:506->testViewUsesTableIndex:529 » SQL Error...
  ViewIT.testViewUsesTableLocalIndex:506->testViewUsesTableIndex:529 » SQL Error...
  ViewIT.testViewWithCurrentDate:318 » SQL Error while executing SQL "UPSERT INT...
  ViewIT.testViewWithCurrentDate:318 » SQL Error while executing SQL "UPSERT INT...
  ImmutableIndexWithStatsIT.testIndexCreationDeadlockWithStats:49 » SQL Error wh...

Tests run: 104, Failures: 3, Errors: 63, Skipped: 0

[INFO] 
[INFO] --- maven-failsafe-plugin:2.19.1:integration-test (ParallelStatsDisabledTest) @ phoenix-core
---

-------------------------------------------------------
 T E S T S
-------------------------------------------------------
Build step 'Invoke top-level Maven targets' marked build as failure
Archiving artifacts
No prior successful build to compare, so performing full copy of artifacts
Recording test results

Mime
View raw message