phoenix-commits mailing list archives

Site index · List index
Message view « Date » · « Thread »
Top « Date » · « Thread »
From Apache Jenkins Server <jenk...@builds.apache.org>
Subject Build failed in Jenkins: Phoenix-Calcite #58
Date Fri, 27 Jan 2017 16:31:25 GMT
See <https://builds.apache.org/job/Phoenix-calcite/58/changes>

Changes:

[rajeshbabu] PHOENIX-3351 Implement TODOs in PhoenixTableModify#upsert to allow

------------------------------------------
[...truncated 1134 lines...]
Tests run: 1, Failures: 0, Errors: 0, Skipped: 0, Time elapsed: 0.02 sec - in org.apache.phoenix.mapreduce.bulkload.TestTableRowkeyPair
Running org.apache.phoenix.mapreduce.CsvToKeyValueMapperTest
Tests run: 2, Failures: 0, Errors: 0, Skipped: 0, Time elapsed: 0.075 sec - in org.apache.phoenix.mapreduce.CsvToKeyValueMapperTest
Running org.apache.phoenix.mapreduce.util.PhoenixConfigurationUtilTest
Tests run: 3, Failures: 0, Errors: 0, Skipped: 0, Time elapsed: 2.749 sec - in org.apache.phoenix.hbase.index.write.recovery.TestPerRegionIndexWriteCache
Running org.apache.phoenix.mapreduce.util.ColumnInfoToStringEncoderDecoderTest
Tests run: 2, Failures: 0, Errors: 0, Skipped: 0, Time elapsed: 0.286 sec - in org.apache.phoenix.mapreduce.util.ColumnInfoToStringEncoderDecoderTest
Running org.apache.phoenix.mapreduce.BulkLoadToolTest
Tests run: 12, Failures: 0, Errors: 0, Skipped: 0, Time elapsed: 0.053 sec - in org.apache.phoenix.mapreduce.BulkLoadToolTest
Running org.apache.phoenix.mapreduce.FormatToBytesWritableMapperTest
Tests run: 5, Failures: 0, Errors: 0, Skipped: 0, Time elapsed: 1.871 sec - in org.apache.phoenix.mapreduce.CsvBulkImportUtilTest
Running org.apache.phoenix.trace.TraceMetricsSourceTest
Tests run: 5, Failures: 0, Errors: 0, Skipped: 0, Time elapsed: 0.515 sec - in org.apache.phoenix.mapreduce.FormatToBytesWritableMapperTest
Running org.apache.phoenix.schema.RowKeySchemaTest
Tests run: 2, Failures: 0, Errors: 2, Skipped: 0, Time elapsed: 3.367 sec <<< FAILURE!
- in org.apache.phoenix.filter.SkipScanBigFilterTest
testAllIntersect(org.apache.phoenix.filter.SkipScanBigFilterTest)  Time elapsed: 3.182 sec
 <<< ERROR!
java.sql.SQLException: 
Error while preparing statement [create table PERF.BIG_OLAP_DOC (
client_id                           integer not null
,customer_id                        integer
,time_id                            integer not null
,conversion_type_id                 integer not null
,device_type                        varchar(16)
,keyword_id                         bigint not null
,creative_id                        bigint not null
,placement_id                       bigint not null
,product_target_id                  bigint not null
,network                            varchar(7)
,impressions                        decimal(18, 4)
,publisher_clicks                   decimal(18, 4)
,publisher_cost                     decimal(18, 4)
,conversions                        decimal(18, 4)
,revenue                            decimal(18, 4)
    constraint perf_fact_pk primary key (client_id, time_id, conversion_type_id, device_type,
keyword_id, creative_id, placement_id, product_target_id))SALT_BUCKETS=10 SPLIT ON (?,?,?,?,?,?,?,?,?,?,?,?,?,?,?,?,?,?,?)]
	at org.apache.phoenix.filter.SkipScanBigFilterTest.testIntersect(SkipScanBigFilterTest.java:641)
	at org.apache.phoenix.filter.SkipScanBigFilterTest.testAllIntersect(SkipScanBigFilterTest.java:613)
Caused by: java.lang.RuntimeException: 
parse failed: Encountered "?" at line 17, column 179.
Was expecting one of:
    <BINARY_STRING_LITERAL> ...
    <PREFIXED_STRING_LITERAL> ...
    <QUOTED_STRING> ...
    <UNICODE_STRING_LITERAL> ...
    
	at org.apache.phoenix.filter.SkipScanBigFilterTest.testIntersect(SkipScanBigFilterTest.java:641)
	at org.apache.phoenix.filter.SkipScanBigFilterTest.testAllIntersect(SkipScanBigFilterTest.java:613)
Caused by: org.apache.calcite.sql.parser.SqlParseException: 
Encountered "?" at line 17, column 179.
Was expecting one of:
    <BINARY_STRING_LITERAL> ...
    <PREFIXED_STRING_LITERAL> ...
    <QUOTED_STRING> ...
    <UNICODE_STRING_LITERAL> ...
    
	at org.apache.phoenix.filter.SkipScanBigFilterTest.testIntersect(SkipScanBigFilterTest.java:641)
	at org.apache.phoenix.filter.SkipScanBigFilterTest.testAllIntersect(SkipScanBigFilterTest.java:613)
Caused by: org.apache.phoenix.calcite.parser.ParseException: 
Encountered "?" at line 17, column 179.
Was expecting one of:
    <BINARY_STRING_LITERAL> ...
    <PREFIXED_STRING_LITERAL> ...
    <QUOTED_STRING> ...
    <UNICODE_STRING_LITERAL> ...
    
	at org.apache.phoenix.filter.SkipScanBigFilterTest.testIntersect(SkipScanBigFilterTest.java:641)
	at org.apache.phoenix.filter.SkipScanBigFilterTest.testAllIntersect(SkipScanBigFilterTest.java:613)

testRangeIntersect(org.apache.phoenix.filter.SkipScanBigFilterTest)  Time elapsed: 0.045 sec
 <<< ERROR!
java.sql.SQLException: 
Error while preparing statement [create table PERF.BIG_OLAP_DOC (
client_id                           integer not null
,customer_id                        integer
,time_id                            integer not null
,conversion_type_id                 integer not null
,device_type                        varchar(16)
,keyword_id                         bigint not null
,creative_id                        bigint not null
,placement_id                       bigint not null
,product_target_id                  bigint not null
,network                            varchar(7)
,impressions                        decimal(18, 4)
,publisher_clicks                   decimal(18, 4)
,publisher_cost                     decimal(18, 4)
,conversions                        decimal(18, 4)
,revenue                            decimal(18, 4)
    constraint perf_fact_pk primary key (client_id, time_id, conversion_type_id, device_type,
keyword_id, creative_id, placement_id, product_target_id))SALT_BUCKETS=10 SPLIT ON (?)]
	at org.apache.phoenix.filter.SkipScanBigFilterTest.testIntersect(SkipScanBigFilterTest.java:641)
	at org.apache.phoenix.filter.SkipScanBigFilterTest.testRangeIntersect(SkipScanBigFilterTest.java:608)
Caused by: java.lang.RuntimeException: 
parse failed: Encountered "?" at line 17, column 179.
Was expecting one of:
    <BINARY_STRING_LITERAL> ...
    <PREFIXED_STRING_LITERAL> ...
    <QUOTED_STRING> ...
    <UNICODE_STRING_LITERAL> ...
    
	at org.apache.phoenix.filter.SkipScanBigFilterTest.testIntersect(SkipScanBigFilterTest.java:641)
	at org.apache.phoenix.filter.SkipScanBigFilterTest.testRangeIntersect(SkipScanBigFilterTest.java:608)
Caused by: org.apache.calcite.sql.parser.SqlParseException: 
Encountered "?" at line 17, column 179.
Was expecting one of:
    <BINARY_STRING_LITERAL> ...
    <PREFIXED_STRING_LITERAL> ...
    <QUOTED_STRING> ...
    <UNICODE_STRING_LITERAL> ...
    
	at org.apache.phoenix.filter.SkipScanBigFilterTest.testIntersect(SkipScanBigFilterTest.java:641)
	at org.apache.phoenix.filter.SkipScanBigFilterTest.testRangeIntersect(SkipScanBigFilterTest.java:608)
Caused by: org.apache.phoenix.calcite.parser.ParseException: 
Encountered "?" at line 17, column 179.
Was expecting one of:
    <BINARY_STRING_LITERAL> ...
    <PREFIXED_STRING_LITERAL> ...
    <QUOTED_STRING> ...
    <UNICODE_STRING_LITERAL> ...
    
	at org.apache.phoenix.filter.SkipScanBigFilterTest.testIntersect(SkipScanBigFilterTest.java:641)
	at org.apache.phoenix.filter.SkipScanBigFilterTest.testRangeIntersect(SkipScanBigFilterTest.java:608)

Running org.apache.phoenix.schema.stats.StatisticsScannerTest
Tests run: 3, Failures: 0, Errors: 0, Skipped: 0, Time elapsed: 1.491 sec - in org.apache.phoenix.trace.TraceMetricsSourceTest
Running org.apache.phoenix.schema.RowKeyValueAccessorTest
Tests run: 9, Failures: 0, Errors: 0, Skipped: 0, Time elapsed: 3.126 sec - in org.apache.phoenix.mapreduce.util.PhoenixConfigurationUtilTest
Running org.apache.phoenix.schema.PCharPadTest
Tests run: 9, Failures: 0, Errors: 0, Skipped: 0, Time elapsed: 0.007 sec - in org.apache.phoenix.schema.PCharPadTest
Running org.apache.phoenix.schema.SortOrderTest
Tests run: 8, Failures: 0, Errors: 0, Skipped: 0, Time elapsed: 0.018 sec - in org.apache.phoenix.schema.SortOrderTest
Running org.apache.phoenix.schema.types.PrimitiveIntPhoenixArrayToStringTest
Tests run: 6, Failures: 0, Errors: 0, Skipped: 0, Time elapsed: 0.623 sec - in org.apache.phoenix.schema.types.PrimitiveIntPhoenixArrayToStringTest
Running org.apache.phoenix.schema.types.PrimitiveShortPhoenixArrayToStringTest
Tests run: 6, Failures: 0, Errors: 0, Skipped: 0, Time elapsed: 0.007 sec - in org.apache.phoenix.schema.types.PrimitiveShortPhoenixArrayToStringTest
Running org.apache.phoenix.schema.types.PDataTypeForArraysTest
Tests run: 68, Failures: 0, Errors: 0, Skipped: 0, Time elapsed: 0.191 sec - in org.apache.phoenix.schema.types.PDataTypeForArraysTest
Tests run: 4, Failures: 0, Errors: 0, Skipped: 0, Time elapsed: 1.291 sec - in org.apache.phoenix.schema.stats.StatisticsScannerTest
Running org.apache.phoenix.schema.types.PVarcharArrayToStringTest
Running org.apache.phoenix.schema.types.PrimitiveBytePhoenixArrayToStringTest
Tests run: 8, Failures: 0, Errors: 0, Skipped: 0, Time elapsed: 0.009 sec - in org.apache.phoenix.schema.types.PVarcharArrayToStringTest
Running org.apache.phoenix.schema.types.PDateArrayToStringTest
Tests run: 6, Failures: 0, Errors: 0, Skipped: 0, Time elapsed: 0.33 sec - in org.apache.phoenix.schema.types.PDateArrayToStringTest
Running org.apache.phoenix.schema.types.PrimitiveLongPhoenixArrayToStringTest
Tests run: 6, Failures: 0, Errors: 6, Skipped: 0, Time elapsed: 6.128 sec <<< FAILURE!
- in org.apache.phoenix.schema.RowKeySchemaTest
testVarNullNull(org.apache.phoenix.schema.RowKeySchemaTest)  Time elapsed: 0.576 sec  <<<
ERROR!
java.sql.SQLException: Error while preparing statement [UPSERT INTO T VALUES(?,?,?)]
	at org.apache.phoenix.schema.RowKeySchemaTest.assertIteration(RowKeySchemaTest.java:66)
	at org.apache.phoenix.schema.RowKeySchemaTest.assertExpectedRowKeyValue(RowKeySchemaTest.java:49)
	at org.apache.phoenix.schema.RowKeySchemaTest.testVarNullNull(RowKeySchemaTest.java:138)
Caused by: org.apache.calcite.runtime.CalciteContextException: At line 1, column 13: Object
'T' not found
	at org.apache.phoenix.schema.RowKeySchemaTest.assertIteration(RowKeySchemaTest.java:66)
	at org.apache.phoenix.schema.RowKeySchemaTest.assertExpectedRowKeyValue(RowKeySchemaTest.java:49)
	at org.apache.phoenix.schema.RowKeySchemaTest.testVarNullNull(RowKeySchemaTest.java:138)
Caused by: org.apache.calcite.sql.validate.SqlValidatorException: Object 'T' not found
	at org.apache.phoenix.schema.RowKeySchemaTest.assertIteration(RowKeySchemaTest.java:66)
	at org.apache.phoenix.schema.RowKeySchemaTest.assertExpectedRowKeyValue(RowKeySchemaTest.java:49)
	at org.apache.phoenix.schema.RowKeySchemaTest.testVarNullNull(RowKeySchemaTest.java:138)

testFixedFixedVar(org.apache.phoenix.schema.RowKeySchemaTest)  Time elapsed: 0.138 sec  <<<
ERROR!
java.sql.SQLException: Error while preparing statement [UPSERT INTO T VALUES(?,?,?)]
	at org.apache.phoenix.schema.RowKeySchemaTest.assertIteration(RowKeySchemaTest.java:66)
	at org.apache.phoenix.schema.RowKeySchemaTest.assertExpectedRowKeyValue(RowKeySchemaTest.java:49)
	at org.apache.phoenix.schema.RowKeySchemaTest.testFixedFixedVar(RowKeySchemaTest.java:133)
Caused by: org.apache.calcite.runtime.CalciteContextException: At line 1, column 13: Object
'T' not found
	at org.apache.phoenix.schema.RowKeySchemaTest.assertIteration(RowKeySchemaTest.java:66)
	at org.apache.phoenix.schema.RowKeySchemaTest.assertExpectedRowKeyValue(RowKeySchemaTest.java:49)
	at org.apache.phoenix.schema.RowKeySchemaTest.testFixedFixedVar(RowKeySchemaTest.java:133)
Caused by: org.apache.calcite.sql.validate.SqlValidatorException: Object 'T' not found
	at org.apache.phoenix.schema.RowKeySchemaTest.assertIteration(RowKeySchemaTest.java:66)
	at org.apache.phoenix.schema.RowKeySchemaTest.assertExpectedRowKeyValue(RowKeySchemaTest.java:49)
	at org.apache.phoenix.schema.RowKeySchemaTest.testFixedFixedVar(RowKeySchemaTest.java:133)

testFixedLengthValueAtEnd(org.apache.phoenix.schema.RowKeySchemaTest)  Time elapsed: 0.201
sec  <<< ERROR!
java.sql.SQLException: Error while preparing statement [UPSERT INTO T VALUES(?,?,?,?)]
	at org.apache.phoenix.schema.RowKeySchemaTest.assertIteration(RowKeySchemaTest.java:66)
	at org.apache.phoenix.schema.RowKeySchemaTest.assertExpectedRowKeyValue(RowKeySchemaTest.java:49)
	at org.apache.phoenix.schema.RowKeySchemaTest.testFixedLengthValueAtEnd(RowKeySchemaTest.java:123)
Caused by: org.apache.calcite.runtime.CalciteContextException: At line 1, column 13: Object
'T' not found
	at org.apache.phoenix.schema.RowKeySchemaTest.assertIteration(RowKeySchemaTest.java:66)
	at org.apache.phoenix.schema.RowKeySchemaTest.assertExpectedRowKeyValue(RowKeySchemaTest.java:49)
	at org.apache.phoenix.schema.RowKeySchemaTest.testFixedLengthValueAtEnd(RowKeySchemaTest.java:123)
Caused by: org.apache.calcite.sql.validate.SqlValidatorException: Object 'T' not found
	at org.apache.phoenix.schema.RowKeySchemaTest.assertIteration(RowKeySchemaTest.java:66)
	at org.apache.phoenix.schema.RowKeySchemaTest.assertExpectedRowKeyValue(RowKeySchemaTest.java:49)
	at org.apache.phoenix.schema.RowKeySchemaTest.testFixedLengthValueAtEnd(RowKeySchemaTest.java:123)

testVarFixedVar(org.apache.phoenix.schema.RowKeySchemaTest)  Time elapsed: 0.318 sec  <<<
ERROR!
java.sql.SQLException: Error while preparing statement [UPSERT INTO T VALUES(?,?,?)]
	at org.apache.phoenix.schema.RowKeySchemaTest.assertIteration(RowKeySchemaTest.java:66)
	at org.apache.phoenix.schema.RowKeySchemaTest.assertExpectedRowKeyValue(RowKeySchemaTest.java:49)
	at org.apache.phoenix.schema.RowKeySchemaTest.testVarFixedVar(RowKeySchemaTest.java:143)
Caused by: org.apache.calcite.runtime.CalciteContextException: At line 1, column 13: Object
'T' not found
	at org.apache.phoenix.schema.RowKeySchemaTest.assertIteration(RowKeySchemaTest.java:66)
	at org.apache.phoenix.schema.RowKeySchemaTest.assertExpectedRowKeyValue(RowKeySchemaTest.java:49)
	at org.apache.phoenix.schema.RowKeySchemaTest.testVarFixedVar(RowKeySchemaTest.java:143)
Caused by: org.apache.calcite.sql.validate.SqlValidatorException: Object 'T' not found
	at org.apache.phoenix.schema.RowKeySchemaTest.assertIteration(RowKeySchemaTest.java:66)
	at org.apache.phoenix.schema.RowKeySchemaTest.assertExpectedRowKeyValue(RowKeySchemaTest.java:49)
	at org.apache.phoenix.schema.RowKeySchemaTest.testVarFixedVar(RowKeySchemaTest.java:143)

testFixedVarVar(org.apache.phoenix.schema.RowKeySchemaTest)  Time elapsed: 1.179 sec  <<<
ERROR!
java.sql.SQLException: Error while preparing statement [UPSERT INTO T VALUES(?,?,?)]
	at org.apache.phoenix.schema.RowKeySchemaTest.assertIteration(RowKeySchemaTest.java:66)
	at org.apache.phoenix.schema.RowKeySchemaTest.assertExpectedRowKeyValue(RowKeySchemaTest.java:49)
	at org.apache.phoenix.schema.RowKeySchemaTest.testFixedVarVar(RowKeySchemaTest.java:128)
Caused by: org.apache.calcite.runtime.CalciteContextException: At line 1, column 13: Object
'T' not found
	at org.apache.phoenix.schema.RowKeySchemaTest.assertIteration(RowKeySchemaTest.java:66)
	at org.apache.phoenix.schema.RowKeySchemaTest.assertExpectedRowKeyValue(RowKeySchemaTest.java:49)
	at org.apache.phoenix.schema.RowKeySchemaTest.testFixedVarVar(RowKeySchemaTest.java:128)
Caused by: org.apache.calcite.sql.validate.SqlValidatorException: Object 'T' not found
	at org.apache.phoenix.schema.RowKeySchemaTest.assertIteration(RowKeySchemaTest.java:66)
	at org.apache.phoenix.schema.RowKeySchemaTest.assertExpectedRowKeyValue(RowKeySchemaTest.java:49)
	at org.apache.phoenix.schema.RowKeySchemaTest.testFixedVarVar(RowKeySchemaTest.java:128)

testVarFixedFixed(org.apache.phoenix.schema.RowKeySchemaTest)  Time elapsed: 0.4 sec  <<<
ERROR!
java.sql.SQLException: Error while preparing statement [UPSERT INTO T VALUES(?,?,?)]
	at org.apache.phoenix.schema.RowKeySchemaTest.assertIteration(RowKeySchemaTest.java:66)
	at org.apache.phoenix.schema.RowKeySchemaTest.assertExpectedRowKeyValue(RowKeySchemaTest.java:49)
	at org.apache.phoenix.schema.RowKeySchemaTest.testVarFixedFixed(RowKeySchemaTest.java:148)
Caused by: org.apache.calcite.runtime.CalciteContextException: At line 1, column 13: Object
'T' not found
	at org.apache.phoenix.schema.RowKeySchemaTest.assertIteration(RowKeySchemaTest.java:66)
	at org.apache.phoenix.schema.RowKeySchemaTest.assertExpectedRowKeyValue(RowKeySchemaTest.java:49)
	at org.apache.phoenix.schema.RowKeySchemaTest.testVarFixedFixed(RowKeySchemaTest.java:148)
Caused by: org.apache.calcite.sql.validate.SqlValidatorException: Object 'T' not found
	at org.apache.phoenix.schema.RowKeySchemaTest.assertIteration(RowKeySchemaTest.java:66)
	at org.apache.phoenix.schema.RowKeySchemaTest.assertExpectedRowKeyValue(RowKeySchemaTest.java:49)
	at org.apache.phoenix.schema.RowKeySchemaTest.testVarFixedFixed(RowKeySchemaTest.java:148)

Tests run: 1, Failures: 0, Errors: 1, Skipped: 0, Time elapsed: 8.572 sec <<< FAILURE!
- in org.apache.phoenix.schema.RowKeyValueAccessorTest
testFixedLengthValueAtEnd(org.apache.phoenix.schema.RowKeyValueAccessorTest)  Time elapsed:
4.961 sec  <<< ERROR!
java.sql.SQLException: Error while preparing statement [UPSERT INTO T VALUES(?,?,?,?)]
	at org.apache.phoenix.schema.RowKeyValueAccessorTest.assertExpectedRowKeyValue(RowKeyValueAccessorTest.java:62)
	at org.apache.phoenix.schema.RowKeyValueAccessorTest.assertExpectedRowKeyValue(RowKeyValueAccessorTest.java:45)
	at org.apache.phoenix.schema.RowKeyValueAccessorTest.testFixedLengthValueAtEnd(RowKeyValueAccessorTest.java:86)
Caused by: org.apache.calcite.runtime.CalciteContextException: At line 1, column 13: Object
'T' not found
	at org.apache.phoenix.schema.RowKeyValueAccessorTest.assertExpectedRowKeyValue(RowKeyValueAccessorTest.java:62)
	at org.apache.phoenix.schema.RowKeyValueAccessorTest.assertExpectedRowKeyValue(RowKeyValueAccessorTest.java:45)
	at org.apache.phoenix.schema.RowKeyValueAccessorTest.testFixedLengthValueAtEnd(RowKeyValueAccessorTest.java:86)
Caused by: org.apache.calcite.sql.validate.SqlValidatorException: Object 'T' not found
	at org.apache.phoenix.schema.RowKeyValueAccessorTest.assertExpectedRowKeyValue(RowKeyValueAccessorTest.java:62)
	at org.apache.phoenix.schema.RowKeyValueAccessorTest.assertExpectedRowKeyValue(RowKeyValueAccessorTest.java:45)
	at org.apache.phoenix.schema.RowKeyValueAccessorTest.testFixedLengthValueAtEnd(RowKeyValueAccessorTest.java:86)

Tests run: 6, Failures: 0, Errors: 0, Skipped: 0, Time elapsed: 8.803 sec - in org.apache.phoenix.schema.types.PrimitiveBytePhoenixArrayToStringTest
Running org.apache.phoenix.schema.types.PrimitiveBooleanPhoenixArrayToStringTest
Tests run: 6, Failures: 0, Errors: 0, Skipped: 0, Time elapsed: 13.48 sec - in org.apache.phoenix.schema.types.PrimitiveLongPhoenixArrayToStringTest
Running org.apache.phoenix.schema.types.PrimitiveFloatPhoenixArrayToStringTest
Running org.apache.phoenix.schema.types.PrimitiveDoublePhoenixArrayToStringTest
Build step 'Invoke top-level Maven targets' marked build as failure
Archiving artifacts
No prior successful build to compare, so performing full copy of artifacts
Recording test results

Mime
View raw message