phoenix-commits mailing list archives

Site index · List index
Message view « Date » · « Thread »
Top « Date » · « Thread »
From Apache Jenkins Server <jenk...@builds.apache.org>
Subject Apache-Phoenix | origin/4.9-HBase-1.2 | Build Still Failing
Date Thu, 22 Dec 2016 01:57:01 GMT
<a href="http://phoenix.apache.org"><img src='http://phoenix.apache.org/images/phoenix-logo-small.png'/></a><br><b>origin/4.9-HBase-1.2</b>
branch build status <b>Still Failing</b>
<hr/>
<b>Source repository</b> https://git-wip-us.apache.org/repos/asf?p=phoenix.git;a=shortlog;h=refs/heads/origin/4.9-HBase-1.2
<hr/>
<b>Compiled Artifacts</b> https://builds.apache.org/job/Phoenix-4.9/lastSuccessfulBuild/artifact/
<hr/>
<b>Test Report</b> https://builds.apache.org/job/Phoenix-4.9/lastCompletedBuild/testReport/
<hr/>
<b>Changes</b><br/>
[samarth] PHOENIX-3535 Fix race condition in


<hr/>
<b>Build times for last couple of runs</b><br/>Latest build time is the
right most | Legend blue: normal, red: test failure, gray: timeout<br/>
<img src='https://builds.apache.org/view/M-R/view/Phoenix/job/Phoenix-4.9/buildTimeGraph/png'/>
<br/>
[...truncated 791 lines...]
 T E S T S
-------------------------------------------------------
Running org.apache.phoenix.end2end.CreateSchemaIT
Tests run: 1, Failures: 0, Errors: 0, Skipped: 0, Time elapsed: 0.386 sec - in org.apache.phoenix.end2end.CreateSchemaIT
Running org.apache.phoenix.end2end.AggregateQueryIT
Running org.apache.phoenix.end2end.ColumnProjectionOptimizationIT
Running org.apache.phoenix.end2end.ClientTimeArithmeticQueryIT
Running org.apache.phoenix.end2end.CustomEntityDataIT
Running org.apache.phoenix.end2end.CreateTableIT
Running org.apache.phoenix.end2end.ArrayIT
Running org.apache.phoenix.end2end.CaseStatementIT
Running org.apache.phoenix.end2end.CastAndCoerceIT
Tests run: 3, Failures: 0, Errors: 0, Skipped: 0, Time elapsed: 6.027 sec - in org.apache.phoenix.end2end.CustomEntityDataIT
Running org.apache.phoenix.end2end.DerivedTableIT
Tests run: 18, Failures: 0, Errors: 0, Skipped: 0, Time elapsed: 18.854 sec - in org.apache.phoenix.end2end.DerivedTableIT
Running org.apache.phoenix.end2end.DistinctCountIT
Tests run: 3, Failures: 0, Errors: 0, Skipped: 0, Time elapsed: 27.158 sec - in org.apache.phoenix.end2end.ColumnProjectionOptimizationIT
Running org.apache.phoenix.end2end.DropSchemaIT
Tests run: 2, Failures: 0, Errors: 0, Skipped: 0, Time elapsed: 11.994 sec - in org.apache.phoenix.end2end.DropSchemaIT
Running org.apache.phoenix.end2end.ExtendedQueryExecIT
Tests run: 49, Failures: 0, Errors: 0, Skipped: 0, Time elapsed: 37.541 sec - in org.apache.phoenix.end2end.CastAndCoerceIT
Tests run: 63, Failures: 0, Errors: 0, Skipped: 0, Time elapsed: 40.685 sec - in org.apache.phoenix.end2end.CaseStatementIT
Running org.apache.phoenix.end2end.FunkyNamesIT
Running org.apache.phoenix.end2end.GroupByIT
Tests run: 10, Failures: 0, Errors: 0, Skipped: 0, Time elapsed: 19.214 sec - in org.apache.phoenix.end2end.DistinctCountIT
Tests run: 4, Failures: 0, Errors: 0, Skipped: 0, Time elapsed: 6.783 sec - in org.apache.phoenix.end2end.ExtendedQueryExecIT
Running org.apache.phoenix.end2end.NotQueryIT
Tests run: 3, Failures: 0, Errors: 0, Skipped: 0, Time elapsed: 6.159 sec - in org.apache.phoenix.end2end.FunkyNamesIT
Running org.apache.phoenix.end2end.PointInTimeQueryIT
Tests run: 49, Failures: 0, Errors: 0, Skipped: 0, Time elapsed: 53.333 sec - in org.apache.phoenix.end2end.AggregateQueryIT
Running org.apache.phoenix.end2end.ProductMetricsIT
Running org.apache.phoenix.end2end.NativeHBaseTypesIT
Tests run: 7, Failures: 0, Errors: 0, Skipped: 0, Time elapsed: 4.805 sec - in org.apache.phoenix.end2end.NativeHBaseTypesIT
Running org.apache.phoenix.end2end.QueryDatabaseMetaDataIT
Tests run: 14, Failures: 0, Errors: 0, Skipped: 0, Time elapsed: 23.65 sec - in org.apache.phoenix.end2end.PointInTimeQueryIT
Running org.apache.phoenix.end2end.QueryIT
Tests run: 61, Failures: 0, Errors: 0, Skipped: 0, Time elapsed: 25.362 sec - in org.apache.phoenix.end2end.ProductMetricsIT
Tests run: 79, Failures: 0, Errors: 0, Skipped: 0, Time elapsed: 81.553 sec - in org.apache.phoenix.end2end.ArrayIT
Running org.apache.phoenix.end2end.ReadIsolationLevelIT
Tests run: 77, Failures: 0, Errors: 0, Skipped: 0, Time elapsed: 40.155 sec - in org.apache.phoenix.end2end.NotQueryIT
Running org.apache.phoenix.end2end.RowValueConstructorIT
Tests run: 2, Failures: 0, Errors: 0, Skipped: 0, Time elapsed: 6.132 sec - in org.apache.phoenix.end2end.ReadIsolationLevelIT
Running org.apache.phoenix.end2end.SequenceBulkAllocationIT
Tests run: 15, Failures: 0, Errors: 0, Skipped: 0, Time elapsed: 90.322 sec - in org.apache.phoenix.end2end.CreateTableIT
Running org.apache.phoenix.end2end.SequenceIT
Tests run: 105, Failures: 0, Errors: 0, Skipped: 0, Time elapsed: 58.611 sec - in org.apache.phoenix.end2end.GroupByIT
Running org.apache.phoenix.end2end.ScanQueryIT
Tests run: 56, Failures: 0, Errors: 0, Skipped: 0, Time elapsed: 26.076 sec - in org.apache.phoenix.end2end.SequenceBulkAllocationIT
Tests run: 245, Failures: 0, Errors: 0, Skipped: 0, Time elapsed: 119.798 sec - in org.apache.phoenix.end2end.ClientTimeArithmeticQueryIT
Running org.apache.phoenix.end2end.ToNumberFunctionIT
Tests run: 126, Failures: 0, Errors: 0, Skipped: 0, Time elapsed: 61.4 sec - in org.apache.phoenix.end2end.QueryIT
Tests run: 18, Failures: 0, Errors: 0, Skipped: 0, Time elapsed: 7.196 sec - in org.apache.phoenix.end2end.ToNumberFunctionIT
Running org.apache.phoenix.end2end.UpsertValuesIT
Tests run: 54, Failures: 0, Errors: 0, Skipped: 0, Time elapsed: 52.329 sec - in org.apache.phoenix.end2end.SequenceIT
Running org.apache.phoenix.end2end.VariableLengthPKIT
Running org.apache.phoenix.end2end.TopNIT
Tests run: 4, Failures: 0, Errors: 0, Skipped: 0, Time elapsed: 6.144 sec - in org.apache.phoenix.end2end.TopNIT
Running org.apache.phoenix.end2end.salted.SaltedTableIT
Running org.apache.phoenix.end2end.TruncateFunctionIT
Tests run: 8, Failures: 0, Errors: 0, Skipped: 0, Time elapsed: 6.425 sec - in org.apache.phoenix.end2end.salted.SaltedTableIT
Tests run: 119, Failures: 0, Errors: 0, Skipped: 0, Time elapsed: 43.358 sec - in org.apache.phoenix.end2end.ScanQueryIT
Running org.apache.phoenix.rpc.UpdateCacheWithScnIT
Tests run: 1, Failures: 0, Errors: 0, Skipped: 0, Time elapsed: 5.787 sec - in org.apache.phoenix.end2end.TruncateFunctionIT
Tests run: 1, Failures: 0, Errors: 0, Skipped: 0, Time elapsed: 6.056 sec - in org.apache.phoenix.rpc.UpdateCacheWithScnIT
Running org.apache.phoenix.end2end.UpsertSelectIT
Tests run: 50, Failures: 0, Errors: 0, Skipped: 0, Time elapsed: 43.596 sec - in org.apache.phoenix.end2end.VariableLengthPKIT
Tests run: 19, Failures: 0, Errors: 0, Skipped: 0, Time elapsed: 131.029 sec - in org.apache.phoenix.end2end.QueryDatabaseMetaDataIT
Tests run: 46, Failures: 0, Errors: 0, Skipped: 0, Time elapsed: 119.985 sec - in org.apache.phoenix.end2end.RowValueConstructorIT
Tests run: 25, Failures: 0, Errors: 0, Skipped: 0, Time elapsed: 119.41 sec - in org.apache.phoenix.end2end.UpsertValuesIT
Tests run: 22, Failures: 0, Errors: 0, Skipped: 0, Time elapsed: 128.878 sec - in org.apache.phoenix.end2end.UpsertSelectIT

Results :

Tests run: 1359, Failures: 0, Errors: 0, Skipped: 0

[INFO] 
[INFO] --- maven-failsafe-plugin:2.19.1:integration-test (HBaseManagedTimeTests) @ phoenix-core
---

-------------------------------------------------------
 T E S T S
-------------------------------------------------------

Results :

Tests run: 0, Failures: 0, Errors: 0, Skipped: 0

[INFO] 
[INFO] --- maven-failsafe-plugin:2.19.1:integration-test (NeedTheirOwnClusterTests) @ phoenix-core
---

-------------------------------------------------------
 T E S T S
-------------------------------------------------------
Running org.apache.hadoop.hbase.regionserver.wal.WALReplayWithIndexWritesAndCompressedWALIT
Running org.apache.phoenix.end2end.ConnectionUtilIT
Tests run: 1, Failures: 0, Errors: 0, Skipped: 0, Time elapsed: 29.758 sec - in org.apache.hadoop.hbase.regionserver.wal.WALReplayWithIndexWritesAndCompressedWALIT
Running org.apache.phoenix.end2end.CountDistinctCompressionIT
Running org.apache.phoenix.end2end.CsvBulkLoadToolIT
Running org.apache.phoenix.end2end.ContextClassloaderIT
Running org.apache.phoenix.end2end.FlappingLocalIndexIT
Tests run: 1, Failures: 0, Errors: 1, Skipped: 0, Time elapsed: 0.005 sec <<< FAILURE!
- in org.apache.phoenix.end2end.FlappingLocalIndexIT
org.apache.phoenix.end2end.FlappingLocalIndexIT  Time elapsed: 0.005 sec  <<< ERROR!
java.sql.SQLException: org.apache.hadoop.hbase.TableNotFoundException: SYSTEM:CATALOG
Caused by: org.apache.hadoop.hbase.TableNotFoundException: SYSTEM:CATALOG

Tests run: 3, Failures: 0, Errors: 0, Skipped: 0, Time elapsed: 5.87 sec - in org.apache.phoenix.end2end.ContextClassloaderIT
Tests run: 1, Failures: 0, Errors: 0, Skipped: 0, Time elapsed: 28.729 sec - in org.apache.phoenix.end2end.ConnectionUtilIT
Tests run: 1, Failures: 0, Errors: 0, Skipped: 0, Time elapsed: 9.665 sec - in org.apache.phoenix.end2end.CountDistinctCompressionIT
Running org.apache.phoenix.end2end.IndexExtendedIT
Running org.apache.phoenix.end2end.QueryWithLimitIT
Running org.apache.phoenix.end2end.QueryTimeoutIT
Running org.apache.phoenix.end2end.RenewLeaseIT
Tests run: 2, Failures: 0, Errors: 0, Skipped: 0, Time elapsed: 8.41 sec - in org.apache.phoenix.end2end.QueryWithLimitIT
Running org.apache.phoenix.end2end.StatsCollectorIT
Tests run: 1, Failures: 0, Errors: 1, Skipped: 0, Time elapsed: 0.003 sec <<< FAILURE!
- in org.apache.phoenix.end2end.StatsCollectorIT
org.apache.phoenix.end2end.StatsCollectorIT  Time elapsed: 0.003 sec  <<< ERROR!
java.sql.SQLException: org.apache.hadoop.hbase.TableNotFoundException: SYSTEM:CATALOG
	at org.apache.phoenix.end2end.StatsCollectorIT.doSetup(StatsCollectorIT.java:96)
Caused by: org.apache.hadoop.hbase.TableNotFoundException: SYSTEM:CATALOG
	at org.apache.phoenix.end2end.StatsCollectorIT.doSetup(StatsCollectorIT.java:96)

Running org.apache.phoenix.end2end.SpillableGroupByIT
Tests run: 1, Failures: 0, Errors: 0, Skipped: 0, Time elapsed: 8.673 sec - in org.apache.phoenix.end2end.RenewLeaseIT
Running org.apache.phoenix.end2end.SysTableNamespaceMappedStatsCollectorIT
Tests run: 2, Failures: 0, Errors: 0, Skipped: 0, Time elapsed: 19.268 sec - in org.apache.phoenix.end2end.QueryTimeoutIT
Tests run: 1, Failures: 0, Errors: 1, Skipped: 0, Time elapsed: 0.007 sec <<< FAILURE!
- in org.apache.phoenix.end2end.SysTableNamespaceMappedStatsCollectorIT
org.apache.phoenix.end2end.SysTableNamespaceMappedStatsCollectorIT  Time elapsed: 0.006 sec
 <<< ERROR!
java.sql.SQLException: org.apache.hadoop.hbase.TableNotFoundException: SYSTEM:CATALOG
	at org.apache.phoenix.end2end.SysTableNamespaceMappedStatsCollectorIT.doSetup(SysTableNamespaceMappedStatsCollectorIT.java:45)
Caused by: org.apache.hadoop.hbase.TableNotFoundException: SYSTEM:CATALOG
	at org.apache.phoenix.end2end.SysTableNamespaceMappedStatsCollectorIT.doSetup(SysTableNamespaceMappedStatsCollectorIT.java:45)

Tests run: 2, Failures: 0, Errors: 0, Skipped: 0, Time elapsed: 17.826 sec - in org.apache.phoenix.end2end.SpillableGroupByIT
Tests run: 10, Failures: 0, Errors: 0, Skipped: 0, Time elapsed: 68.662 sec - in org.apache.phoenix.end2end.CsvBulkLoadToolIT
Running org.apache.phoenix.end2end.index.LocalIndexIT
Tests run: 1, Failures: 0, Errors: 1, Skipped: 0, Time elapsed: 0.005 sec <<< FAILURE!
- in org.apache.phoenix.end2end.index.LocalIndexIT
org.apache.phoenix.end2end.index.LocalIndexIT  Time elapsed: 0.005 sec  <<< ERROR!
java.sql.SQLException: org.apache.hadoop.hbase.TableNotFoundException: SYSTEM:CATALOG
Caused by: org.apache.hadoop.hbase.TableNotFoundException: SYSTEM:CATALOG

Running org.apache.phoenix.end2end.index.ImmutableIndexIT
Running org.apache.phoenix.end2end.index.MutableIndexFailureIT
Running org.apache.phoenix.end2end.UserDefinedFunctionsIT
Running org.apache.phoenix.end2end.index.ReadOnlyIndexFailureIT
Running org.apache.phoenix.end2end.index.MutableIndexReplicationIT
Running org.apache.phoenix.end2end.index.txn.TxWriteFailureIT
Tests run: 2, Failures: 0, Errors: 0, Skipped: 0, Time elapsed: 22.793 sec - in org.apache.phoenix.end2end.index.ReadOnlyIndexFailureIT
Running org.apache.phoenix.hbase.index.FailForUnsupportedHBaseVersionsIT
Tests run: 1, Failures: 0, Errors: 0, Skipped: 0, Time elapsed: 26.8 sec - in org.apache.phoenix.end2end.index.MutableIndexReplicationIT
Running org.apache.phoenix.execute.PartialCommitIT
Running org.apache.phoenix.hbase.index.covered.EndToEndCoveredColumnsIndexBuilderIT
Tests run: 2, Failures: 0, Errors: 0, Skipped: 0, Time elapsed: 18.548 sec - in org.apache.phoenix.hbase.index.FailForUnsupportedHBaseVersionsIT
Tests run: 12, Failures: 0, Errors: 0, Skipped: 0, Time elapsed: 3.422 sec - in org.apache.phoenix.execute.PartialCommitIT
Tests run: 14, Failures: 0, Errors: 0, Skipped: 0, Time elapsed: 50.477 sec - in org.apache.phoenix.end2end.UserDefinedFunctionsIT
Running org.apache.phoenix.hbase.index.covered.example.FailWithoutRetriesIT
Tests run: 2, Failures: 0, Errors: 0, Skipped: 0, Time elapsed: 18.175 sec - in org.apache.phoenix.hbase.index.covered.EndToEndCoveredColumnsIndexBuilderIT
Tests run: 1, Failures: 0, Errors: 0, Skipped: 0, Time elapsed: 8.683 sec - in org.apache.phoenix.hbase.index.covered.example.FailWithoutRetriesIT
Tests run: 8, Failures: 0, Errors: 0, Skipped: 0, Time elapsed: 59.355 sec - in org.apache.phoenix.end2end.index.txn.TxWriteFailureIT
Running org.apache.phoenix.hbase.index.covered.example.EndToEndCoveredIndexingIT
Running org.apache.phoenix.hbase.index.covered.example.EndtoEndIndexingWithCompressionIT
Running org.apache.phoenix.iterate.RoundRobinResultIteratorWithStatsIT
Running org.apache.phoenix.iterate.ScannerLeaseRenewalIT
Tests run: 1, Failures: 0, Errors: 0, Skipped: 0, Time elapsed: 8.095 sec - in org.apache.phoenix.iterate.RoundRobinResultIteratorWithStatsIT
Running org.apache.phoenix.monitoring.PhoenixMetricsIT
Running org.apache.phoenix.rpc.PhoenixClientRpcIT
Tests run: 2, Failures: 0, Errors: 0, Skipped: 0, Time elapsed: 11.274 sec - in org.apache.phoenix.rpc.PhoenixClientRpcIT
Tests run: 12, Failures: 0, Errors: 0, Skipped: 0, Time elapsed: 157.567 sec - in org.apache.phoenix.end2end.index.ImmutableIndexIT
Running org.apache.phoenix.rpc.PhoenixServerRpcIT
Tests run: 18, Failures: 0, Errors: 0, Skipped: 0, Time elapsed: 66.462 sec - in org.apache.phoenix.monitoring.PhoenixMetricsIT
Tests run: 80, Failures: 0, Errors: 0, Skipped: 0, Time elapsed: 259.495 sec - in org.apache.phoenix.end2end.IndexExtendedIT
Tests run: 1, Failures: 0, Errors: 0, Skipped: 0, Time elapsed: 12.839 sec - in org.apache.phoenix.rpc.PhoenixServerRpcIT
Tests run: 11, Failures: 0, Errors: 0, Skipped: 0, Time elapsed: 138.731 sec - in org.apache.phoenix.hbase.index.covered.example.EndToEndCoveredIndexingIT
Tests run: 11, Failures: 0, Errors: 0, Skipped: 0, Time elapsed: 138.646 sec - in org.apache.phoenix.hbase.index.covered.example.EndtoEndIndexingWithCompressionIT
Tests run: 2, Failures: 0, Errors: 0, Skipped: 0, Time elapsed: 167.831 sec - in org.apache.phoenix.iterate.ScannerLeaseRenewalIT
Tests run: 8, Failures: 0, Errors: 0, Skipped: 0, Time elapsed: 302.303 sec - in org.apache.phoenix.end2end.index.MutableIndexFailureIT

Results :

Tests in error: 
  FlappingLocalIndexIT>BaseLocalIndexIT.doSetup:62->BaseTest.setUpTestDriver:564->BaseTest.initAndRegisterTestDriver:680
» SQL
  StatsCollectorIT.doSetup:96->BaseTest.setUpTestDriver:564->BaseTest.initAndRegisterTestDriver:680
» SQL
  SysTableNamespaceMappedStatsCollectorIT.doSetup:45->BaseTest.setUpTestDriver:564->BaseTest.initAndRegisterTestDriver:680
» SQL
  LocalIndexIT>BaseLocalIndexIT.doSetup:62->BaseTest.setUpTestDriver:564->BaseTest.initAndRegisterTestDriver:680
» SQL

Tests run: 215, Failures: 0, Errors: 4, Skipped: 0

[INFO] 
[INFO] --- maven-failsafe-plugin:2.19.1:verify (ParallelStatsEnabledTest) @ phoenix-core ---
[INFO] ------------------------------------------------------------------------
[INFO] Reactor Summary:
[INFO] 
[INFO] Apache Phoenix ..................................... SUCCESS [  2.223 s]
[INFO] Phoenix Core ....................................... FAILURE [48:19 min]
[INFO] Phoenix - Flume .................................... SKIPPED
[INFO] Phoenix - Pig ...................................... SKIPPED
[INFO] Phoenix Query Server Client ........................ SKIPPED
[INFO] Phoenix Query Server ............................... SKIPPED
[INFO] Phoenix - Pherf .................................... SKIPPED
[INFO] Phoenix - Spark .................................... SKIPPED
[INFO] Phoenix - Hive ..................................... SKIPPED
[INFO] Phoenix Client ..................................... SKIPPED
[INFO] Phoenix Server ..................................... SKIPPED
[INFO] Phoenix Assembly ................................... SKIPPED
[INFO] Phoenix - Tracing Web Application .................. SKIPPED
[INFO] ------------------------------------------------------------------------
[INFO] BUILD FAILURE
[INFO] ------------------------------------------------------------------------
[INFO] Total time: 48:23 min
[INFO] Finished at: 2016-12-22T01:21:30+00:00
[INFO] Final Memory: 77M/1616M
[INFO] ------------------------------------------------------------------------
[ERROR] Failed to execute goal org.apache.maven.plugins:maven-failsafe-plugin:2.19.1:verify
(ParallelStatsEnabledTest) on project phoenix-core: There are test failures.
[ERROR] 
[ERROR] Please refer to /home/jenkins/jenkins-slave/workspace/Phoenix-4.9/phoenix-core/target/failsafe-reports
for the individual test results.
[ERROR] -> [Help 1]
[ERROR] 
[ERROR] To see the full stack trace of the errors, re-run Maven with the -e switch.
[ERROR] Re-run Maven using the -X switch to enable full debug logging.
[ERROR] 
[ERROR] For more information about the errors and possible solutions, please read the following
articles:
[ERROR] [Help 1] http://cwiki.apache.org/confluence/display/MAVEN/MojoFailureException
[ERROR] 
[ERROR] After correcting the problems, you can resume the build with the command
[ERROR]   mvn <goals> -rf :phoenix-core
Build step 'Invoke top-level Maven targets' marked build as failure
Archiving artifacts
Compressed 1.40 GB of artifacts by 69.4% relative to #15
Recording test results
ERROR: Step ?Publish JUnit test result report? aborted due to exception: 
java.lang.InterruptedException
	at java.lang.Object.wait(Native Method)
	at hudson.remoting.Request.call(Request.java:147)
	at hudson.remoting.Channel.call(Channel.java:780)
	at hudson.FilePath.act(FilePath.java:1007)
	at hudson.FilePath.act(FilePath.java:996)
	at hudson.tasks.junit.JUnitParser.parseResult(JUnitParser.java:103)
	at hudson.tasks.junit.JUnitResultArchiver.parse(JUnitResultArchiver.java:128)
	at hudson.tasks.junit.JUnitResultArchiver.perform(JUnitResultArchiver.java:149)
	at hudson.tasks.BuildStepCompatibilityLayer.perform(BuildStepCompatibilityLayer.java:78)
	at hudson.tasks.BuildStepMonitor$1.perform(BuildStepMonitor.java:20)
	at hudson.model.AbstractBuild$AbstractBuildExecution.perform(AbstractBuild.java:779)
	at hudson.model.AbstractBuild$AbstractBuildExecution.performAllBuildSteps(AbstractBuild.java:720)
	at hudson.model.Build$BuildExecution.post2(Build.java:185)
	at hudson.model.AbstractBuild$AbstractBuildExecution.post(AbstractBuild.java:665)
	at hudson.model.Run.execute(Run.java:1766)
	at hudson.model.FreeStyleBuild.run(FreeStyleBuild.java:43)
	at hudson.model.ResourceController.execute(ResourceController.java:98)
	at hudson.model.Executor.run(Executor.java:410)
Email was triggered for: Failure - Any
Sending email for trigger: Failure - Any

Mime
  • Unnamed multipart/mixed (inline, None, 0 bytes)
View raw message