phoenix-commits mailing list archives

Site index · List index
Message view « Date » · « Thread »
Top « Date » · « Thread »
From Apache Jenkins Server <jenk...@builds.apache.org>
Subject Apache-Phoenix | origin/4.9-HBase-0.98 | Build Failure
Date Thu, 22 Dec 2016 00:08:49 GMT
<a href="http://phoenix.apache.org"><img src='http://phoenix.apache.org/images/phoenix-logo-small.png'/></a><br><b>origin/4.9-HBase-0.98</b>
branch build status <b>Failure</b>
<hr/>
<b>Source repository</b> https://git-wip-us.apache.org/repos/asf?p=phoenix.git;a=shortlog;h=refs/heads/origin/4.9-HBase-0.98
<hr/>
<b>Compiled Artifacts</b> https://builds.apache.org/job/Phoenix-4.9/lastSuccessfulBuild/artifact/
<hr/>
<b>Test Report</b> https://builds.apache.org/job/Phoenix-4.9/lastCompletedBuild/testReport/
<hr/>
<b>Changes</b><br/>
[samarth] PHOENIX-3535 Fix race condition in


<hr/>
<b>Build times for last couple of runs</b><br/>Latest build time is the
right most | Legend blue: normal, red: test failure, gray: timeout<br/>
<img src='https://builds.apache.org/view/M-R/view/Phoenix/job/Phoenix-4.9/buildTimeGraph/png'/>
<br/>
[...truncated 768 lines...]
Tests run: 66, Failures: 0, Errors: 0, Skipped: 0, Time elapsed: 306.631 sec - in org.apache.phoenix.end2end.index.IndexExpressionIT
Running org.apache.phoenix.tx.FlappingTransactionIT
Tests run: 2, Failures: 0, Errors: 0, Skipped: 0, Time elapsed: 2.633 sec - in org.apache.phoenix.trace.PhoenixTraceReaderIT
Running org.apache.phoenix.tx.TransactionIT
Tests run: 4, Failures: 0, Errors: 0, Skipped: 0, Time elapsed: 5.234 sec - in org.apache.phoenix.tx.FlappingTransactionIT
Running org.apache.phoenix.tx.TxCheckpointIT
Tests run: 19, Failures: 0, Errors: 0, Skipped: 1, Time elapsed: 64.643 sec - in org.apache.phoenix.tx.TransactionIT
Tests run: 6, Failures: 0, Errors: 0, Skipped: 0, Time elapsed: 87.977 sec - in org.apache.phoenix.trace.PhoenixTracingEndToEndIT
Tests run: 20, Failures: 0, Errors: 0, Skipped: 0, Time elapsed: 98.763 sec - in org.apache.phoenix.tx.TxCheckpointIT
Tests run: 40, Failures: 0, Errors: 0, Skipped: 0, Time elapsed: 440.904 sec - in org.apache.phoenix.end2end.index.MutableIndexIT
Tests run: 152, Failures: 0, Errors: 0, Skipped: 0, Time elapsed: 681.358 sec - in org.apache.phoenix.end2end.index.IndexIT

Results :

Tests run: 1640, Failures: 0, Errors: 0, Skipped: 1

[INFO] 
[INFO] --- maven-failsafe-plugin:2.19.1:integration-test (ClientManagedTimeTests) @ phoenix-core
---

-------------------------------------------------------
 T E S T S
-------------------------------------------------------
Running org.apache.phoenix.end2end.CastAndCoerceIT
Running org.apache.phoenix.end2end.CaseStatementIT
Running org.apache.phoenix.end2end.ArrayIT
Running org.apache.phoenix.end2end.AggregateQueryIT
Running org.apache.phoenix.end2end.ClientTimeArithmeticQueryIT
Tests run: 49, Failures: 0, Errors: 0, Skipped: 0, Time elapsed: 34.421 sec - in org.apache.phoenix.end2end.CastAndCoerceIT
Running org.apache.phoenix.end2end.ColumnProjectionOptimizationIT
Tests run: 63, Failures: 0, Errors: 0, Skipped: 0, Time elapsed: 38.215 sec - in org.apache.phoenix.end2end.CaseStatementIT
Running org.apache.phoenix.end2end.CreateSchemaIT
Tests run: 1, Failures: 0, Errors: 0, Skipped: 0, Time elapsed: 0.179 sec - in org.apache.phoenix.end2end.CreateSchemaIT
Running org.apache.phoenix.end2end.CreateTableIT
Tests run: 3, Failures: 0, Errors: 0, Skipped: 0, Time elapsed: 15.303 sec - in org.apache.phoenix.end2end.ColumnProjectionOptimizationIT
Running org.apache.phoenix.end2end.CustomEntityDataIT
Tests run: 79, Failures: 0, Errors: 0, Skipped: 0, Time elapsed: 51.55 sec - in org.apache.phoenix.end2end.ArrayIT
Running org.apache.phoenix.end2end.DerivedTableIT
Tests run: 49, Failures: 0, Errors: 0, Skipped: 0, Time elapsed: 52.208 sec - in org.apache.phoenix.end2end.AggregateQueryIT
Running org.apache.phoenix.end2end.DistinctCountIT
Tests run: 3, Failures: 0, Errors: 0, Skipped: 0, Time elapsed: 3.539 sec - in org.apache.phoenix.end2end.CustomEntityDataIT
Running org.apache.phoenix.end2end.DropSchemaIT
Tests run: 2, Failures: 0, Errors: 0, Skipped: 0, Time elapsed: 3.469 sec - in org.apache.phoenix.end2end.DropSchemaIT
Running org.apache.phoenix.end2end.ExtendedQueryExecIT
Tests run: 4, Failures: 0, Errors: 0, Skipped: 0, Time elapsed: 4.028 sec - in org.apache.phoenix.end2end.ExtendedQueryExecIT
Running org.apache.phoenix.end2end.FunkyNamesIT
Tests run: 10, Failures: 0, Errors: 0, Skipped: 0, Time elapsed: 9.98 sec - in org.apache.phoenix.end2end.DistinctCountIT
Running org.apache.phoenix.end2end.GroupByIT
Tests run: 18, Failures: 0, Errors: 0, Skipped: 0, Time elapsed: 11.966 sec - in org.apache.phoenix.end2end.DerivedTableIT
Tests run: 3, Failures: 0, Errors: 0, Skipped: 0, Time elapsed: 3.78 sec - in org.apache.phoenix.end2end.FunkyNamesIT
Running org.apache.phoenix.end2end.NotQueryIT
Running org.apache.phoenix.end2end.NativeHBaseTypesIT
Tests run: 7, Failures: 0, Errors: 0, Skipped: 0, Time elapsed: 2.553 sec - in org.apache.phoenix.end2end.NativeHBaseTypesIT
Running org.apache.phoenix.end2end.PointInTimeQueryIT
Tests run: 15, Failures: 0, Errors: 0, Skipped: 0, Time elapsed: 44.009 sec - in org.apache.phoenix.end2end.CreateTableIT
Running org.apache.phoenix.end2end.ProductMetricsIT
Tests run: 14, Failures: 0, Errors: 0, Skipped: 0, Time elapsed: 16.936 sec - in org.apache.phoenix.end2end.PointInTimeQueryIT
Running org.apache.phoenix.end2end.QueryDatabaseMetaDataIT
Tests run: 77, Failures: 0, Errors: 0, Skipped: 0, Time elapsed: 40.227 sec - in org.apache.phoenix.end2end.NotQueryIT
Running org.apache.phoenix.end2end.QueryIT
Tests run: 61, Failures: 0, Errors: 0, Skipped: 0, Time elapsed: 24.903 sec - in org.apache.phoenix.end2end.ProductMetricsIT
Running org.apache.phoenix.end2end.ReadIsolationLevelIT
Tests run: 2, Failures: 0, Errors: 0, Skipped: 0, Time elapsed: 2.39 sec - in org.apache.phoenix.end2end.ReadIsolationLevelIT
Running org.apache.phoenix.end2end.RowValueConstructorIT
Tests run: 105, Failures: 0, Errors: 0, Skipped: 0, Time elapsed: 56.495 sec - in org.apache.phoenix.end2end.GroupByIT
Tests run: 245, Failures: 0, Errors: 0, Skipped: 0, Time elapsed: 123.569 sec - in org.apache.phoenix.end2end.ClientTimeArithmeticQueryIT
Running org.apache.phoenix.end2end.ScanQueryIT
Running org.apache.phoenix.end2end.SequenceBulkAllocationIT
Tests run: 19, Failures: 0, Errors: 0, Skipped: 0, Time elapsed: 74.975 sec - in org.apache.phoenix.end2end.QueryDatabaseMetaDataIT
Running org.apache.phoenix.end2end.SequenceIT
Tests run: 56, Failures: 0, Errors: 0, Skipped: 0, Time elapsed: 14.138 sec - in org.apache.phoenix.end2end.SequenceBulkAllocationIT
Running org.apache.phoenix.end2end.ToNumberFunctionIT
Tests run: 46, Failures: 0, Errors: 0, Skipped: 0, Time elapsed: 62.491 sec - in org.apache.phoenix.end2end.RowValueConstructorIT
Tests run: 18, Failures: 0, Errors: 0, Skipped: 0, Time elapsed: 5.945 sec - in org.apache.phoenix.end2end.ToNumberFunctionIT
Running org.apache.phoenix.end2end.TopNIT
Tests run: 126, Failures: 0, Errors: 0, Skipped: 0, Time elapsed: 67.803 sec - in org.apache.phoenix.end2end.QueryIT
Tests run: 4, Failures: 0, Errors: 0, Skipped: 0, Time elapsed: 4.781 sec - in org.apache.phoenix.end2end.TopNIT
Running org.apache.phoenix.end2end.TruncateFunctionIT
Tests run: 1, Failures: 0, Errors: 0, Skipped: 0, Time elapsed: 3.011 sec - in org.apache.phoenix.end2end.TruncateFunctionIT
Running org.apache.phoenix.end2end.UpsertSelectIT
Tests run: 119, Failures: 0, Errors: 0, Skipped: 0, Time elapsed: 48.784 sec - in org.apache.phoenix.end2end.ScanQueryIT
Running org.apache.phoenix.end2end.salted.SaltedTableIT
Tests run: 54, Failures: 0, Errors: 0, Skipped: 0, Time elapsed: 26.949 sec - in org.apache.phoenix.end2end.SequenceIT
Tests run: 8, Failures: 0, Errors: 0, Skipped: 0, Time elapsed: 4.375 sec - in org.apache.phoenix.end2end.salted.SaltedTableIT
Running org.apache.phoenix.end2end.UpsertValuesIT
Running org.apache.phoenix.end2end.VariableLengthPKIT
Running org.apache.phoenix.rpc.UpdateCacheWithScnIT
Tests run: 1, Failures: 0, Errors: 0, Skipped: 0, Time elapsed: 3.175 sec - in org.apache.phoenix.rpc.UpdateCacheWithScnIT
Tests run: 50, Failures: 0, Errors: 0, Skipped: 0, Time elapsed: 32.315 sec - in org.apache.phoenix.end2end.VariableLengthPKIT
Tests run: 22, Failures: 0, Errors: 0, Skipped: 0, Time elapsed: 59.898 sec - in org.apache.phoenix.end2end.UpsertSelectIT
Tests run: 25, Failures: 0, Errors: 0, Skipped: 0, Time elapsed: 51.329 sec - in org.apache.phoenix.end2end.UpsertValuesIT

Results :

Tests run: 1359, Failures: 0, Errors: 0, Skipped: 0

[INFO] 
[INFO] --- maven-failsafe-plugin:2.19.1:integration-test (HBaseManagedTimeTests) @ phoenix-core
---

-------------------------------------------------------
 T E S T S
-------------------------------------------------------

Results :

Tests run: 0, Failures: 0, Errors: 0, Skipped: 0

[INFO] 
[INFO] --- maven-failsafe-plugin:2.19.1:integration-test (NeedTheirOwnClusterTests) @ phoenix-core
---

-------------------------------------------------------
 T E S T S
-------------------------------------------------------
Running org.apache.hadoop.hbase.regionserver.wal.WALReplayWithIndexWritesAndCompressedWALIT
Tests run: 1, Failures: 0, Errors: 0, Skipped: 0, Time elapsed: 18.556 sec - in org.apache.hadoop.hbase.regionserver.wal.WALReplayWithIndexWritesAndCompressedWALIT
Running org.apache.phoenix.end2end.ConnectionUtilIT
Running org.apache.phoenix.end2end.CountDistinctCompressionIT
Running org.apache.phoenix.end2end.ContextClassloaderIT
Running org.apache.phoenix.end2end.CsvBulkLoadToolIT
Tests run: 1, Failures: 0, Errors: 0, Skipped: 0, Time elapsed: 18.291 sec - in org.apache.phoenix.end2end.ConnectionUtilIT
Tests run: 1, Failures: 0, Errors: 0, Skipped: 0, Time elapsed: 4.882 sec - in org.apache.phoenix.end2end.CountDistinctCompressionIT
Tests run: 3, Failures: 0, Errors: 0, Skipped: 0, Time elapsed: 3.244 sec - in org.apache.phoenix.end2end.ContextClassloaderIT
Running org.apache.phoenix.end2end.FlappingLocalIndexIT
Tests run: 1, Failures: 0, Errors: 1, Skipped: 0, Time elapsed: 0.002 sec <<< FAILURE!
- in org.apache.phoenix.end2end.FlappingLocalIndexIT
org.apache.phoenix.end2end.FlappingLocalIndexIT  Time elapsed: 0.002 sec  <<< ERROR!
java.sql.SQLException: org.apache.hadoop.hbase.TableNotFoundException: SYSTEM:CATALOG
Caused by: org.apache.hadoop.hbase.TableNotFoundException: SYSTEM:CATALOG

Running org.apache.phoenix.end2end.IndexExtendedIT
Running org.apache.phoenix.end2end.RenewLeaseIT
Tests run: 1, Failures: 0, Errors: 0, Skipped: 1, Time elapsed: 0.002 sec - in org.apache.phoenix.end2end.RenewLeaseIT
Running org.apache.phoenix.end2end.QueryTimeoutIT
Running org.apache.phoenix.end2end.QueryWithLimitIT
Tests run: 10, Failures: 0, Errors: 0, Skipped: 0, Time elapsed: 54.6 sec - in org.apache.phoenix.end2end.CsvBulkLoadToolIT
Tests run: 2, Failures: 0, Errors: 0, Skipped: 0, Time elapsed: 4.909 sec - in org.apache.phoenix.end2end.QueryWithLimitIT
Tests run: 2, Failures: 0, Errors: 0, Skipped: 0, Time elapsed: 13.416 sec - in org.apache.phoenix.end2end.QueryTimeoutIT
Tests run: 40, Failures: 0, Errors: 0, Skipped: 16, Time elapsed: 43.473 sec - in org.apache.phoenix.end2end.IndexExtendedIT
Running org.apache.phoenix.end2end.StatsCollectorIT
Tests run: 1, Failures: 0, Errors: 1, Skipped: 0, Time elapsed: 0.01 sec <<< FAILURE!
- in org.apache.phoenix.end2end.StatsCollectorIT
org.apache.phoenix.end2end.StatsCollectorIT  Time elapsed: 0.01 sec  <<< ERROR!
java.sql.SQLException: org.apache.hadoop.hbase.TableNotFoundException: SYSTEM:CATALOG
	at org.apache.phoenix.end2end.StatsCollectorIT.doSetup(StatsCollectorIT.java:96)
Caused by: org.apache.hadoop.hbase.TableNotFoundException: SYSTEM:CATALOG
	at org.apache.phoenix.end2end.StatsCollectorIT.doSetup(StatsCollectorIT.java:96)

Running org.apache.phoenix.end2end.SpillableGroupByIT
Running org.apache.phoenix.end2end.SysTableNamespaceMappedStatsCollectorIT
Tests run: 1, Failures: 0, Errors: 1, Skipped: 0, Time elapsed: 0.006 sec <<< FAILURE!
- in org.apache.phoenix.end2end.SysTableNamespaceMappedStatsCollectorIT
org.apache.phoenix.end2end.SysTableNamespaceMappedStatsCollectorIT  Time elapsed: 0.005 sec
 <<< ERROR!
java.sql.SQLException: org.apache.hadoop.hbase.TableNotFoundException: SYSTEM:CATALOG
	at org.apache.phoenix.end2end.SysTableNamespaceMappedStatsCollectorIT.doSetup(SysTableNamespaceMappedStatsCollectorIT.java:45)
Caused by: org.apache.hadoop.hbase.TableNotFoundException: SYSTEM:CATALOG
	at org.apache.phoenix.end2end.SysTableNamespaceMappedStatsCollectorIT.doSetup(SysTableNamespaceMappedStatsCollectorIT.java:45)

Tests run: 2, Failures: 0, Errors: 0, Skipped: 0, Time elapsed: 13.984 sec - in org.apache.phoenix.end2end.SpillableGroupByIT
Running org.apache.phoenix.end2end.index.LocalIndexIT
Tests run: 1, Failures: 0, Errors: 1, Skipped: 0, Time elapsed: 0.008 sec <<< FAILURE!
- in org.apache.phoenix.end2end.index.LocalIndexIT
org.apache.phoenix.end2end.index.LocalIndexIT  Time elapsed: 0.007 sec  <<< ERROR!
java.sql.SQLException: org.apache.hadoop.hbase.TableNotFoundException: SYSTEM:CATALOG
Caused by: org.apache.hadoop.hbase.TableNotFoundException: SYSTEM:CATALOG

Running org.apache.phoenix.end2end.UserDefinedFunctionsIT
Running org.apache.phoenix.end2end.index.ImmutableIndexIT
Running org.apache.phoenix.end2end.index.MutableIndexFailureIT
Running org.apache.phoenix.end2end.index.MutableIndexReplicationIT
Tests run: 14, Failures: 0, Errors: 0, Skipped: 0, Time elapsed: 19.705 sec - in org.apache.phoenix.end2end.UserDefinedFunctionsIT
Running org.apache.phoenix.end2end.index.ReadOnlyIndexFailureIT
Tests run: 1, Failures: 0, Errors: 0, Skipped: 0, Time elapsed: 17.013 sec - in org.apache.phoenix.end2end.index.MutableIndexReplicationIT
Tests run: 2, Failures: 0, Errors: 0, Skipped: 0, Time elapsed: 25.047 sec - in org.apache.phoenix.end2end.index.ReadOnlyIndexFailureIT
Running org.apache.phoenix.hbase.index.FailForUnsupportedHBaseVersionsIT
Running org.apache.phoenix.end2end.index.txn.TxWriteFailureIT
Running org.apache.phoenix.execute.PartialCommitIT
Tests run: 2, Failures: 0, Errors: 0, Skipped: 0, Time elapsed: 20.078 sec - in org.apache.phoenix.hbase.index.FailForUnsupportedHBaseVersionsIT
Tests run: 12, Failures: 0, Errors: 0, Skipped: 0, Time elapsed: 10.504 sec - in org.apache.phoenix.execute.PartialCommitIT
Running org.apache.phoenix.hbase.index.covered.EndToEndCoveredColumnsIndexBuilderIT
Tests run: 8, Failures: 0, Errors: 0, Skipped: 0, Time elapsed: 34.495 sec - in org.apache.phoenix.end2end.index.txn.TxWriteFailureIT
Tests run: 2, Failures: 0, Errors: 0, Skipped: 0, Time elapsed: 8.616 sec - in org.apache.phoenix.hbase.index.covered.EndToEndCoveredColumnsIndexBuilderIT
Running org.apache.phoenix.hbase.index.covered.example.FailWithoutRetriesIT
Running org.apache.phoenix.hbase.index.covered.example.EndToEndCoveredIndexingIT
Tests run: 1, Failures: 0, Errors: 0, Skipped: 0, Time elapsed: 8.516 sec - in org.apache.phoenix.hbase.index.covered.example.FailWithoutRetriesIT
Running org.apache.phoenix.hbase.index.covered.example.EndtoEndIndexingWithCompressionIT
Tests run: 12, Failures: 0, Errors: 0, Skipped: 0, Time elapsed: 123.818 sec - in org.apache.phoenix.end2end.index.ImmutableIndexIT
Running org.apache.phoenix.iterate.RoundRobinResultIteratorWithStatsIT
Running org.apache.phoenix.iterate.ScannerLeaseRenewalIT
Tests run: 1, Failures: 0, Errors: 0, Skipped: 0, Time elapsed: 14.666 sec - in org.apache.phoenix.iterate.RoundRobinResultIteratorWithStatsIT
Tests run: 11, Failures: 0, Errors: 0, Skipped: 0, Time elapsed: 44.911 sec - in org.apache.phoenix.hbase.index.covered.example.EndtoEndIndexingWithCompressionIT
Tests run: 11, Failures: 0, Errors: 0, Skipped: 0, Time elapsed: 53.888 sec - in org.apache.phoenix.hbase.index.covered.example.EndToEndCoveredIndexingIT
Running org.apache.phoenix.monitoring.PhoenixMetricsIT
Running org.apache.phoenix.rpc.PhoenixClientRpcIT
Running org.apache.phoenix.rpc.PhoenixServerRpcIT
Tests run: 2, Failures: 0, Errors: 0, Skipped: 0, Time elapsed: 5.499 sec - in org.apache.phoenix.rpc.PhoenixClientRpcIT
Tests run: 1, Failures: 0, Errors: 0, Skipped: 0, Time elapsed: 15.081 sec - in org.apache.phoenix.rpc.PhoenixServerRpcIT
Tests run: 18, Failures: 0, Errors: 0, Skipped: 0, Time elapsed: 27.235 sec - in org.apache.phoenix.monitoring.PhoenixMetricsIT
Tests run: 8, Failures: 0, Errors: 0, Skipped: 0, Time elapsed: 254.692 sec - in org.apache.phoenix.end2end.index.MutableIndexFailureIT
Tests run: 2, Failures: 0, Errors: 0, Skipped: 0, Time elapsed: 164.906 sec - in org.apache.phoenix.iterate.ScannerLeaseRenewalIT

Results :

Tests in error: 
  FlappingLocalIndexIT>BaseLocalIndexIT.doSetup:62->BaseTest.setUpTestDriver:564->BaseTest.initAndRegisterTestDriver:680
» SQL
  StatsCollectorIT.doSetup:96->BaseTest.setUpTestDriver:564->BaseTest.initAndRegisterTestDriver:680
» SQL
  SysTableNamespaceMappedStatsCollectorIT.doSetup:45->BaseTest.setUpTestDriver:564->BaseTest.initAndRegisterTestDriver:680
» SQL
  LocalIndexIT>BaseLocalIndexIT.doSetup:62->BaseTest.setUpTestDriver:564->BaseTest.initAndRegisterTestDriver:680
» SQL

Tests run: 175, Failures: 0, Errors: 4, Skipped: 17

[INFO] 
[INFO] --- maven-failsafe-plugin:2.19.1:verify (ParallelStatsEnabledTest) @ phoenix-core ---
[INFO] ------------------------------------------------------------------------
[INFO] Reactor Summary:
[INFO] 
[INFO] Apache Phoenix ..................................... SUCCESS [  2.142 s]
[INFO] Phoenix Core ....................................... FAILURE [44:38 min]
[INFO] Phoenix - Flume .................................... SKIPPED
[INFO] Phoenix - Pig ...................................... SKIPPED
[INFO] Phoenix Query Server Client ........................ SKIPPED
[INFO] Phoenix Query Server ............................... SKIPPED
[INFO] Phoenix - Pherf .................................... SKIPPED
[INFO] Phoenix - Spark .................................... SKIPPED
[INFO] Phoenix - Hive ..................................... SKIPPED
[INFO] Phoenix Client ..................................... SKIPPED
[INFO] Phoenix Server ..................................... SKIPPED
[INFO] Phoenix Assembly ................................... SKIPPED
[INFO] Phoenix - Tracing Web Application .................. SKIPPED
[INFO] ------------------------------------------------------------------------
[INFO] BUILD FAILURE
[INFO] ------------------------------------------------------------------------
[INFO] Total time: 44:41 min
[INFO] Finished at: 2016-12-21T23:31:12+00:00
[INFO] Final Memory: 76M/1381M
[INFO] ------------------------------------------------------------------------
[ERROR] Failed to execute goal org.apache.maven.plugins:maven-failsafe-plugin:2.19.1:verify
(ParallelStatsEnabledTest) on project phoenix-core: There are test failures.
[ERROR] 
[ERROR] Please refer to /home/jenkins/jenkins-slave/workspace/Phoenix-4.9/phoenix-core/target/failsafe-reports
for the individual test results.
[ERROR] -> [Help 1]
[ERROR] 
[ERROR] To see the full stack trace of the errors, re-run Maven with the -e switch.
[ERROR] Re-run Maven using the -X switch to enable full debug logging.
[ERROR] 
[ERROR] For more information about the errors and possible solutions, please read the following
articles:
[ERROR] [Help 1] http://cwiki.apache.org/confluence/display/MAVEN/MojoFailureException
[ERROR] 
[ERROR] After correcting the problems, you can resume the build with the command
[ERROR]   mvn <goals> -rf :phoenix-core
Build step 'Invoke top-level Maven targets' marked build as failure
Archiving artifacts
Compressed 1.68 GB of artifacts by 57.7% relative to #15
Recording test results
Email was triggered for: Failure - Any
Sending email for trigger: Failure - Any

Mime
  • Unnamed multipart/mixed (inline, None, 0 bytes)
View raw message