phoenix-commits mailing list archives

Site index · List index
Message view « Date » · « Thread »
Top « Date » · « Thread »
From Apache Jenkins Server <jenk...@builds.apache.org>
Subject Build failed in Jenkins: Phoenix | Master #1518
Date Thu, 22 Dec 2016 00:17:07 GMT
See <https://builds.apache.org/job/Phoenix-master/1518/changes>

Changes:

[samarth] PHOENIX-3535 Fix race condition in

------------------------------------------
[...truncated 777 lines...]
Tests run: 4, Failures: 0, Errors: 0, Skipped: 0, Time elapsed: 9.911 sec - in org.apache.phoenix.tx.FlappingTransactionIT
Running org.apache.phoenix.tx.TransactionIT
Tests run: 9, Failures: 0, Errors: 0, Skipped: 0, Time elapsed: 50.598 sec - in org.apache.phoenix.iterate.RoundRobinResultIteratorIT
Running org.apache.phoenix.tx.TxCheckpointIT
Tests run: 6, Failures: 0, Errors: 0, Skipped: 0, Time elapsed: 89.425 sec - in org.apache.phoenix.trace.PhoenixTracingEndToEndIT
Tests run: 19, Failures: 0, Errors: 0, Skipped: 1, Time elapsed: 102.6 sec - in org.apache.phoenix.tx.TransactionIT
Tests run: 20, Failures: 0, Errors: 0, Skipped: 0, Time elapsed: 145.947 sec - in org.apache.phoenix.tx.TxCheckpointIT
Tests run: 66, Failures: 0, Errors: 0, Skipped: 0, Time elapsed: 452.524 sec - in org.apache.phoenix.end2end.index.IndexExpressionIT
Tests run: 99, Failures: 0, Errors: 0, Skipped: 0, Time elapsed: 1,056.296 sec - in org.apache.phoenix.end2end.HashJoinIT
Tests run: 40, Failures: 0, Errors: 0, Skipped: 0, Time elapsed: 546.827 sec - in org.apache.phoenix.end2end.index.MutableIndexIT
Tests run: 102, Failures: 0, Errors: 0, Skipped: 0, Time elapsed: 1,109.647 sec - in org.apache.phoenix.end2end.SortMergeJoinIT
Tests run: 152, Failures: 0, Errors: 0, Skipped: 0, Time elapsed: 1,018.507 sec - in org.apache.phoenix.end2end.index.IndexIT

Results :

Tests run: 1648, Failures: 0, Errors: 0, Skipped: 1

[INFO] 
[INFO] --- maven-failsafe-plugin:2.19.1:integration-test (ClientManagedTimeTests) @ phoenix-core
---

-------------------------------------------------------
 T E S T S
-------------------------------------------------------
Running org.apache.phoenix.end2end.CreateTableIT
Running org.apache.phoenix.end2end.ColumnProjectionOptimizationIT
Running org.apache.phoenix.end2end.CreateSchemaIT
Running org.apache.phoenix.end2end.AggregateQueryIT
Running org.apache.phoenix.end2end.ClientTimeArithmeticQueryIT
Tests run: 1, Failures: 0, Errors: 0, Skipped: 0, Time elapsed: 0.478 sec - in org.apache.phoenix.end2end.CreateSchemaIT
Running org.apache.phoenix.end2end.CastAndCoerceIT
Running org.apache.phoenix.end2end.ArrayIT
Running org.apache.phoenix.end2end.CaseStatementIT
Running org.apache.phoenix.end2end.CustomEntityDataIT
Tests run: 3, Failures: 0, Errors: 0, Skipped: 0, Time elapsed: 7.184 sec - in org.apache.phoenix.end2end.CustomEntityDataIT
Running org.apache.phoenix.end2end.DerivedTableIT
Tests run: 18, Failures: 0, Errors: 0, Skipped: 0, Time elapsed: 19.173 sec - in org.apache.phoenix.end2end.DerivedTableIT
Running org.apache.phoenix.end2end.DistinctCountIT
Tests run: 3, Failures: 0, Errors: 0, Skipped: 0, Time elapsed: 33.709 sec - in org.apache.phoenix.end2end.ColumnProjectionOptimizationIT
Running org.apache.phoenix.end2end.DropSchemaIT
Tests run: 49, Failures: 0, Errors: 0, Skipped: 0, Time elapsed: 43.156 sec - in org.apache.phoenix.end2end.CastAndCoerceIT
Running org.apache.phoenix.end2end.ExtendedQueryExecIT
Tests run: 2, Failures: 0, Errors: 0, Skipped: 0, Time elapsed: 12.069 sec - in org.apache.phoenix.end2end.DropSchemaIT
Running org.apache.phoenix.end2end.FunkyNamesIT
Tests run: 63, Failures: 0, Errors: 0, Skipped: 0, Time elapsed: 47.211 sec - in org.apache.phoenix.end2end.CaseStatementIT
Running org.apache.phoenix.end2end.GroupByIT
Tests run: 10, Failures: 0, Errors: 0, Skipped: 0, Time elapsed: 20.172 sec - in org.apache.phoenix.end2end.DistinctCountIT
Tests run: 4, Failures: 0, Errors: 0, Skipped: 0, Time elapsed: 6.756 sec - in org.apache.phoenix.end2end.ExtendedQueryExecIT
Running org.apache.phoenix.end2end.NotQueryIT
Tests run: 3, Failures: 0, Errors: 0, Skipped: 0, Time elapsed: 6.467 sec - in org.apache.phoenix.end2end.FunkyNamesIT
Running org.apache.phoenix.end2end.PointInTimeQueryIT
Tests run: 49, Failures: 0, Errors: 0, Skipped: 0, Time elapsed: 58.518 sec - in org.apache.phoenix.end2end.AggregateQueryIT
Running org.apache.phoenix.end2end.ProductMetricsIT
Running org.apache.phoenix.end2end.NativeHBaseTypesIT
Tests run: 7, Failures: 0, Errors: 0, Skipped: 0, Time elapsed: 5.035 sec - in org.apache.phoenix.end2end.NativeHBaseTypesIT
Running org.apache.phoenix.end2end.QueryDatabaseMetaDataIT
Tests run: 14, Failures: 0, Errors: 0, Skipped: 0, Time elapsed: 25.473 sec - in org.apache.phoenix.end2end.PointInTimeQueryIT
Running org.apache.phoenix.end2end.QueryIT
Tests run: 61, Failures: 0, Errors: 0, Skipped: 0, Time elapsed: 27.961 sec - in org.apache.phoenix.end2end.ProductMetricsIT
Tests run: 79, Failures: 0, Errors: 0, Skipped: 0, Time elapsed: 88.484 sec - in org.apache.phoenix.end2end.ArrayIT
Running org.apache.phoenix.end2end.ReadIsolationLevelIT
Tests run: 15, Failures: 0, Errors: 0, Skipped: 0, Time elapsed: 94.908 sec - in org.apache.phoenix.end2end.CreateTableIT
Running org.apache.phoenix.end2end.RowValueConstructorIT
Tests run: 2, Failures: 0, Errors: 0, Skipped: 0, Time elapsed: 5.304 sec - in org.apache.phoenix.end2end.ReadIsolationLevelIT
Running org.apache.phoenix.end2end.ScanQueryIT
Tests run: 77, Failures: 0, Errors: 0, Skipped: 0, Time elapsed: 44.669 sec - in org.apache.phoenix.end2end.NotQueryIT
Tests run: 105, Failures: 0, Errors: 0, Skipped: 0, Time elapsed: 64.493 sec - in org.apache.phoenix.end2end.GroupByIT
Running org.apache.phoenix.end2end.SequenceIT
Running org.apache.phoenix.end2end.SequenceBulkAllocationIT
Tests run: 245, Failures: 0, Errors: 0, Skipped: 0, Time elapsed: 136.423 sec - in org.apache.phoenix.end2end.ClientTimeArithmeticQueryIT
Running org.apache.phoenix.end2end.ToNumberFunctionIT
Tests run: 126, Failures: 0, Errors: 0, Skipped: 0, Time elapsed: 64.504 sec - in org.apache.phoenix.end2end.QueryIT
Tests run: 18, Failures: 0, Errors: 0, Skipped: 0, Time elapsed: 6.859 sec - in org.apache.phoenix.end2end.ToNumberFunctionIT
Tests run: 56, Failures: 0, Errors: 0, Skipped: 0, Time elapsed: 27.022 sec - in org.apache.phoenix.end2end.SequenceBulkAllocationIT
Running org.apache.phoenix.end2end.UpsertSelectIT
Running org.apache.phoenix.end2end.UpsertValuesIT
Tests run: 119, Failures: 0, Errors: 0, Skipped: 0, Time elapsed: 57.748 sec - in org.apache.phoenix.end2end.ScanQueryIT
Running org.apache.phoenix.end2end.TopNIT
Tests run: 4, Failures: 0, Errors: 0, Skipped: 0, Time elapsed: 6.416 sec - in org.apache.phoenix.end2end.TopNIT
Running org.apache.phoenix.end2end.salted.SaltedTableIT
Tests run: 54, Failures: 0, Errors: 0, Skipped: 0, Time elapsed: 49.257 sec - in org.apache.phoenix.end2end.SequenceIT
Running org.apache.phoenix.rpc.UpdateCacheWithScnIT
Running org.apache.phoenix.end2end.TruncateFunctionIT
Tests run: 8, Failures: 0, Errors: 0, Skipped: 0, Time elapsed: 6.728 sec - in org.apache.phoenix.end2end.salted.SaltedTableIT
Tests run: 1, Failures: 0, Errors: 0, Skipped: 0, Time elapsed: 5.808 sec - in org.apache.phoenix.end2end.TruncateFunctionIT
Tests run: 1, Failures: 0, Errors: 0, Skipped: 0, Time elapsed: 6.186 sec - in org.apache.phoenix.rpc.UpdateCacheWithScnIT
Running org.apache.phoenix.end2end.VariableLengthPKIT
Tests run: 19, Failures: 0, Errors: 0, Skipped: 0, Time elapsed: 134.193 sec - in org.apache.phoenix.end2end.QueryDatabaseMetaDataIT
Tests run: 46, Failures: 0, Errors: 0, Skipped: 0, Time elapsed: 124.476 sec - in org.apache.phoenix.end2end.RowValueConstructorIT
Tests run: 50, Failures: 0, Errors: 0, Skipped: 0, Time elapsed: 44.284 sec - in org.apache.phoenix.end2end.VariableLengthPKIT
Tests run: 25, Failures: 0, Errors: 0, Skipped: 0, Time elapsed: 118.704 sec - in org.apache.phoenix.end2end.UpsertValuesIT
Tests run: 22, Failures: 0, Errors: 0, Skipped: 0, Time elapsed: 134.493 sec - in org.apache.phoenix.end2end.UpsertSelectIT

Results :

Tests run: 1359, Failures: 0, Errors: 0, Skipped: 0

[INFO] 
[INFO] --- maven-failsafe-plugin:2.19.1:integration-test (HBaseManagedTimeTests) @ phoenix-core
---

-------------------------------------------------------
 T E S T S
-------------------------------------------------------

Results :

Tests run: 0, Failures: 0, Errors: 0, Skipped: 0

[INFO] 
[INFO] --- maven-failsafe-plugin:2.19.1:integration-test (NeedTheirOwnClusterTests) @ phoenix-core
---

-------------------------------------------------------
 T E S T S
-------------------------------------------------------
Running org.apache.hadoop.hbase.regionserver.wal.WALReplayWithIndexWritesAndCompressedWALIT
Running org.apache.phoenix.end2end.ConnectionUtilIT
Tests run: 1, Failures: 0, Errors: 0, Skipped: 0, Time elapsed: 32.943 sec - in org.apache.hadoop.hbase.regionserver.wal.WALReplayWithIndexWritesAndCompressedWALIT
Running org.apache.phoenix.end2end.ContextClassloaderIT
Running org.apache.phoenix.end2end.CountDistinctCompressionIT
Running org.apache.phoenix.end2end.CsvBulkLoadToolIT
Running org.apache.phoenix.end2end.FlappingLocalIndexIT
Tests run: 1, Failures: 0, Errors: 1, Skipped: 0, Time elapsed: 0.007 sec <<< FAILURE!
- in org.apache.phoenix.end2end.FlappingLocalIndexIT
org.apache.phoenix.end2end.FlappingLocalIndexIT  Time elapsed: 0.007 sec  <<< ERROR!
java.sql.SQLException: org.apache.hadoop.hbase.TableNotFoundException: SYSTEM:CATALOG
Caused by: org.apache.hadoop.hbase.TableNotFoundException: SYSTEM:CATALOG

Tests run: 3, Failures: 0, Errors: 0, Skipped: 0, Time elapsed: 6.764 sec - in org.apache.phoenix.end2end.ContextClassloaderIT
Tests run: 1, Failures: 0, Errors: 0, Skipped: 0, Time elapsed: 27.702 sec - in org.apache.phoenix.end2end.ConnectionUtilIT
Tests run: 1, Failures: 0, Errors: 0, Skipped: 0, Time elapsed: 6.755 sec - in org.apache.phoenix.end2end.CountDistinctCompressionIT
Running org.apache.phoenix.end2end.IndexExtendedIT
Running org.apache.phoenix.end2end.QueryTimeoutIT
Running org.apache.phoenix.end2end.QueryWithLimitIT
Running org.apache.phoenix.end2end.RenewLeaseIT
Tests run: 2, Failures: 0, Errors: 0, Skipped: 0, Time elapsed: 8.596 sec - in org.apache.phoenix.end2end.QueryWithLimitIT
Running org.apache.phoenix.end2end.SpillableGroupByIT
Running org.apache.phoenix.end2end.StatsCollectorIT
Tests run: 1, Failures: 0, Errors: 1, Skipped: 0, Time elapsed: 0.005 sec <<< FAILURE!
- in org.apache.phoenix.end2end.StatsCollectorIT
org.apache.phoenix.end2end.StatsCollectorIT  Time elapsed: 0.005 sec  <<< ERROR!
java.sql.SQLException: org.apache.hadoop.hbase.TableNotFoundException: SYSTEM:CATALOG
	at org.apache.phoenix.end2end.StatsCollectorIT.doSetup(StatsCollectorIT.java:96)
Caused by: org.apache.hadoop.hbase.TableNotFoundException: SYSTEM:CATALOG
	at org.apache.phoenix.end2end.StatsCollectorIT.doSetup(StatsCollectorIT.java:96)

Tests run: 1, Failures: 0, Errors: 0, Skipped: 0, Time elapsed: 8.134 sec - in org.apache.phoenix.end2end.RenewLeaseIT
Tests run: 2, Failures: 0, Errors: 0, Skipped: 0, Time elapsed: 18.819 sec - in org.apache.phoenix.end2end.QueryTimeoutIT
Running org.apache.phoenix.end2end.SysTableNamespaceMappedStatsCollectorIT
Tests run: 1, Failures: 0, Errors: 1, Skipped: 0, Time elapsed: 0.005 sec <<< FAILURE!
- in org.apache.phoenix.end2end.SysTableNamespaceMappedStatsCollectorIT
org.apache.phoenix.end2end.SysTableNamespaceMappedStatsCollectorIT  Time elapsed: 0.005 sec
 <<< ERROR!
java.sql.SQLException: org.apache.hadoop.hbase.TableNotFoundException: SYSTEM:CATALOG
	at org.apache.phoenix.end2end.SysTableNamespaceMappedStatsCollectorIT.doSetup(SysTableNamespaceMappedStatsCollectorIT.java:45)
Caused by: org.apache.hadoop.hbase.TableNotFoundException: SYSTEM:CATALOG
	at org.apache.phoenix.end2end.SysTableNamespaceMappedStatsCollectorIT.doSetup(SysTableNamespaceMappedStatsCollectorIT.java:45)

Tests run: 2, Failures: 0, Errors: 0, Skipped: 0, Time elapsed: 17.176 sec - in org.apache.phoenix.end2end.SpillableGroupByIT
Tests run: 10, Failures: 0, Errors: 0, Skipped: 0, Time elapsed: 76.266 sec - in org.apache.phoenix.end2end.CsvBulkLoadToolIT
Running org.apache.phoenix.end2end.index.LocalIndexIT
Running org.apache.phoenix.end2end.index.MutableIndexFailureIT
Tests run: 1, Failures: 0, Errors: 1, Skipped: 0, Time elapsed: 0.006 sec <<< FAILURE!
- in org.apache.phoenix.end2end.index.LocalIndexIT
org.apache.phoenix.end2end.index.LocalIndexIT  Time elapsed: 0.005 sec  <<< ERROR!
java.sql.SQLException: org.apache.hadoop.hbase.TableNotFoundException: SYSTEM:CATALOG
Caused by: org.apache.hadoop.hbase.TableNotFoundException: SYSTEM:CATALOG

Running org.apache.phoenix.end2end.index.ImmutableIndexIT
Running org.apache.phoenix.end2end.UserDefinedFunctionsIT
Running org.apache.phoenix.end2end.index.ReadOnlyIndexFailureIT
Running org.apache.phoenix.end2end.index.MutableIndexReplicationIT
Running org.apache.phoenix.end2end.index.txn.TxWriteFailureIT
Tests run: 1, Failures: 0, Errors: 0, Skipped: 0, Time elapsed: 26.823 sec - in org.apache.phoenix.end2end.index.MutableIndexReplicationIT
Running org.apache.phoenix.hbase.index.FailForUnsupportedHBaseVersionsIT
Tests run: 2, Failures: 0, Errors: 0, Skipped: 0, Time elapsed: 32.236 sec - in org.apache.phoenix.end2end.index.ReadOnlyIndexFailureIT
Running org.apache.phoenix.execute.PartialCommitIT
Tests run: 14, Failures: 0, Errors: 0, Skipped: 0, Time elapsed: 49.742 sec - in org.apache.phoenix.end2end.UserDefinedFunctionsIT
Running org.apache.phoenix.hbase.index.covered.EndToEndCoveredColumnsIndexBuilderIT
Tests run: 12, Failures: 0, Errors: 0, Skipped: 0, Time elapsed: 6.722 sec - in org.apache.phoenix.execute.PartialCommitIT
Tests run: 2, Failures: 0, Errors: 0, Skipped: 0, Time elapsed: 20.561 sec - in org.apache.phoenix.hbase.index.FailForUnsupportedHBaseVersionsIT
Running org.apache.phoenix.hbase.index.covered.example.FailWithoutRetriesIT
Tests run: 2, Failures: 0, Errors: 0, Skipped: 0, Time elapsed: 18.645 sec - in org.apache.phoenix.hbase.index.covered.EndToEndCoveredColumnsIndexBuilderIT
Tests run: 1, Failures: 0, Errors: 0, Skipped: 0, Time elapsed: 8.231 sec - in org.apache.phoenix.hbase.index.covered.example.FailWithoutRetriesIT
Running org.apache.phoenix.hbase.index.covered.example.EndToEndCoveredIndexingIT
Tests run: 8, Failures: 0, Errors: 0, Skipped: 0, Time elapsed: 60.121 sec - in org.apache.phoenix.end2end.index.txn.TxWriteFailureIT
Running org.apache.phoenix.hbase.index.covered.example.EndtoEndIndexingWithCompressionIT
Running org.apache.phoenix.iterate.RoundRobinResultIteratorWithStatsIT
Running org.apache.phoenix.iterate.ScannerLeaseRenewalIT
Tests run: 1, Failures: 0, Errors: 0, Skipped: 0, Time elapsed: 8.022 sec - in org.apache.phoenix.iterate.RoundRobinResultIteratorWithStatsIT
Running org.apache.phoenix.monitoring.PhoenixMetricsIT
Running org.apache.phoenix.rpc.PhoenixClientRpcIT
Tests run: 12, Failures: 0, Errors: 0, Skipped: 0, Time elapsed: 148.901 sec - in org.apache.phoenix.end2end.index.ImmutableIndexIT
Tests run: 2, Failures: 0, Errors: 0, Skipped: 0, Time elapsed: 12.168 sec - in org.apache.phoenix.rpc.PhoenixClientRpcIT
Running org.apache.phoenix.rpc.PhoenixServerRpcIT
Tests run: 80, Failures: 0, Errors: 0, Skipped: 0, Time elapsed: 260.343 sec - in org.apache.phoenix.end2end.IndexExtendedIT
Tests run: 18, Failures: 0, Errors: 0, Skipped: 0, Time elapsed: 67.708 sec - in org.apache.phoenix.monitoring.PhoenixMetricsIT
Tests run: 1, Failures: 0, Errors: 0, Skipped: 0, Time elapsed: 12.217 sec - in org.apache.phoenix.rpc.PhoenixServerRpcIT
Tests run: 11, Failures: 0, Errors: 0, Skipped: 0, Time elapsed: 139.412 sec - in org.apache.phoenix.hbase.index.covered.example.EndToEndCoveredIndexingIT
Tests run: 11, Failures: 0, Errors: 0, Skipped: 0, Time elapsed: 139.42 sec - in org.apache.phoenix.hbase.index.covered.example.EndtoEndIndexingWithCompressionIT
Tests run: 2, Failures: 0, Errors: 0, Skipped: 0, Time elapsed: 167.005 sec - in org.apache.phoenix.iterate.ScannerLeaseRenewalIT
Tests run: 8, Failures: 0, Errors: 0, Skipped: 0, Time elapsed: 302.359 sec - in org.apache.phoenix.end2end.index.MutableIndexFailureIT

Results :

Tests in error: 
  FlappingLocalIndexIT>BaseLocalIndexIT.doSetup:62->BaseTest.setUpTestDriver:564->BaseTest.initAndRegisterTestDriver:680
» SQL
  StatsCollectorIT.doSetup:96->BaseTest.setUpTestDriver:564->BaseTest.initAndRegisterTestDriver:680
» SQL
  SysTableNamespaceMappedStatsCollectorIT.doSetup:45->BaseTest.setUpTestDriver:564->BaseTest.initAndRegisterTestDriver:680
» SQL
  LocalIndexIT>BaseLocalIndexIT.doSetup:62->BaseTest.setUpTestDriver:564->BaseTest.initAndRegisterTestDriver:680
» SQL

Tests run: 215, Failures: 0, Errors: 4, Skipped: 0

[INFO] 
[INFO] --- maven-failsafe-plugin:2.19.1:verify (ParallelStatsEnabledTest) @ phoenix-core ---
[INFO] ------------------------------------------------------------------------
[INFO] Reactor Summary:
[INFO] 
[INFO] Apache Phoenix ..................................... SUCCESS [  3.052 s]
[INFO] Phoenix Core ....................................... FAILURE [49:43 min]
[INFO] Phoenix - Flume .................................... SKIPPED
[INFO] Phoenix - Pig ...................................... SKIPPED
[INFO] Phoenix Query Server Client ........................ SKIPPED
[INFO] Phoenix Query Server ............................... SKIPPED
[INFO] Phoenix - Pherf .................................... SKIPPED
[INFO] Phoenix - Spark .................................... SKIPPED
[INFO] Phoenix - Hive ..................................... SKIPPED
[INFO] Phoenix Client ..................................... SKIPPED
[INFO] Phoenix Server ..................................... SKIPPED
[INFO] Phoenix Assembly ................................... SKIPPED
[INFO] Phoenix - Tracing Web Application .................. SKIPPED
[INFO] ------------------------------------------------------------------------
[INFO] BUILD FAILURE
[INFO] ------------------------------------------------------------------------
[INFO] Total time: 49:48 min
[INFO] Finished at: 2016-12-22T00:12:34+00:00
[INFO] Final Memory: 76M/950M
[INFO] ------------------------------------------------------------------------
[ERROR] Failed to execute goal org.apache.maven.plugins:maven-failsafe-plugin:2.19.1:verify
(ParallelStatsEnabledTest) on project phoenix-core: There are test failures.
[ERROR] 
[ERROR] Please refer to <https://builds.apache.org/job/Phoenix-master/ws/phoenix-core/target/failsafe-reports>
for the individual test results.
[ERROR] -> [Help 1]
[ERROR] 
[ERROR] To see the full stack trace of the errors, re-run Maven with the -e switch.
[ERROR] Re-run Maven using the -X switch to enable full debug logging.
[ERROR] 
[ERROR] For more information about the errors and possible solutions, please read the following
articles:
[ERROR] [Help 1] http://cwiki.apache.org/confluence/display/MAVEN/MojoFailureException
[ERROR] 
[ERROR] After correcting the problems, you can resume the build with the command
[ERROR]   mvn <goals> -rf :phoenix-core
Build step 'Invoke top-level Maven targets' marked build as failure
Archiving artifacts
Compressed 1.49 GB of artifacts by 72.2% relative to #1517
Updating PHOENIX-3535
Recording test results

Mime
View raw message