phoenix-commits mailing list archives

Site index · List index
Message view « Date » · « Thread »
Top « Date » · « Thread »
From Apache Jenkins Server <jenk...@builds.apache.org>
Subject Build failed in Jenkins: Phoenix-4.8-HBase-1.1 #51
Date Thu, 17 Nov 2016 08:37:34 GMT
See <https://builds.apache.org/job/Phoenix-4.8-HBase-1.1/51/changes>

Changes:

[jamestaylor] PHOENIX-3452 NULLS FIRST/NULL LAST should not impact whether GROUP BY is

[jamestaylor] PHOENIX-3469 Incorrect sort order for DESC primary key for NULLS

[jamestaylor] PHOENX-3451 Incorrect determination of preservation of order for an

------------------------------------------
[...truncated 785 lines...]

Results :

Tests in error: 
  UpgradeIT.testAcquiringAndReleasingUpgradeMutex:578 » UpgradeInProgress Cluste...
  LocalIndexIT.testLocalIndexRoundTrip:155 » PhoenixIO org.apache.phoenix.except...

Tests run: 1241, Failures: 0, Errors: 2, Skipped: 5

[INFO] 
[INFO] --- maven-failsafe-plugin:2.19.1:integration-test (HBaseManagedTimeTableReuseTest)
@ phoenix-core ---

-------------------------------------------------------
 T E S T S
-------------------------------------------------------
Running org.apache.phoenix.end2end.ArithmeticQueryIT
Running org.apache.phoenix.end2end.AlterSessionIT
Tests run: 2, Failures: 0, Errors: 0, Skipped: 0, Time elapsed: 0.163 sec - in org.apache.phoenix.end2end.AlterSessionIT
Running org.apache.phoenix.end2end.ArraysWithNullsIT
Running org.apache.phoenix.end2end.ArrayFillFunctionIT
Running org.apache.phoenix.end2end.AbsFunctionEnd2EndIT
Running org.apache.phoenix.end2end.ArrayToStringFunctionIT
Tests run: 1, Failures: 0, Errors: 0, Skipped: 0, Time elapsed: 5.046 sec - in org.apache.phoenix.end2end.AbsFunctionEnd2EndIT
Running org.apache.phoenix.end2end.AutoCommitIT
Tests run: 1, Failures: 0, Errors: 0, Skipped: 0, Time elapsed: 4.579 sec - in org.apache.phoenix.end2end.AutoCommitIT
Running org.apache.phoenix.end2end.CbrtFunctionEnd2EndIT
Tests run: 2, Failures: 0, Errors: 0, Skipped: 0, Time elapsed: 0.472 sec - in org.apache.phoenix.end2end.CbrtFunctionEnd2EndIT
Running org.apache.phoenix.end2end.ConvertTimezoneFunctionIT
Tests run: 26, Failures: 0, Errors: 0, Skipped: 0, Time elapsed: 25.932 sec - in org.apache.phoenix.end2end.ArrayFillFunctionIT
Running org.apache.phoenix.end2end.DecodeFunctionIT
Tests run: 36, Failures: 0, Errors: 0, Skipped: 0, Time elapsed: 41.943 sec - in org.apache.phoenix.end2end.ArrayToStringFunctionIT
Tests run: 7, Failures: 0, Errors: 0, Skipped: 0, Time elapsed: 27.523 sec - in org.apache.phoenix.end2end.ConvertTimezoneFunctionIT
Running org.apache.phoenix.end2end.DynamicFamilyIT
Tests run: 6, Failures: 0, Errors: 0, Skipped: 0, Time elapsed: 24.819 sec - in org.apache.phoenix.end2end.DecodeFunctionIT
Running org.apache.phoenix.end2end.DynamicUpsertIT
Tests run: 7, Failures: 0, Errors: 0, Skipped: 0, Time elapsed: 0.158 sec - in org.apache.phoenix.end2end.DynamicUpsertIT
Running org.apache.phoenix.end2end.FirstValueFunctionIT
Tests run: 4, Failures: 0, Errors: 0, Skipped: 0, Time elapsed: 9.386 sec - in org.apache.phoenix.end2end.DynamicFamilyIT
Tests run: 16, Failures: 0, Errors: 0, Skipped: 0, Time elapsed: 64.029 sec - in org.apache.phoenix.end2end.ArraysWithNullsIT
Running org.apache.phoenix.end2end.GetSetByteBitFunctionEnd2EndIT
Tests run: 1, Failures: 0, Errors: 0, Skipped: 0, Time elapsed: 0.218 sec - in org.apache.phoenix.end2end.GetSetByteBitFunctionEnd2EndIT
Running org.apache.phoenix.end2end.MD5FunctionIT
Running org.apache.phoenix.end2end.LikeExpressionIT
Running org.apache.phoenix.end2end.DistinctPrefixFilterIT
Tests run: 3, Failures: 0, Errors: 0, Skipped: 0, Time elapsed: 11.626 sec - in org.apache.phoenix.end2end.MD5FunctionIT
Running org.apache.phoenix.end2end.MinMaxAggregateFunctionIT
Tests run: 7, Failures: 0, Errors: 0, Skipped: 0, Time elapsed: 25.362 sec - in org.apache.phoenix.end2end.FirstValueFunctionIT
Running org.apache.phoenix.end2end.NthValueFunctionIT
Tests run: 1, Failures: 0, Errors: 0, Skipped: 0, Time elapsed: 4.964 sec - in org.apache.phoenix.end2end.MinMaxAggregateFunctionIT
Running org.apache.phoenix.end2end.OctetLengthFunctionEnd2EndIT
Tests run: 6, Failures: 0, Errors: 0, Skipped: 0, Time elapsed: 17.115 sec - in org.apache.phoenix.end2end.LikeExpressionIT
Tests run: 1, Failures: 0, Errors: 0, Skipped: 0, Time elapsed: 4.505 sec - in org.apache.phoenix.end2end.OctetLengthFunctionEnd2EndIT
Running org.apache.phoenix.end2end.PrimitiveTypeIT
Tests run: 9, Failures: 0, Errors: 0, Skipped: 0, Time elapsed: 0.294 sec - in org.apache.phoenix.end2end.PrimitiveTypeIT
Running org.apache.phoenix.end2end.PowerFunctionEnd2EndIT
Running org.apache.phoenix.end2end.QueryMoreIT
Tests run: 1, Failures: 0, Errors: 0, Skipped: 0, Time elapsed: 0.864 sec - in org.apache.phoenix.end2end.PowerFunctionEnd2EndIT
Running org.apache.phoenix.end2end.RTrimFunctionIT
Tests run: 26, Failures: 0, Errors: 0, Skipped: 0, Time elapsed: 99.684 sec - in org.apache.phoenix.end2end.ArithmeticQueryIT
Running org.apache.phoenix.end2end.ReadOnlyIT
Tests run: 5, Failures: 0, Errors: 0, Skipped: 0, Time elapsed: 27.116 sec - in org.apache.phoenix.end2end.DistinctPrefixFilterIT
Tests run: 2, Failures: 0, Errors: 0, Skipped: 0, Time elapsed: 8.998 sec - in org.apache.phoenix.end2end.RTrimFunctionIT
Running org.apache.phoenix.end2end.ReverseFunctionIT
Running org.apache.phoenix.end2end.RegexpSplitFunctionIT
Tests run: 12, Failures: 0, Errors: 0, Skipped: 0, Time elapsed: 1.642 sec - in org.apache.phoenix.end2end.RegexpSplitFunctionIT
Tests run: 1, Failures: 0, Errors: 0, Skipped: 0, Time elapsed: 9.437 sec - in org.apache.phoenix.end2end.ReadOnlyIT
Running org.apache.phoenix.end2end.RoundFloorCeilFunctionsEnd2EndIT
Running org.apache.phoenix.end2end.SerialIteratorsIT
Tests run: 1, Failures: 0, Errors: 0, Skipped: 0, Time elapsed: 4.924 sec - in org.apache.phoenix.end2end.SerialIteratorsIT
Running org.apache.phoenix.end2end.ServerExceptionIT
Tests run: 1, Failures: 0, Errors: 0, Skipped: 0, Time elapsed: 2.608 sec - in org.apache.phoenix.end2end.ServerExceptionIT
Tests run: 5, Failures: 0, Errors: 0, Skipped: 0, Time elapsed: 18.333 sec - in org.apache.phoenix.end2end.ReverseFunctionIT
Running org.apache.phoenix.end2end.SortOrderIT
Tests run: 33, Failures: 0, Errors: 0, Skipped: 0, Time elapsed: 15.325 sec - in org.apache.phoenix.end2end.RoundFloorCeilFunctionsEnd2EndIT
Running org.apache.phoenix.end2end.StatementHintsIT
Running org.apache.phoenix.end2end.SignFunctionEnd2EndIT
Tests run: 2, Failures: 0, Errors: 0, Skipped: 0, Time elapsed: 0.841 sec - in org.apache.phoenix.end2end.SignFunctionEnd2EndIT
Tests run: 11, Failures: 0, Errors: 0, Skipped: 0, Time elapsed: 43.186 sec - in org.apache.phoenix.end2end.NthValueFunctionIT
Tests run: 2, Failures: 0, Errors: 0, Skipped: 0, Time elapsed: 4.496 sec - in org.apache.phoenix.end2end.StatementHintsIT
Running org.apache.phoenix.end2end.TimezoneOffsetFunctionIT
Running org.apache.phoenix.end2end.StringToArrayFunctionIT
Running org.apache.phoenix.end2end.StoreNullsIT
Tests run: 4, Failures: 0, Errors: 0, Skipped: 0, Time elapsed: 17.53 sec - in org.apache.phoenix.end2end.StoreNullsIT
Running org.apache.phoenix.end2end.ToCharFunctionIT
Tests run: 22, Failures: 0, Errors: 0, Skipped: 0, Time elapsed: 25.123 sec - in org.apache.phoenix.end2end.StringToArrayFunctionIT
Running org.apache.phoenix.end2end.UpsertSelectAutoCommitIT
Tests run: 7, Failures: 0, Errors: 0, Skipped: 0, Time elapsed: 29.049 sec - in org.apache.phoenix.end2end.TimezoneOffsetFunctionIT
Running org.apache.phoenix.end2end.index.AsyncIndexDisabledIT
Tests run: 1, Failures: 0, Errors: 0, Skipped: 0, Time elapsed: 6.926 sec - in org.apache.phoenix.end2end.index.AsyncIndexDisabledIT
Running org.apache.phoenix.end2end.index.ChildViewsUseParentViewIndexIT
Tests run: 8, Failures: 0, Errors: 0, Skipped: 0, Time elapsed: 81.45 sec - in org.apache.phoenix.end2end.QueryMoreIT
Running org.apache.phoenix.end2end.salted.SaltedTableUpsertSelectIT
Tests run: 3, Failures: 0, Errors: 0, Skipped: 0, Time elapsed: 21.037 sec - in org.apache.phoenix.end2end.UpsertSelectAutoCommitIT
Running org.apache.phoenix.end2end.salted.SaltedTableVarLengthRowKeyIT
Tests run: 1, Failures: 0, Errors: 0, Skipped: 0, Time elapsed: 4.551 sec - in org.apache.phoenix.end2end.salted.SaltedTableVarLengthRowKeyIT
Tests run: 2, Failures: 0, Errors: 0, Skipped: 0, Time elapsed: 17.127 sec - in org.apache.phoenix.end2end.index.ChildViewsUseParentViewIndexIT
Running org.apache.phoenix.iterate.PhoenixQueryTimeoutIT
Tests run: 2, Failures: 0, Errors: 0, Skipped: 0, Time elapsed: 0.18 sec - in org.apache.phoenix.iterate.PhoenixQueryTimeoutIT
Tests run: 12, Failures: 0, Errors: 0, Skipped: 0, Time elapsed: 63.112 sec - in org.apache.phoenix.end2end.ToCharFunctionIT
Tests run: 6, Failures: 0, Errors: 0, Skipped: 0, Time elapsed: 50.105 sec - in org.apache.phoenix.end2end.salted.SaltedTableUpsertSelectIT
Tests run: 45, Failures: 0, Errors: 0, Skipped: 0, Time elapsed: 206.861 sec - in org.apache.phoenix.end2end.SortOrderIT

Results :

Tests run: 351, Failures: 0, Errors: 0, Skipped: 0

[INFO] 
[INFO] --- maven-failsafe-plugin:2.19.1:integration-test (NeedTheirOwnClusterTests) @ phoenix-core
---

-------------------------------------------------------
 T E S T S
-------------------------------------------------------
Running org.apache.hadoop.hbase.regionserver.wal.WALReplayWithIndexWritesAndUncompressedWALInHBase_094_9_IT
Running org.apache.hadoop.hbase.regionserver.wal.WALReplayWithIndexWritesAndCompressedWALIT
Tests run: 1, Failures: 0, Errors: 0, Skipped: 0, Time elapsed: 48.187 sec - in org.apache.hadoop.hbase.regionserver.wal.WALReplayWithIndexWritesAndCompressedWALIT
Tests run: 1, Failures: 0, Errors: 0, Skipped: 0, Time elapsed: 51.379 sec - in org.apache.hadoop.hbase.regionserver.wal.WALReplayWithIndexWritesAndUncompressedWALInHBase_094_9_IT
Running org.apache.phoenix.coprocessor.StatisticsCollectionRunTrackerIT
Running org.apache.phoenix.end2end.AlterTableIT
Running org.apache.phoenix.end2end.ConnectionUtilIT
Tests run: 4, Failures: 0, Errors: 0, Skipped: 0, Time elapsed: 36.117 sec - in org.apache.phoenix.coprocessor.StatisticsCollectionRunTrackerIT
Running org.apache.phoenix.end2end.ContextClassloaderIT
Tests run: 1, Failures: 0, Errors: 0, Skipped: 0, Time elapsed: 46.713 sec - in org.apache.phoenix.end2end.ConnectionUtilIT
Running org.apache.phoenix.end2end.CountDistinctCompressionIT
Tests run: 3, Failures: 0, Errors: 0, Skipped: 0, Time elapsed: 7.756 sec - in org.apache.phoenix.end2end.ContextClassloaderIT
Tests run: 1, Failures: 0, Errors: 0, Skipped: 0, Time elapsed: 8.672 sec - in org.apache.phoenix.end2end.CountDistinctCompressionIT
Running org.apache.phoenix.end2end.CsvBulkLoadToolIT
Running org.apache.phoenix.end2end.IndexToolIT
Running org.apache.phoenix.end2end.KeyOnlyIT
Running org.apache.phoenix.end2end.MultiCfQueryExecIT
Tests run: 3, Failures: 0, Errors: 0, Skipped: 0, Time elapsed: 18.02 sec - in org.apache.phoenix.end2end.KeyOnlyIT
Tests run: 9, Failures: 0, Errors: 0, Skipped: 0, Time elapsed: 39.093 sec - in org.apache.phoenix.end2end.MultiCfQueryExecIT
Running org.apache.phoenix.end2end.MutableIndexToolIT
Running org.apache.phoenix.end2end.ParallelIteratorsIT
Tests run: 3, Failures: 0, Errors: 0, Skipped: 0, Time elapsed: 55.186 sec - in org.apache.phoenix.end2end.ParallelIteratorsIT
Tests run: 1, Failures: 0, Errors: 0, Skipped: 0, Time elapsed: 146.114 sec - in org.apache.phoenix.end2end.MutableIndexToolIT
Running org.apache.phoenix.end2end.QueryTimeoutIT
Running org.apache.phoenix.end2end.QueryWithLimitIT
Tests run: 2, Failures: 0, Errors: 0, Skipped: 0, Time elapsed: 25.08 sec - in org.apache.phoenix.end2end.QueryTimeoutIT
Tests run: 2, Failures: 0, Errors: 0, Skipped: 0, Time elapsed: 29.964 sec - in org.apache.phoenix.end2end.QueryWithLimitIT
Running org.apache.phoenix.end2end.QueryWithOffsetIT
Running org.apache.phoenix.end2end.RenewLeaseIT
Tests run: 8, Failures: 0, Errors: 0, Skipped: 0, Time elapsed: 26.295 sec - in org.apache.phoenix.end2end.QueryWithOffsetIT
Tests run: 1, Failures: 0, Errors: 0, Skipped: 0, Time elapsed: 17.11 sec - in org.apache.phoenix.end2end.RenewLeaseIT
Tests run: 56, Failures: 0, Errors: 0, Skipped: 0, Time elapsed: 534.227 sec - in org.apache.phoenix.end2end.AlterTableIT
Running org.apache.phoenix.end2end.SaltedViewIT
Running org.apache.phoenix.end2end.SpillableGroupByIT
Tests run: 1, Failures: 0, Errors: 0, Skipped: 0, Time elapsed: 13.348 sec - in org.apache.phoenix.end2end.SpillableGroupByIT
Running org.apache.phoenix.end2end.StatsCollectionDisabledIT
Tests run: 4, Failures: 0, Errors: 0, Skipped: 0, Time elapsed: 64.216 sec - in org.apache.phoenix.end2end.SaltedViewIT
Tests run: 1, Failures: 0, Errors: 0, Skipped: 0, Time elapsed: 14.272 sec - in org.apache.phoenix.end2end.StatsCollectionDisabledIT
Running org.apache.phoenix.end2end.StatsCollectorIT
Running org.apache.phoenix.end2end.StatsCollectorWithSplitsAndMultiCFIT
Running org.apache.phoenix.end2end.TenantSpecificTablesDDLIT
Tests run: 2, Failures: 0, Errors: 0, Skipped: 0, Time elapsed: 23.57 sec - in org.apache.phoenix.end2end.StatsCollectorWithSplitsAndMultiCFIT
Running org.apache.phoenix.end2end.TenantSpecificTablesDMLIT
Tests run: 17, Failures: 0, Errors: 0, Skipped: 0, Time elapsed: 74.581 sec - in org.apache.phoenix.end2end.TenantSpecificTablesDDLIT
Tests run: 10, Failures: 0, Errors: 0, Skipped: 0, Time elapsed: 658.393 sec - in org.apache.phoenix.end2end.CsvBulkLoadToolIT
Tests run: 16, Failures: 0, Errors: 0, Skipped: 0, Time elapsed: 44.562 sec - in org.apache.phoenix.end2end.TenantSpecificTablesDMLIT
Tests run: 16, Failures: 0, Errors: 0, Skipped: 0, Time elapsed: 163.919 sec - in org.apache.phoenix.end2end.StatsCollectorIT
Running org.apache.phoenix.end2end.TransactionalViewIT
Running org.apache.phoenix.end2end.UnionAllIT
Running org.apache.phoenix.end2end.ViewIT
Running org.apache.phoenix.end2end.UserDefinedFunctionsIT
Tests run: 2, Failures: 0, Errors: 0, Skipped: 0, Time elapsed: 70.242 sec - in org.apache.phoenix.end2end.TransactionalViewIT
Tests run: 17, Failures: 0, Errors: 0, Skipped: 0, Time elapsed: 65.071 sec - in org.apache.phoenix.end2end.UnionAllIT
Running org.apache.phoenix.end2end.index.AsyncImmutableIndexIT
Tests run: 14, Failures: 0, Errors: 0, Skipped: 0, Time elapsed: 85.14 sec - in org.apache.phoenix.end2end.UserDefinedFunctionsIT
Running org.apache.phoenix.end2end.index.ImmutableIndexWithStatsIT
Tests run: 1, Failures: 0, Errors: 0, Skipped: 0, Time elapsed: 10.95 sec - in org.apache.phoenix.end2end.index.ImmutableIndexWithStatsIT
Running org.apache.phoenix.end2end.index.MutableIndexFailureIT
Running org.apache.phoenix.end2end.index.MutableIndexReplicationIT
Tests run: 1, Failures: 0, Errors: 0, Skipped: 0, Time elapsed: 35.492 sec - in org.apache.phoenix.end2end.index.MutableIndexReplicationIT
Tests run: 1, Failures: 0, Errors: 0, Skipped: 0, Time elapsed: 149.809 sec - in org.apache.phoenix.end2end.index.AsyncImmutableIndexIT
Tests run: 48, Failures: 0, Errors: 0, Skipped: 0, Time elapsed: 249.196 sec - in org.apache.phoenix.end2end.ViewIT
Running org.apache.phoenix.end2end.index.ReadOnlyIndexFailureIT
Running org.apache.phoenix.end2end.index.txn.TxWriteFailureIT
Tests run: 2, Failures: 0, Errors: 0, Skipped: 0, Time elapsed: 39.428 sec - in org.apache.phoenix.end2end.index.ReadOnlyIndexFailureIT
Running org.apache.phoenix.hbase.index.FailForUnsupportedHBaseVersionsIT
Running org.apache.phoenix.execute.PartialCommitIT
Tests run: 12, Failures: 0, Errors: 0, Skipped: 0, Time elapsed: 6.468 sec - in org.apache.phoenix.execute.PartialCommitIT
Tests run: 8, Failures: 0, Errors: 0, Skipped: 0, Time elapsed: 50.237 sec - in org.apache.phoenix.end2end.index.txn.TxWriteFailureIT
Tests run: 2, Failures: 0, Errors: 0, Skipped: 0, Time elapsed: 30.164 sec - in org.apache.phoenix.hbase.index.FailForUnsupportedHBaseVersionsIT
Running org.apache.phoenix.hbase.index.covered.EndToEndCoveredColumnsIndexBuilderIT
Tests run: 2, Failures: 0, Errors: 0, Skipped: 0, Time elapsed: 25.783 sec - in org.apache.phoenix.hbase.index.covered.EndToEndCoveredColumnsIndexBuilderIT
Running org.apache.phoenix.hbase.index.covered.example.EndtoEndIndexingWithCompressionIT
Running org.apache.phoenix.hbase.index.covered.example.EndToEndCoveredIndexingIT
Running org.apache.phoenix.hbase.index.covered.example.FailWithoutRetriesIT
Tests run: 1, Failures: 0, Errors: 0, Skipped: 0, Time elapsed: 6.203 sec - in org.apache.phoenix.hbase.index.covered.example.FailWithoutRetriesIT
Running org.apache.phoenix.iterate.RoundRobinResultIteratorWithStatsIT
Tests run: 8, Failures: 0, Errors: 0, Skipped: 0, Time elapsed: 321.837 sec - in org.apache.phoenix.end2end.index.MutableIndexFailureIT
Tests run: 1, Failures: 0, Errors: 0, Skipped: 0, Time elapsed: 15.216 sec - in org.apache.phoenix.iterate.RoundRobinResultIteratorWithStatsIT
Tests run: 16, Failures: 0, Errors: 0, Skipped: 0, Time elapsed: 1,259.298 sec - in org.apache.phoenix.end2end.IndexToolIT
Running org.apache.phoenix.iterate.ScannerLeaseRenewalIT
Running org.apache.phoenix.monitoring.PhoenixMetricsIT
Running org.apache.phoenix.rpc.PhoenixClientRpcIT
Tests run: 2, Failures: 0, Errors: 0, Skipped: 0, Time elapsed: 12.813 sec - in org.apache.phoenix.rpc.PhoenixClientRpcIT
Running org.apache.phoenix.rpc.PhoenixServerRpcIT
Tests run: 11, Failures: 0, Errors: 0, Skipped: 0, Time elapsed: 239.944 sec - in org.apache.phoenix.hbase.index.covered.example.EndtoEndIndexingWithCompressionIT
Tests run: 1, Failures: 0, Errors: 0, Skipped: 0, Time elapsed: 24.017 sec - in org.apache.phoenix.rpc.PhoenixServerRpcIT
Tests run: 11, Failures: 0, Errors: 0, Skipped: 0, Time elapsed: 244.723 sec - in org.apache.phoenix.hbase.index.covered.example.EndToEndCoveredIndexingIT
Tests run: 18, Failures: 0, Errors: 0, Skipped: 0, Time elapsed: 110.91 sec - in org.apache.phoenix.monitoring.PhoenixMetricsIT
Tests run: 2, Failures: 0, Errors: 0, Skipped: 0, Time elapsed: 179.31 sec - in org.apache.phoenix.iterate.ScannerLeaseRenewalIT

Results :

Tests run: 344, Failures: 0, Errors: 0, Skipped: 0

[INFO] 
[INFO] --- maven-failsafe-plugin:2.19.1:verify (ClientManagedTimeTests) @ phoenix-core ---
[INFO] ------------------------------------------------------------------------
[INFO] Reactor Summary:
[INFO] 
[INFO] Apache Phoenix ..................................... SUCCESS [  3.197 s]
[INFO] Phoenix Core ....................................... FAILURE [  01:39 h]
[INFO] Phoenix - Flume .................................... SKIPPED
[INFO] Phoenix - Pig ...................................... SKIPPED
[INFO] Phoenix Query Server Client ........................ SKIPPED
[INFO] Phoenix Query Server ............................... SKIPPED
[INFO] Phoenix - Pherf .................................... SKIPPED
[INFO] Phoenix - Spark .................................... SKIPPED
[INFO] Phoenix - Hive ..................................... SKIPPED
[INFO] Phoenix Client ..................................... SKIPPED
[INFO] Phoenix Server ..................................... SKIPPED
[INFO] Phoenix Assembly ................................... SKIPPED
[INFO] Phoenix - Tracing Web Application .................. SKIPPED
[INFO] ------------------------------------------------------------------------
[INFO] BUILD FAILURE
[INFO] ------------------------------------------------------------------------
[INFO] Total time: 01:39 h
[INFO] Finished at: 2016-11-17T08:29:24+00:00
[INFO] Final Memory: 60M/1140M
[INFO] ------------------------------------------------------------------------
[ERROR] Failed to execute goal org.apache.maven.plugins:maven-failsafe-plugin:2.19.1:verify
(ClientManagedTimeTests) on project phoenix-core: There are test failures.
[ERROR] 
[ERROR] Please refer to <https://builds.apache.org/job/Phoenix-4.8-HBase-1.1/ws/phoenix-core/target/failsafe-reports>
for the individual test results.
[ERROR] -> [Help 1]
[ERROR] 
[ERROR] To see the full stack trace of the errors, re-run Maven with the -e switch.
[ERROR] Re-run Maven using the -X switch to enable full debug logging.
[ERROR] 
[ERROR] For more information about the errors and possible solutions, please read the following
articles:
[ERROR] [Help 1] http://cwiki.apache.org/confluence/display/MAVEN/MojoFailureException
[ERROR] 
[ERROR] After correcting the problems, you can resume the build with the command
[ERROR]   mvn <goals> -rf :phoenix-core
Build step 'Invoke top-level Maven targets' marked build as failure
Archiving artifacts
Compressed 2.16 GB of artifacts by 69.4% relative to #44
Recording test results

Mime
View raw message