phoenix-commits mailing list archives

Site index · List index
Message view « Date » · « Thread »
Top « Date » · « Thread »
From Apache Jenkins Server <jenk...@builds.apache.org>
Subject Build failed in Jenkins: Phoenix | 4.x-HBase-0.98 #1389
Date Thu, 17 Nov 2016 22:19:52 GMT
See <https://builds.apache.org/job/Phoenix-4.x-HBase-0.98/1389/changes>

Changes:

[ssa] PHOENIX-3391 Supporting Hive 2.1.0 in PhoenixStorageHandler

------------------------------------------
[...truncated 724 lines...]
Tests run: 8, Failures: 0, Errors: 0, Skipped: 0, Time elapsed: 36.959 sec - in org.apache.phoenix.end2end.index.ViewIndexIT
Running org.apache.phoenix.end2end.index.txn.MutableRollbackIT
Tests run: 6, Failures: 0, Errors: 0, Skipped: 0, Time elapsed: 49.337 sec - in org.apache.phoenix.end2end.index.txn.MutableRollbackIT
Running org.apache.phoenix.end2end.index.txn.RollbackIT
Tests run: 8, Failures: 0, Errors: 0, Skipped: 0, Time elapsed: 39.795 sec - in org.apache.phoenix.end2end.index.txn.RollbackIT
Running org.apache.phoenix.end2end.salted.SaltedTableUpsertSelectIT
Tests run: 6, Failures: 0, Errors: 0, Skipped: 0, Time elapsed: 20.692 sec - in org.apache.phoenix.end2end.salted.SaltedTableUpsertSelectIT
Running org.apache.phoenix.end2end.salted.SaltedTableVarLengthRowKeyIT
Tests run: 1, Failures: 0, Errors: 0, Skipped: 0, Time elapsed: 2.489 sec - in org.apache.phoenix.end2end.salted.SaltedTableVarLengthRowKeyIT
Running org.apache.phoenix.iterate.PhoenixQueryTimeoutIT
Tests run: 2, Failures: 0, Errors: 0, Skipped: 0, Time elapsed: 3.429 sec - in org.apache.phoenix.iterate.PhoenixQueryTimeoutIT
Running org.apache.phoenix.iterate.RoundRobinResultIteratorIT
Tests run: 102, Failures: 0, Errors: 0, Skipped: 0, Time elapsed: 787.159 sec - in org.apache.phoenix.end2end.SortMergeJoinIT
Tests run: 9, Failures: 0, Errors: 0, Skipped: 0, Time elapsed: 42.048 sec - in org.apache.phoenix.iterate.RoundRobinResultIteratorIT
Running org.apache.phoenix.rpc.UpdateCacheIT
Tests run: 7, Failures: 0, Errors: 0, Skipped: 0, Time elapsed: 19.162 sec - in org.apache.phoenix.rpc.UpdateCacheIT
Running org.apache.phoenix.trace.PhoenixTableMetricsWriterIT
Tests run: 2, Failures: 0, Errors: 0, Skipped: 0, Time elapsed: 2.936 sec - in org.apache.phoenix.trace.PhoenixTableMetricsWriterIT
Running org.apache.phoenix.trace.PhoenixTraceReaderIT
Tests run: 2, Failures: 0, Errors: 0, Skipped: 0, Time elapsed: 3.114 sec - in org.apache.phoenix.trace.PhoenixTraceReaderIT
Running org.apache.phoenix.trace.PhoenixTracingEndToEndIT
Tests run: 66, Failures: 0, Errors: 0, Skipped: 0, Time elapsed: 336.979 sec - in org.apache.phoenix.end2end.index.IndexExpressionIT
Running org.apache.phoenix.tx.FlappingTransactionIT
Tests run: 4, Failures: 0, Errors: 0, Skipped: 0, Time elapsed: 7.01 sec - in org.apache.phoenix.tx.FlappingTransactionIT
Running org.apache.phoenix.tx.TxCheckpointIT
Running org.apache.phoenix.tx.TransactionIT
Tests run: 6, Failures: 0, Errors: 0, Skipped: 0, Time elapsed: 82.453 sec - in org.apache.phoenix.trace.PhoenixTracingEndToEndIT
Tests run: 19, Failures: 0, Errors: 0, Skipped: 1, Time elapsed: 68.309 sec - in org.apache.phoenix.tx.TransactionIT
Tests run: 20, Failures: 0, Errors: 0, Skipped: 0, Time elapsed: 111.075 sec - in org.apache.phoenix.tx.TxCheckpointIT
Tests run: 40, Failures: 0, Errors: 0, Skipped: 0, Time elapsed: 475.848 sec - in org.apache.phoenix.end2end.index.MutableIndexIT
Tests run: 144, Failures: 0, Errors: 0, Skipped: 0, Time elapsed: 672.448 sec - in org.apache.phoenix.end2end.index.IndexIT

Results :

Tests run: 1627, Failures: 0, Errors: 0, Skipped: 1

[INFO] 
[INFO] --- maven-failsafe-plugin:2.19.1:integration-test (ClientManagedTimeTests) @ phoenix-core
---

-------------------------------------------------------
 T E S T S
-------------------------------------------------------
Running org.apache.phoenix.end2end.ClientTimeArithmeticQueryIT
Running org.apache.phoenix.end2end.ArrayIT
Running org.apache.phoenix.end2end.CaseStatementIT
Running org.apache.phoenix.end2end.AggregateQueryIT
Running org.apache.phoenix.end2end.CastAndCoerceIT
Tests run: 63, Failures: 0, Errors: 0, Skipped: 0, Time elapsed: 47.186 sec - in org.apache.phoenix.end2end.CaseStatementIT
Running org.apache.phoenix.end2end.ColumnProjectionOptimizationIT
Tests run: 49, Failures: 0, Errors: 0, Skipped: 0, Time elapsed: 44.544 sec - in org.apache.phoenix.end2end.CastAndCoerceIT
Running org.apache.phoenix.end2end.CreateSchemaIT
Tests run: 1, Failures: 0, Errors: 0, Skipped: 0, Time elapsed: 0.34 sec - in org.apache.phoenix.end2end.CreateSchemaIT
Running org.apache.phoenix.end2end.CreateTableIT
Tests run: 49, Failures: 0, Errors: 0, Skipped: 0, Time elapsed: 64.732 sec - in org.apache.phoenix.end2end.AggregateQueryIT
Running org.apache.phoenix.end2end.CustomEntityDataIT
Tests run: 3, Failures: 0, Errors: 0, Skipped: 0, Time elapsed: 21.442 sec - in org.apache.phoenix.end2end.ColumnProjectionOptimizationIT
Running org.apache.phoenix.end2end.DerivedTableIT
Tests run: 3, Failures: 0, Errors: 0, Skipped: 0, Time elapsed: 4.537 sec - in org.apache.phoenix.end2end.CustomEntityDataIT
Running org.apache.phoenix.end2end.DistinctCountIT
Tests run: 79, Failures: 0, Errors: 0, Skipped: 0, Time elapsed: 78.766 sec - in org.apache.phoenix.end2end.ArrayIT
Running org.apache.phoenix.end2end.DropSchemaIT
Tests run: 2, Failures: 0, Errors: 0, Skipped: 0, Time elapsed: 6.98 sec - in org.apache.phoenix.end2end.DropSchemaIT
Tests run: 18, Failures: 0, Errors: 0, Skipped: 0, Time elapsed: 16.275 sec - in org.apache.phoenix.end2end.DerivedTableIT
Running org.apache.phoenix.end2end.ExtendedQueryExecIT
Running org.apache.phoenix.end2end.FunkyNamesIT
Tests run: 10, Failures: 0, Errors: 0, Skipped: 0, Time elapsed: 13.327 sec - in org.apache.phoenix.end2end.DistinctCountIT
Running org.apache.phoenix.end2end.GroupByIT
Tests run: 3, Failures: 0, Errors: 0, Skipped: 0, Time elapsed: 4.017 sec - in org.apache.phoenix.end2end.FunkyNamesIT
Tests run: 4, Failures: 0, Errors: 0, Skipped: 0, Time elapsed: 6.522 sec - in org.apache.phoenix.end2end.ExtendedQueryExecIT
Running org.apache.phoenix.end2end.NotQueryIT
Running org.apache.phoenix.end2end.NativeHBaseTypesIT
Tests run: 7, Failures: 0, Errors: 0, Skipped: 0, Time elapsed: 3.115 sec - in org.apache.phoenix.end2end.NativeHBaseTypesIT
Running org.apache.phoenix.end2end.PointInTimeQueryIT
Tests run: 15, Failures: 0, Errors: 0, Skipped: 0, Time elapsed: 61.893 sec - in org.apache.phoenix.end2end.CreateTableIT
Running org.apache.phoenix.end2end.ProductMetricsIT
Tests run: 14, Failures: 0, Errors: 0, Skipped: 0, Time elapsed: 25.359 sec - in org.apache.phoenix.end2end.PointInTimeQueryIT
Running org.apache.phoenix.end2end.QueryDatabaseMetaDataIT
Tests run: 77, Failures: 0, Errors: 0, Skipped: 0, Time elapsed: 53.562 sec - in org.apache.phoenix.end2end.NotQueryIT
Tests run: 61, Failures: 0, Errors: 0, Skipped: 0, Time elapsed: 35.539 sec - in org.apache.phoenix.end2end.ProductMetricsIT
Running org.apache.phoenix.end2end.QueryIT
Tests run: 245, Failures: 0, Errors: 0, Skipped: 0, Time elapsed: 165.724 sec - in org.apache.phoenix.end2end.ClientTimeArithmeticQueryIT
Tests run: 105, Failures: 0, Errors: 0, Skipped: 0, Time elapsed: 80.027 sec - in org.apache.phoenix.end2end.GroupByIT
Running org.apache.phoenix.end2end.ReadIsolationLevelIT
Tests run: 2, Failures: 0, Errors: 0, Skipped: 0, Time elapsed: 4.273 sec - in org.apache.phoenix.end2end.ReadIsolationLevelIT
Running org.apache.phoenix.end2end.SequenceBulkAllocationIT
Running org.apache.phoenix.end2end.RowValueConstructorIT
Running org.apache.phoenix.end2end.ScanQueryIT
Tests run: 56, Failures: 0, Errors: 0, Skipped: 0, Time elapsed: 25.639 sec - in org.apache.phoenix.end2end.SequenceBulkAllocationIT
Running org.apache.phoenix.end2end.SequenceIT
Tests run: 19, Failures: 0, Errors: 0, Skipped: 0, Time elapsed: 93.023 sec - in org.apache.phoenix.end2end.QueryDatabaseMetaDataIT
Running org.apache.phoenix.end2end.ToNumberFunctionIT
Tests run: 18, Failures: 0, Errors: 0, Skipped: 0, Time elapsed: 11.455 sec - in org.apache.phoenix.end2end.ToNumberFunctionIT
Running org.apache.phoenix.end2end.TopNIT
Tests run: 4, Failures: 0, Errors: 0, Skipped: 0, Time elapsed: 6.88 sec - in org.apache.phoenix.end2end.TopNIT
Running org.apache.phoenix.end2end.TruncateFunctionIT
Tests run: 54, Failures: 0, Errors: 0, Skipped: 0, Time elapsed: 34.54 sec - in org.apache.phoenix.end2end.SequenceIT
Running org.apache.phoenix.end2end.UpsertSelectIT
Tests run: 1, Failures: 0, Errors: 0, Skipped: 0, Time elapsed: 3.341 sec - in org.apache.phoenix.end2end.TruncateFunctionIT
Running org.apache.phoenix.end2end.UpsertValuesIT
Tests run: 126, Failures: 0, Errors: 0, Skipped: 0, Time elapsed: 98.465 sec - in org.apache.phoenix.end2end.QueryIT
Tests run: 119, Failures: 0, Errors: 0, Skipped: 0, Time elapsed: 69.508 sec - in org.apache.phoenix.end2end.ScanQueryIT
Running org.apache.phoenix.end2end.salted.SaltedTableIT
Tests run: 8, Failures: 0, Errors: 0, Skipped: 0, Time elapsed: 7.255 sec - in org.apache.phoenix.end2end.salted.SaltedTableIT
Running org.apache.phoenix.rpc.UpdateCacheWithScnIT
Tests run: 46, Failures: 0, Errors: 0, Skipped: 0, Time elapsed: 81.86 sec - in org.apache.phoenix.end2end.RowValueConstructorIT
Running org.apache.phoenix.end2end.VariableLengthPKIT
Tests run: 1, Failures: 0, Errors: 0, Skipped: 0, Time elapsed: 4.352 sec - in org.apache.phoenix.rpc.UpdateCacheWithScnIT
Tests run: 24, Failures: 0, Errors: 0, Skipped: 0, Time elapsed: 71.662 sec - in org.apache.phoenix.end2end.UpsertValuesIT
Tests run: 50, Failures: 0, Errors: 0, Skipped: 0, Time elapsed: 43.339 sec - in org.apache.phoenix.end2end.VariableLengthPKIT
Tests run: 22, Failures: 0, Errors: 0, Skipped: 0, Time elapsed: 93.625 sec - in org.apache.phoenix.end2end.UpsertSelectIT

Results :

Tests run: 1358, Failures: 0, Errors: 0, Skipped: 0

[INFO] 
[INFO] --- maven-failsafe-plugin:2.19.1:integration-test (HBaseManagedTimeTests) @ phoenix-core
---

-------------------------------------------------------
 T E S T S
-------------------------------------------------------

Results :

Tests run: 0, Failures: 0, Errors: 0, Skipped: 0

[INFO] 
[INFO] --- maven-failsafe-plugin:2.19.1:integration-test (NeedTheirOwnClusterTests) @ phoenix-core
---

-------------------------------------------------------
 T E S T S
-------------------------------------------------------
Running org.apache.hadoop.hbase.regionserver.wal.WALReplayWithIndexWritesAndCompressedWALIT
Tests run: 1, Failures: 0, Errors: 0, Skipped: 0, Time elapsed: 21.732 sec - in org.apache.hadoop.hbase.regionserver.wal.WALReplayWithIndexWritesAndCompressedWALIT
Running org.apache.phoenix.end2end.ConnectionUtilIT
Running org.apache.phoenix.end2end.ContextClassloaderIT
Running org.apache.phoenix.end2end.CountDistinctCompressionIT
Tests run: 3, Failures: 0, Errors: 0, Skipped: 0, Time elapsed: 3.954 sec - in org.apache.phoenix.end2end.ContextClassloaderIT
Running org.apache.phoenix.end2end.CsvBulkLoadToolIT
Tests run: 1, Failures: 0, Errors: 0, Skipped: 0, Time elapsed: 18.242 sec - in org.apache.phoenix.end2end.ConnectionUtilIT
Tests run: 1, Failures: 0, Errors: 0, Skipped: 0, Time elapsed: 4.859 sec - in org.apache.phoenix.end2end.CountDistinctCompressionIT
Running org.apache.phoenix.end2end.FlappingLocalIndexIT
Running org.apache.phoenix.end2end.IndexExtendedIT
Running org.apache.phoenix.end2end.QueryTimeoutIT
Running org.apache.phoenix.end2end.QueryWithLimitIT
Tests run: 2, Failures: 0, Errors: 0, Skipped: 0, Time elapsed: 12.5 sec - in org.apache.phoenix.end2end.QueryTimeoutIT
Tests run: 2, Failures: 0, Errors: 0, Skipped: 0, Time elapsed: 13.23 sec - in org.apache.phoenix.end2end.QueryWithLimitIT
Tests run: 10, Failures: 0, Errors: 0, Skipped: 0, Time elapsed: 63.512 sec - in org.apache.phoenix.end2end.CsvBulkLoadToolIT
Running org.apache.phoenix.end2end.RenewLeaseIT
Tests run: 1, Failures: 0, Errors: 0, Skipped: 1, Time elapsed: 0.002 sec - in org.apache.phoenix.end2end.RenewLeaseIT
Tests run: 40, Failures: 0, Errors: 0, Skipped: 16, Time elapsed: 43.453 sec - in org.apache.phoenix.end2end.IndexExtendedIT
Running org.apache.phoenix.end2end.StatsCollectorIT
Running org.apache.phoenix.end2end.SpillableGroupByIT
Tests run: 8, Failures: 0, Errors: 0, Skipped: 0, Time elapsed: 70.859 sec - in org.apache.phoenix.end2end.FlappingLocalIndexIT
Running org.apache.phoenix.end2end.SysTableNamespaceMappedStatsCollectorIT
Tests run: 2, Failures: 0, Errors: 0, Skipped: 0, Time elapsed: 13.477 sec - in org.apache.phoenix.end2end.SpillableGroupByIT
Running org.apache.phoenix.end2end.UserDefinedFunctionsIT
Running org.apache.phoenix.end2end.index.ImmutableIndexIT
Running org.apache.phoenix.end2end.index.LocalIndexIT
Tests run: 14, Failures: 0, Errors: 0, Skipped: 0, Time elapsed: 34.164 sec - in org.apache.phoenix.end2end.UserDefinedFunctionsIT
Running org.apache.phoenix.end2end.index.MutableIndexFailureIT
Tests run: 40, Failures: 0, Errors: 0, Skipped: 0, Time elapsed: 131.114 sec - in org.apache.phoenix.end2end.StatsCollectorIT
Tests run: 40, Failures: 0, Errors: 0, Skipped: 0, Time elapsed: 131.596 sec - in org.apache.phoenix.end2end.SysTableNamespaceMappedStatsCollectorIT
Running org.apache.phoenix.end2end.index.MutableIndexReplicationIT
Running org.apache.phoenix.end2end.index.ReadOnlyIndexFailureIT
Tests run: 12, Failures: 0, Errors: 0, Skipped: 0, Time elapsed: 133.044 sec - in org.apache.phoenix.end2end.index.ImmutableIndexIT
Tests run: 1, Failures: 0, Errors: 0, Skipped: 0, Time elapsed: 20.274 sec - in org.apache.phoenix.end2end.index.MutableIndexReplicationIT
Tests run: 2, Failures: 0, Errors: 0, Skipped: 0, Time elapsed: 25.451 sec - in org.apache.phoenix.end2end.index.ReadOnlyIndexFailureIT
Running org.apache.phoenix.hbase.index.FailForUnsupportedHBaseVersionsIT
Running org.apache.phoenix.end2end.index.txn.TxWriteFailureIT
Tests run: 2, Failures: 0, Errors: 0, Skipped: 0, Time elapsed: 23.771 sec - in org.apache.phoenix.hbase.index.FailForUnsupportedHBaseVersionsIT
Running org.apache.phoenix.execute.PartialCommitIT
Running org.apache.phoenix.hbase.index.covered.EndToEndCoveredColumnsIndexBuilderIT
Tests run: 12, Failures: 0, Errors: 0, Skipped: 0, Time elapsed: 5.762 sec - in org.apache.phoenix.execute.PartialCommitIT
Tests run: 2, Failures: 0, Errors: 0, Skipped: 0, Time elapsed: 7.676 sec - in org.apache.phoenix.hbase.index.covered.EndToEndCoveredColumnsIndexBuilderIT
Tests run: 28, Failures: 0, Errors: 0, Skipped: 0, Time elapsed: 205.051 sec - in org.apache.phoenix.end2end.index.LocalIndexIT
Tests run: 8, Failures: 0, Errors: 0, Skipped: 0, Time elapsed: 45.69 sec - in org.apache.phoenix.end2end.index.txn.TxWriteFailureIT
Running org.apache.phoenix.hbase.index.covered.example.EndToEndCoveredIndexingIT
Running org.apache.phoenix.hbase.index.covered.example.FailWithoutRetriesIT
Running org.apache.phoenix.hbase.index.covered.example.EndtoEndIndexingWithCompressionIT
Tests run: 1, Failures: 0, Errors: 0, Skipped: 0, Time elapsed: 7.581 sec - in org.apache.phoenix.hbase.index.covered.example.FailWithoutRetriesIT
Running org.apache.phoenix.iterate.RoundRobinResultIteratorWithStatsIT
Tests run: 1, Failures: 0, Errors: 0, Skipped: 0, Time elapsed: 12.532 sec - in org.apache.phoenix.iterate.RoundRobinResultIteratorWithStatsIT
Running org.apache.phoenix.iterate.ScannerLeaseRenewalIT
Tests run: 8, Failures: 1, Errors: 0, Skipped: 0, Time elapsed: 215.725 sec <<< FAILURE!
- in org.apache.phoenix.end2end.index.MutableIndexFailureIT
testWriteFailureDisablesIndex[MutableIndexFailureIT_transactional=false,localIndex=false,isNamespaceMapped=true](org.apache.phoenix.end2end.index.MutableIndexFailureIT)
 Time elapsed: 4.888 sec  <<< FAILURE!
org.junit.ComparisonFailure: expected:<x[2]> but was:<x[]>
	at org.apache.phoenix.end2end.index.MutableIndexFailureIT.helpTestWriteFailureDisablesIndex(MutableIndexFailureIT.java:248)
	at org.apache.phoenix.end2end.index.MutableIndexFailureIT.testWriteFailureDisablesIndex(MutableIndexFailureIT.java:134)

Running org.apache.phoenix.monitoring.PhoenixMetricsIT
Tests run: 11, Failures: 0, Errors: 0, Skipped: 0, Time elapsed: 71.452 sec - in org.apache.phoenix.hbase.index.covered.example.EndToEndCoveredIndexingIT
Running org.apache.phoenix.rpc.PhoenixClientRpcIT
Tests run: 11, Failures: 0, Errors: 0, Skipped: 0, Time elapsed: 71.383 sec - in org.apache.phoenix.hbase.index.covered.example.EndtoEndIndexingWithCompressionIT
Tests run: 2, Failures: 0, Errors: 0, Skipped: 0, Time elapsed: 4.792 sec - in org.apache.phoenix.rpc.PhoenixClientRpcIT
Running org.apache.phoenix.rpc.PhoenixServerRpcIT
Tests run: 18, Failures: 0, Errors: 0, Skipped: 0, Time elapsed: 51.084 sec - in org.apache.phoenix.monitoring.PhoenixMetricsIT
Tests run: 1, Failures: 0, Errors: 0, Skipped: 0, Time elapsed: 14.208 sec - in org.apache.phoenix.rpc.PhoenixServerRpcIT
Tests run: 2, Failures: 0, Errors: 0, Skipped: 0, Time elapsed: 162.609 sec - in org.apache.phoenix.iterate.ScannerLeaseRenewalIT

Results :

Failed tests: 
  MutableIndexFailureIT.testWriteFailureDisablesIndex:134->helpTestWriteFailureDisablesIndex:248
expected:<x[2]> but was:<x[]>

Tests run: 287, Failures: 1, Errors: 0, Skipped: 17

[INFO] 
[INFO] --- maven-failsafe-plugin:2.19.1:verify (ParallelStatsEnabledTest) @ phoenix-core ---
[INFO] ------------------------------------------------------------------------
[INFO] Reactor Summary:
[INFO] 
[INFO] Apache Phoenix ..................................... SUCCESS [  2.215 s]
[INFO] Phoenix Core ....................................... FAILURE [50:42 min]
[INFO] Phoenix - Flume .................................... SKIPPED
[INFO] Phoenix - Pig ...................................... SKIPPED
[INFO] Phoenix Query Server Client ........................ SKIPPED
[INFO] Phoenix Query Server ............................... SKIPPED
[INFO] Phoenix - Pherf .................................... SKIPPED
[INFO] Phoenix - Spark .................................... SKIPPED
[INFO] Phoenix - Hive ..................................... SKIPPED
[INFO] Phoenix Client ..................................... SKIPPED
[INFO] Phoenix Server ..................................... SKIPPED
[INFO] Phoenix Assembly ................................... SKIPPED
[INFO] Phoenix - Tracing Web Application .................. SKIPPED
[INFO] ------------------------------------------------------------------------
[INFO] BUILD FAILURE
[INFO] ------------------------------------------------------------------------
[INFO] Total time: 50:46 min
[INFO] Finished at: 2016-11-17T22:14:11+00:00
[INFO] Final Memory: 59M/608M
[INFO] ------------------------------------------------------------------------
[ERROR] Failed to execute goal org.apache.maven.plugins:maven-failsafe-plugin:2.19.1:verify
(ParallelStatsEnabledTest) on project phoenix-core: There are test failures.
[ERROR] 
[ERROR] Please refer to <https://builds.apache.org/job/Phoenix-4.x-HBase-0.98/ws/phoenix-core/target/failsafe-reports>
for the individual test results.
[ERROR] -> [Help 1]
[ERROR] 
[ERROR] To see the full stack trace of the errors, re-run Maven with the -e switch.
[ERROR] Re-run Maven using the -X switch to enable full debug logging.
[ERROR] 
[ERROR] For more information about the errors and possible solutions, please read the following
articles:
[ERROR] [Help 1] http://cwiki.apache.org/confluence/display/MAVEN/MojoFailureException
[ERROR] 
[ERROR] After correcting the problems, you can resume the build with the command
[ERROR]   mvn <goals> -rf :phoenix-core
Build step 'Invoke top-level Maven targets' marked build as failure
Archiving artifacts
Compressed 1.85 GB of artifacts by 72.9% relative to #1388
Recording test results

Mime
View raw message