phoenix-commits mailing list archives

Site index · List index
Message view « Date » · « Thread »
Top « Date » · « Thread »
From Apache Jenkins Server <jenk...@builds.apache.org>
Subject Build failed in Jenkins: Phoenix-Calcite #30
Date Thu, 27 Oct 2016 21:15:15 GMT
See <https://builds.apache.org/job/Phoenix-calcite/30/changes>

Changes:

[rajeshbabu] Revert "PHOENIX-3242 Support UDF in Phoenix-Calcite

------------------------------------------
[...truncated 115298 lines...]
	rel#2424:Subset#1.CLIENT.[], best=rel#2423, importance=0.4551557676525883
		rel#2423:PhoenixClientProject.CLIENT.[](input=rel#2422:Subset#0.GENERIC.[],K=$0,LASTNAME=$2),
rowcount=810754.0, cumulative cost={1572.8642099997535 rows, 1572.8640100000002 cpu, 0.0 io}
Set#2, type: RecordType(INTEGER K, INTEGER K1, VARCHAR(1) LASTNAME_REVERSE)
	rel#2390:Subset#2.NONE.[], best=null, importance=0.81
		rel#2389:LogicalProject.NONE.[](input=rel#2388:Subset#1.NONE.[],K=MYSUM3($0, DEFAULT()),K1=MYSUM3($0,
11),LASTNAME_REVERSE=MYREVERSE3($1)), rowcount=810754.0, cumulative cost={inf}
		rel#2414:LogicalProject.NONE.[](input=rel#2386:Subset#0.SERVER.[],K=MYSUM3($0, DEFAULT()),K1=MYSUM3($0,
11),LASTNAME_REVERSE=MYREVERSE3($2)), rowcount=810754.0, cumulative cost={inf}
		rel#2426:LogicalProject.NONE.[](input=rel#2415:Subset#0.ENUMERABLE.[],K=MYSUM3($0, DEFAULT()),K1=MYSUM3($0,
11),LASTNAME_REVERSE=MYREVERSE3($2)), rowcount=810754.0, cumulative cost={inf}
	rel#2408:Subset#2.GENERIC.[], best=null, importance=0.81
	rel#2417:Subset#2.ENUMERABLE.[], best=rel#2416, importance=0.405
		rel#2416:EnumerableProject.ENUMERABLE.[](input=rel#2415:Subset#0.ENUMERABLE.[],K=MYSUM3($0,
DEFAULT()),K1=MYSUM3($0, 11),LASTNAME_REVERSE=MYREVERSE3($2)), rowcount=810754.0, cumulative
cost={812328.485518 rows, 2433836.485518 cpu, 0.0 io}
		rel#2419:EnumerableProject.ENUMERABLE.[](input=rel#2418:Subset#1.ENUMERABLE.[],K=MYSUM3($0,
DEFAULT()),K1=MYSUM3($0, 11),LASTNAME_REVERSE=MYREVERSE3($1)), rowcount=810754.0, cumulative
cost={812328.4855579999 rows, 2433836.485518 cpu, 0.0 io}
Set#3, type: RecordType(BIGINT ROWCOUNT)
	rel#2392:Subset#3.NONE.[], best=null, importance=0.9
		rel#2391:LogicalTableModify.NONE.[](input=rel#2390:Subset#2.NONE.[],table=[phoenix, T2],operation=INSERT,updateColumnList=[],flattened=false),
rowcount=810754.0, cumulative cost={inf}
	rel#2406:Subset#3.ENUMERABLE.[], best=null, importance=1.0
		rel#2407:AbstractConverter.ENUMERABLE.[](input=rel#2392:Subset#3.NONE.[],convention=ENUMERABLE,sort=[]),
rowcount=810754.0, cumulative cost={inf}
		rel#2411:PhoenixToEnumerableConverter.ENUMERABLE.[](input=rel#2410:Subset#3.MUTATION.[]),
rowcount=810754.0, cumulative cost={inf}
	rel#2410:Subset#3.MUTATION.[], best=null, importance=0.9
		rel#2409:PhoenixTableModify.MUTATION.[](input=rel#2408:Subset#2.GENERIC.[],table=[phoenix,
T2],operation=INSERT,updateColumnList=[],flattened=false), rowcount=810754.0, cumulative cost={inf}


	at org.apache.phoenix.end2end.UserDefinedFunctionsIT.testUsingUDFFunctionInDifferentQueries(UserDefinedFunctionsIT.java:533)

testReplaceFunction(org.apache.phoenix.end2end.UserDefinedFunctionsIT)  Time elapsed: 4.595
sec  <<< FAILURE!
java.lang.AssertionError: expected:<11> but was:<0>
	at org.apache.phoenix.end2end.UserDefinedFunctionsIT.testReplaceFunction(UserDefinedFunctionsIT.java:1003)

Running org.apache.phoenix.hbase.index.FailForUnsupportedHBaseVersionsIT
Running org.apache.phoenix.end2end.index.ReadOnlyIndexFailureIT
Running org.apache.phoenix.end2end.index.txn.TxWriteFailureIT
Tests run: 2, Failures: 0, Errors: 0, Skipped: 0, Time elapsed: 24.598 sec - in org.apache.phoenix.hbase.index.FailForUnsupportedHBaseVersionsIT
Tests run: 2, Failures: 0, Errors: 0, Skipped: 0, Time elapsed: 32.148 sec - in org.apache.phoenix.end2end.index.ReadOnlyIndexFailureIT
Running org.apache.phoenix.hbase.index.covered.EndToEndCoveredColumnsIndexBuilderIT
Running org.apache.phoenix.execute.PartialCommitIT
Tests run: 12, Failures: 0, Errors: 0, Skipped: 0, Time elapsed: 6.141 sec - in org.apache.phoenix.execute.PartialCommitIT
Tests run: 8, Failures: 0, Errors: 0, Skipped: 0, Time elapsed: 44.244 sec - in org.apache.phoenix.end2end.index.txn.TxWriteFailureIT
Tests run: 2, Failures: 0, Errors: 0, Skipped: 0, Time elapsed: 26.969 sec - in org.apache.phoenix.hbase.index.covered.EndToEndCoveredColumnsIndexBuilderIT
Running org.apache.phoenix.hbase.index.covered.example.FailWithoutRetriesIT
Running org.apache.phoenix.hbase.index.covered.example.EndToEndCoveredIndexingIT
Tests run: 1, Failures: 0, Errors: 0, Skipped: 0, Time elapsed: 7.57 sec - in org.apache.phoenix.hbase.index.covered.example.FailWithoutRetriesIT
Tests run: 12, Failures: 4, Errors: 2, Skipped: 0, Time elapsed: 168.615 sec <<<
FAILURE! - in org.apache.phoenix.end2end.index.ImmutableIndexIT
testCreateIndexDuringUpsertSelect[ImmutableIndexIT_localIndex=false,transactional=false](org.apache.phoenix.end2end.index.ImmutableIndexIT)
 Time elapsed: 7.756 sec  <<< ERROR!
java.sql.SQLException: java.sql.SQLException: ERROR 201 (22000): Illegal data. Expected length
of at least 99 bytes, but had 71
	at org.apache.phoenix.end2end.index.ImmutableIndexIT.testCreateIndexDuringUpsertSelect(ImmutableIndexIT.java:172)
Caused by: java.lang.RuntimeException: java.sql.SQLException: ERROR 201 (22000): Illegal data.
Expected length of at least 99 bytes, but had 71
	at org.apache.phoenix.end2end.index.ImmutableIndexIT.testCreateIndexDuringUpsertSelect(ImmutableIndexIT.java:172)
Caused by: java.sql.SQLException: ERROR 201 (22000): Illegal data. Expected length of at least
99 bytes, but had 71
	at org.apache.phoenix.end2end.index.ImmutableIndexIT.testCreateIndexDuringUpsertSelect(ImmutableIndexIT.java:172)

testDropIfImmutableKeyValueColumn[ImmutableIndexIT_localIndex=false,transactional=false](org.apache.phoenix.end2end.index.ImmutableIndexIT)
 Time elapsed: 21.943 sec  <<< FAILURE!
java.lang.AssertionError: expected:<1027> but was:<0>
	at org.apache.phoenix.end2end.index.ImmutableIndexIT.testDropIfImmutableKeyValueColumn(ImmutableIndexIT.java:142)

testCreateIndexDuringUpsertSelect[ImmutableIndexIT_localIndex=false,transactional=true](org.apache.phoenix.end2end.index.ImmutableIndexIT)
 Time elapsed: 5.777 sec  <<< ERROR!
java.sql.SQLException: java.sql.SQLException: ERROR 201 (22000): Illegal data. Expected length
of at least 99 bytes, but had 71
	at org.apache.phoenix.end2end.index.ImmutableIndexIT.testCreateIndexDuringUpsertSelect(ImmutableIndexIT.java:172)
Caused by: java.lang.RuntimeException: java.sql.SQLException: ERROR 201 (22000): Illegal data.
Expected length of at least 99 bytes, but had 71
	at org.apache.phoenix.end2end.index.ImmutableIndexIT.testCreateIndexDuringUpsertSelect(ImmutableIndexIT.java:172)
Caused by: java.sql.SQLException: ERROR 201 (22000): Illegal data. Expected length of at least
99 bytes, but had 71
	at org.apache.phoenix.end2end.index.ImmutableIndexIT.testCreateIndexDuringUpsertSelect(ImmutableIndexIT.java:172)

testDropIfImmutableKeyValueColumn[ImmutableIndexIT_localIndex=false,transactional=true](org.apache.phoenix.end2end.index.ImmutableIndexIT)
 Time elapsed: 9.959 sec  <<< FAILURE!
java.lang.AssertionError: expected:<1027> but was:<0>
	at org.apache.phoenix.end2end.index.ImmutableIndexIT.testDropIfImmutableKeyValueColumn(ImmutableIndexIT.java:142)

testDropIfImmutableKeyValueColumn[ImmutableIndexIT_localIndex=true,transactional=false](org.apache.phoenix.end2end.index.ImmutableIndexIT)
 Time elapsed: 28.463 sec  <<< FAILURE!
java.lang.AssertionError: expected:<1027> but was:<0>
	at org.apache.phoenix.end2end.index.ImmutableIndexIT.testDropIfImmutableKeyValueColumn(ImmutableIndexIT.java:142)

testDropIfImmutableKeyValueColumn[ImmutableIndexIT_localIndex=true,transactional=true](org.apache.phoenix.end2end.index.ImmutableIndexIT)
 Time elapsed: 10.867 sec  <<< FAILURE!
java.lang.AssertionError: expected:<1027> but was:<0>
	at org.apache.phoenix.end2end.index.ImmutableIndexIT.testDropIfImmutableKeyValueColumn(ImmutableIndexIT.java:142)

Running org.apache.phoenix.hbase.index.covered.example.EndtoEndIndexingWithCompressionIT
Running org.apache.phoenix.iterate.RoundRobinResultIteratorWithStatsIT
Running org.apache.phoenix.iterate.ScannerLeaseRenewalIT
Tests run: 1, Failures: 0, Errors: 1, Skipped: 0, Time elapsed: 20.401 sec <<< FAILURE!
- in org.apache.phoenix.iterate.RoundRobinResultIteratorWithStatsIT
testRoundRobinBehavior(org.apache.phoenix.iterate.RoundRobinResultIteratorWithStatsIT)  Time
elapsed: 13.358 sec  <<< ERROR!
java.sql.SQLException: Cannot call executeQuery(String) on prepared or callable statement
	at org.apache.phoenix.iterate.RoundRobinResultIteratorWithStatsIT.testRoundRobinBehavior(RoundRobinResultIteratorWithStatsIT.java:80)

Running org.apache.phoenix.monitoring.PhoenixMetricsIT
Running org.apache.phoenix.rpc.PhoenixClientRpcIT
Tests run: 2, Failures: 0, Errors: 2, Skipped: 0, Time elapsed: 5.041 sec <<< FAILURE!
- in org.apache.phoenix.rpc.PhoenixClientRpcIT
testMetadataQos(org.apache.phoenix.rpc.PhoenixClientRpcIT)  Time elapsed: 0.358 sec  <<<
ERROR!
java.lang.NullPointerException
	at org.apache.phoenix.rpc.PhoenixClientRpcIT.testMetadataQos(PhoenixClientRpcIT.java:110)

testIndexQos(org.apache.phoenix.rpc.PhoenixClientRpcIT)  Time elapsed: 0.183 sec  <<<
ERROR!
java.lang.NullPointerException
	at org.apache.phoenix.rpc.PhoenixClientRpcIT.testIndexQos(PhoenixClientRpcIT.java:96)

Running org.apache.phoenix.rpc.PhoenixServerRpcIT
Tests run: 1, Failures: 0, Errors: 1, Skipped: 0, Time elapsed: 8.455 sec <<< FAILURE!
- in org.apache.phoenix.rpc.PhoenixServerRpcIT
testIndexQos(org.apache.phoenix.rpc.PhoenixServerRpcIT)  Time elapsed: 0.336 sec  <<<
ERROR!
java.lang.NullPointerException
	at org.apache.phoenix.rpc.PhoenixServerRpcIT.testIndexQos(PhoenixServerRpcIT.java:148)

Tests run: 8, Failures: 0, Errors: 0, Skipped: 0, Time elapsed: 324.942 sec - in org.apache.phoenix.end2end.index.MutableIndexFailureIT
Tests run: 18, Failures: 7, Errors: 2, Skipped: 0, Time elapsed: 118.211 sec <<<
FAILURE! - in org.apache.phoenix.monitoring.PhoenixMetricsIT
testGlobalPhoenixMetricsForQueries(org.apache.phoenix.monitoring.PhoenixMetricsIT)  Time elapsed:
4.976 sec  <<< FAILURE!
java.lang.AssertionError: expected:<1> but was:<2>
	at org.apache.phoenix.monitoring.PhoenixMetricsIT.testGlobalPhoenixMetricsForQueries(PhoenixMetricsIT.java:101)

testNoMetricsCollectedForConnection(org.apache.phoenix.monitoring.PhoenixMetricsIT)  Time
elapsed: 4.953 sec  <<< ERROR!
java.sql.SQLException: does not implement 'class org.apache.phoenix.jdbc.PhoenixResultSet'
	at org.apache.phoenix.monitoring.PhoenixMetricsIT.testNoMetricsCollectedForConnection(PhoenixMetricsIT.java:327)

testMetricsForDelete(org.apache.phoenix.monitoring.PhoenixMetricsIT)  Time elapsed: 5.18 sec
 <<< FAILURE!
java.lang.AssertionError: No read metrics present when there should have been!
	at org.apache.phoenix.monitoring.PhoenixMetricsIT.assertReadMetricsForMutatingSql(PhoenixMetricsIT.java:785)
	at org.apache.phoenix.monitoring.PhoenixMetricsIT.testMetricsForDelete(PhoenixMetricsIT.java:307)

testReadMetricsForSelect(org.apache.phoenix.monitoring.PhoenixMetricsIT)  Time elapsed: 5.473
sec  <<< ERROR!
java.sql.SQLException: does not implement 'class org.apache.phoenix.jdbc.PhoenixResultSet'
	at org.apache.phoenix.monitoring.PhoenixMetricsIT.testReadMetricsForSelect(PhoenixMetricsIT.java:206)

testGlobalPhoenixMetricsForUpsertSelect(org.apache.phoenix.monitoring.PhoenixMetricsIT)  Time
elapsed: 5.129 sec  <<< FAILURE!
java.lang.AssertionError: expected:<1> but was:<0>
	at org.apache.phoenix.monitoring.PhoenixMetricsIT.testGlobalPhoenixMetricsForUpsertSelect(PhoenixMetricsIT.java:144)

testGlobalPhoenixMetricsForMutations(org.apache.phoenix.monitoring.PhoenixMetricsIT)  Time
elapsed: 0.458 sec  <<< FAILURE!
java.lang.AssertionError: expected:<10> but was:<0>
	at org.apache.phoenix.monitoring.PhoenixMetricsIT.testGlobalPhoenixMetricsForMutations(PhoenixMetricsIT.java:121)

testMetricsForDeleteWithAutoCommit(org.apache.phoenix.monitoring.PhoenixMetricsIT)  Time elapsed:
5.012 sec  <<< FAILURE!
java.lang.AssertionError: The two metrics have different or unequal number of table names

	at org.apache.phoenix.monitoring.PhoenixMetricsIT.assertMetricsAreSame(PhoenixMetricsIT.java:650)
	at org.apache.phoenix.monitoring.PhoenixMetricsIT.testMetricsForDeleteWithAutoCommit(PhoenixMetricsIT.java:418)

testMetricsForUpsertSelect(org.apache.phoenix.monitoring.PhoenixMetricsIT)  Time elapsed:
9.341 sec  <<< FAILURE!
java.lang.AssertionError: No read metrics present when there should have been!
	at org.apache.phoenix.monitoring.PhoenixMetricsIT.assertReadMetricsForMutatingSql(PhoenixMetricsIT.java:785)
	at org.apache.phoenix.monitoring.PhoenixMetricsIT.testMetricsForUpsertSelect(PhoenixMetricsIT.java:284)

testMetricsForUpsertSelectSameTable(org.apache.phoenix.monitoring.PhoenixMetricsIT)  Time
elapsed: 4.85 sec  <<< FAILURE!
java.lang.AssertionError: No read metrics present when there should have been!
	at org.apache.phoenix.monitoring.PhoenixMetricsIT.assertReadMetricsForMutatingSql(PhoenixMetricsIT.java:785)
	at org.apache.phoenix.monitoring.PhoenixMetricsIT.testMetricsForUpsertSelectSameTable(PhoenixMetricsIT.java:611)

Tests run: 2, Failures: 0, Errors: 0, Skipped: 0, Time elapsed: 169.512 sec - in org.apache.phoenix.iterate.ScannerLeaseRenewalIT
Tests run: 11, Failures: 0, Errors: 0, Skipped: 0, Time elapsed: 251.112 sec - in org.apache.phoenix.hbase.index.covered.example.EndToEndCoveredIndexingIT
Tests run: 11, Failures: 0, Errors: 0, Skipped: 0, Time elapsed: 240.558 sec - in org.apache.phoenix.hbase.index.covered.example.EndtoEndIndexingWithCompressionIT

Results :

Failed tests: 
  IndexExtendedIT.testLocalIndexScanAfterRegionsMerge:547->BaseTest.assertEquals:1784 expected:<[z]>
but was:<[a]>
  QueryTimeoutIT.testSetRPCTimeOnConnection:94
  SpillableGroupByIT.testScanUri:120 Internal error: Error while applying rule AggregateExpandDistinctAggregatesRule,
args [rel#55152:LogicalAggregate.NONE.[](input=rel#55097:Subset#0.SERVER.[],group={1},EXPR$0=COUNT(),EXPR$1=COUNT(DISTINCT
$1),EXPR$2=SUM($2),EXPR$3=AVG($2),EXPR$5=MIN($0),EXPR$6=MAX($0))]
  UserDefinedFunctionsIT.testReplaceFunction:1003->BaseTest.assertEquals:1828 expected:<11>
but was:<0>
  UserDefinedFunctionsIT.testTemporaryFunctions:593->BaseTest.assertEquals:1828 expected:<11>
but was:<0>
  UserDefinedFunctionsIT.testVerifyCreateFunctionArguments:570->BaseTest.assertEquals:1828
expected:<11> but was:<0>
  ImmutableIndexIT.testDropIfImmutableKeyValueColumn:142->BaseTest.assertEquals:1828 expected:<1027>
but was:<0>
  ImmutableIndexIT.testDropIfImmutableKeyValueColumn:142->BaseTest.assertEquals:1828 expected:<1027>
but was:<0>
  ImmutableIndexIT.testDropIfImmutableKeyValueColumn:142->BaseTest.assertEquals:1828 expected:<1027>
but was:<0>
  ImmutableIndexIT.testDropIfImmutableKeyValueColumn:142->BaseTest.assertEquals:1828 expected:<1027>
but was:<0>
  PhoenixMetricsIT.testGlobalPhoenixMetricsForMutations:121->BaseTest.assertEquals:1828
expected:<10> but was:<0>
  PhoenixMetricsIT.testGlobalPhoenixMetricsForQueries:101->BaseTest.assertEquals:1828 expected:<1>
but was:<2>
  PhoenixMetricsIT.testGlobalPhoenixMetricsForUpsertSelect:144->BaseTest.assertEquals:1828
expected:<1> but was:<0>
  PhoenixMetricsIT.testMetricsForDelete:307->assertReadMetricsForMutatingSql:785 No read
metrics present when there should have been!
  PhoenixMetricsIT.testMetricsForDeleteWithAutoCommit:418->assertMetricsAreSame:650 The
two metrics have different or unequal number of table names 
  PhoenixMetricsIT.testMetricsForUpsertSelect:284->assertReadMetricsForMutatingSql:785
No read metrics present when there should have been!
  PhoenixMetricsIT.testMetricsForUpsertSelectSameTable:611->assertReadMetricsForMutatingSql:785
No read metrics present when there should have been!
Tests in error: 
  CsvBulkLoadToolIT.testBasicImport:71 » SQL Error while executing SQL "CREATE T...
  CsvBulkLoadToolIT.testImportWithLocalIndex:254 » SQL Error while executing SQL...
  CsvBulkLoadToolIT.testMultipleInputFiles:179 » SQL Error while executing SQL "...
  IndexExtendedIT.testDeleteFromImmutable:345 » SQL Error while executing SQL "d...
  IndexExtendedIT.testDeleteFromImmutable:345 » SQL Error while executing SQL "d...
  IndexExtendedIT.testMutableIndexWithUpdates:153 » SQL Error while executing SQ...
  IndexExtendedIT.testMutableIndexWithUpdates:153 » SQL Error while executing SQ...
  IndexExtendedIT.testMutableIndexWithUpdates:153 » SQL Error while executing SQ...
  IndexExtendedIT.testMutableIndexWithUpdates:153 » SQL Error while executing SQ...
  IndexExtendedIT.testSecondaryIndex:204 » SQL Error while executing SQL "CREATE...
  IndexExtendedIT.testSecondaryIndex:204 » SQL Error while executing SQL "CREATE...
  IndexExtendedIT.testSecondaryIndex:204 » SQL Error while executing SQL "CREATE...
  IndexExtendedIT.testSecondaryIndex:204 » SQL Error while executing SQL "CREATE...
  IndexExtendedIT.testSecondaryIndex:204 » SQL Error while executing SQL "CREATE...
  IndexExtendedIT.testSecondaryIndex:204 » SQL Error while executing SQL "CREATE...
  IndexExtendedIT.testSecondaryIndex:204 » SQL Error while executing SQL "CREATE...
  IndexExtendedIT.testSecondaryIndex:204 » SQL Error while executing SQL "CREATE...
  IndexExtendedIT.testSecondaryIndex:204 » SQL Error while executing SQL "CREATE...
  IndexExtendedIT.testSecondaryIndex:204 » SQL Error while executing SQL "CREATE...
  IndexExtendedIT.testSecondaryIndex:204 » SQL Error while executing SQL "CREATE...
  IndexExtendedIT.testSecondaryIndex:204 » SQL Error while executing SQL "CREATE...
  IndexExtendedIT.testSecondaryIndex:204 » SQL Error while executing SQL "CREATE...
  IndexExtendedIT.testSecondaryIndex:204 » SQL Error while executing SQL "CREATE...
  IndexExtendedIT.testSecondaryIndex:204 » SQL Error while executing SQL "CREATE...
  IndexExtendedIT.testSecondaryIndex:204 » SQL Error while executing SQL "CREATE...
  QueryTimeoutIT.testQueryTimeout:120 » SQL does not implement 'class org.apache...
  SpillableGroupByIT.testStatisticsAreNotWritten:164 » SQL Error while executing...
  UserDefinedFunctionsIT.testCreateFunction:373 » SQL ERROR 218 (23018): Constra...
  UserDefinedFunctionsIT.testDropFunction:623 » SQL Error while executing SQL "s...
  UserDefinedFunctionsIT.testFunctionalIndexesWithUDFFunction:763 » FunctionNotFound
  UserDefinedFunctionsIT.testSameUDFWithDifferentImplementationsInDifferentTenantConnections:443
» SQL
  UserDefinedFunctionsIT.testUDFsWhenTimestampManagedAtClient:669 » SQL Error wh...
  UserDefinedFunctionsIT.testUDFsWithMultipleConnections:514 » SQL Error while e...
  UserDefinedFunctionsIT.testUsingUDFFunctionInDifferentQueries:533 » SQL Error ...
  ImmutableIndexIT.testCreateIndexDuringUpsertSelect:172->BaseTest.upsertRows:1620->BaseTest.upsertRow:1647
» SQL
  ImmutableIndexIT.testCreateIndexDuringUpsertSelect:172->BaseTest.upsertRows:1620->BaseTest.upsertRow:1647
» SQL
  RoundRobinResultIteratorWithStatsIT.testRoundRobinBehavior:80 » SQL Cannot cal...
  PhoenixMetricsIT.testNoMetricsCollectedForConnection:327 » SQL does not implem...
  PhoenixMetricsIT.testReadMetricsForSelect:206 » SQL does not implement 'class ...
  PhoenixClientRpcIT.testIndexQos:96 NullPointer
  PhoenixClientRpcIT.testMetadataQos:110 NullPointer
  PhoenixServerRpcIT.testIndexQos:148 NullPointer

Tests run: 211, Failures: 17, Errors: 42, Skipped: 0

[INFO] 
[INFO] --- maven-failsafe-plugin:2.19.1:verify (ParallelStatsEnabledTest) @ phoenix-core ---
[INFO] ------------------------------------------------------------------------
[INFO] Reactor Summary:
[INFO] 
[INFO] Apache Phoenix ..................................... SUCCESS [  2.461 s]
[INFO] Phoenix Core ....................................... FAILURE [  01:23 h]
[INFO] Phoenix - Flume .................................... SKIPPED
[INFO] Phoenix - Pig ...................................... SKIPPED
[INFO] Phoenix Query Server Client ........................ SKIPPED
[INFO] Phoenix Query Server ............................... SKIPPED
[INFO] Phoenix - Pherf .................................... SKIPPED
[INFO] Phoenix - Spark .................................... SKIPPED
[INFO] Phoenix - Hive ..................................... SKIPPED
[INFO] Phoenix Client ..................................... SKIPPED
[INFO] Phoenix Server ..................................... SKIPPED
[INFO] Phoenix Assembly ................................... SKIPPED
[INFO] Phoenix - Tracing Web Application .................. SKIPPED
[INFO] ------------------------------------------------------------------------
[INFO] BUILD FAILURE
[INFO] ------------------------------------------------------------------------
[INFO] Total time: 01:23 h
[INFO] Finished at: 2016-10-27T21:02:01+00:00
[INFO] Final Memory: 70M/967M
[INFO] ------------------------------------------------------------------------
[ERROR] Failed to execute goal org.apache.maven.plugins:maven-failsafe-plugin:2.19.1:verify
(ParallelStatsEnabledTest) on project phoenix-core: There was a timeout or other error in
the fork -> [Help 1]
[ERROR] 
[ERROR] To see the full stack trace of the errors, re-run Maven with the -e switch.
[ERROR] Re-run Maven using the -X switch to enable full debug logging.
[ERROR] 
[ERROR] For more information about the errors and possible solutions, please read the following
articles:
[ERROR] [Help 1] http://cwiki.apache.org/confluence/display/MAVEN/MojoExecutionException
[ERROR] 
[ERROR] After correcting the problems, you can resume the build with the command
[ERROR]   mvn <goals> -rf :phoenix-core
Build step 'Invoke top-level Maven targets' marked build as failure
Archiving artifacts
No prior successful build to compare, so performing full copy of artifacts
Recording test results

Mime
View raw message