phoenix-commits mailing list archives

Site index · List index
Message view « Date » · « Thread »
Top « Date » · « Thread »
From Apache Jenkins Server <jenk...@builds.apache.org>
Subject Build failed in Jenkins: Phoenix-Calcite #22
Date Tue, 04 Oct 2016 01:13:17 GMT
See <https://builds.apache.org/job/Phoenix-calcite/22/changes>

Changes:

[maryannxue] Avoid adding redundant hooks; set materialization_enabled=true by

[maryannxue] Move PhoenixPrepareImpl

------------------------------------------
[...truncated 108680 lines...]
type mismatch:
ref:
BOOLEAN NOT NULL
input:
BIGINT NOT NULL
	at org.apache.phoenix.end2end.SpillableGroupByIT.testScanUri(SpillableGroupByIT.java:125)

Running org.apache.phoenix.end2end.index.MutableIndexFailureIT
Tests run: 1, Failures: 1, Errors: 0, Skipped: 0, Time elapsed: 12.641 sec <<< FAILURE!
- in org.apache.phoenix.end2end.index.ImmutableIndexWithStatsIT
testIndexCreationDeadlockWithStats(org.apache.phoenix.end2end.index.ImmutableIndexWithStatsIT)
 Time elapsed: 9.429 sec  <<< FAILURE!
java.lang.AssertionError
	at org.apache.phoenix.end2end.index.ImmutableIndexWithStatsIT.testIndexCreationDeadlockWithStats(ImmutableIndexWithStatsIT.java:77)

Tests run: 1, Failures: 0, Errors: 1, Skipped: 0, Time elapsed: 0.007 sec <<< FAILURE!
- in org.apache.phoenix.end2end.index.MutableIndexFailureIT
org.apache.phoenix.end2end.index.MutableIndexFailureIT  Time elapsed: 0.006 sec  <<<
ERROR!
java.sql.SQLException: ERROR 102 (08001): Malformed connection url. calcite:localhost:55189:/hbase;test=true;test=true
	at org.apache.phoenix.end2end.index.MutableIndexFailureIT.doSetup(MutableIndexFailureIT.java:115)

Running org.apache.phoenix.hbase.index.FailForUnsupportedHBaseVersionsIT
Running org.apache.phoenix.end2end.index.MutableIndexReplicationIT
Running org.apache.phoenix.end2end.index.ReadOnlyIndexFailureIT
Tests run: 1, Failures: 0, Errors: 1, Skipped: 0, Time elapsed: 0.012 sec <<< FAILURE!
- in org.apache.phoenix.end2end.index.ReadOnlyIndexFailureIT
org.apache.phoenix.end2end.index.ReadOnlyIndexFailureIT  Time elapsed: 0.012 sec  <<<
ERROR!
java.sql.SQLException: ERROR 102 (08001): Malformed connection url. calcite:localhost:49646:/hbase;test=true;test=true
	at org.apache.phoenix.end2end.index.ReadOnlyIndexFailureIT.doSetup(ReadOnlyIndexFailureIT.java:119)

Running org.apache.phoenix.hbase.index.covered.EndToEndCoveredColumnsIndexBuilderIT
Tests run: 2, Failures: 0, Errors: 0, Skipped: 0, Time elapsed: 27.97 sec - in org.apache.phoenix.hbase.index.FailForUnsupportedHBaseVersionsIT
Running org.apache.phoenix.end2end.index.txn.TxWriteFailureIT
Tests run: 1, Failures: 0, Errors: 1, Skipped: 0, Time elapsed: 0.01 sec <<< FAILURE!
- in org.apache.phoenix.end2end.index.txn.TxWriteFailureIT
org.apache.phoenix.end2end.index.txn.TxWriteFailureIT  Time elapsed: 0.009 sec  <<<
ERROR!
java.sql.SQLException: ERROR 102 (08001): Malformed connection url. calcite:localhost:58423:/hbase;test=true;test=true
	at org.apache.phoenix.end2end.index.txn.TxWriteFailureIT.doSetup(TxWriteFailureIT.java:86)

Running org.apache.phoenix.execute.PartialCommitIT
Tests run: 1, Failures: 0, Errors: 1, Skipped: 0, Time elapsed: 0.016 sec <<< FAILURE!
- in org.apache.phoenix.execute.PartialCommitIT
org.apache.phoenix.execute.PartialCommitIT  Time elapsed: 0.006 sec  <<< ERROR!
java.sql.SQLException: ERROR 102 (08001): Malformed connection url. calcite:localhost:50911:/hbase;test=true;test=true
	at org.apache.phoenix.execute.PartialCommitIT.doSetup(PartialCommitIT.java:91)

Tests run: 1, Failures: 0, Errors: 0, Skipped: 0, Time elapsed: 43.387 sec - in org.apache.phoenix.end2end.index.MutableIndexReplicationIT
Tests run: 2, Failures: 0, Errors: 0, Skipped: 0, Time elapsed: 27.2 sec - in org.apache.phoenix.hbase.index.covered.EndToEndCoveredColumnsIndexBuilderIT
Running org.apache.phoenix.hbase.index.covered.example.EndToEndCoveredIndexingIT
Tests run: 14, Failures: 0, Errors: 0, Skipped: 0, Time elapsed: 93.102 sec - in org.apache.phoenix.end2end.UserDefinedFunctionsIT
Running org.apache.phoenix.hbase.index.covered.example.FailWithoutRetriesIT
Tests run: 1, Failures: 0, Errors: 0, Skipped: 0, Time elapsed: 7.221 sec - in org.apache.phoenix.hbase.index.covered.example.FailWithoutRetriesIT
Running org.apache.phoenix.hbase.index.covered.example.EndtoEndIndexingWithCompressionIT
Running org.apache.phoenix.iterate.ScannerLeaseRenewalIT
Running org.apache.phoenix.iterate.RoundRobinResultIteratorWithStatsIT
Running org.apache.phoenix.monitoring.PhoenixMetricsIT
Tests run: 1, Failures: 0, Errors: 1, Skipped: 0, Time elapsed: 4.3 sec <<< FAILURE!
- in org.apache.phoenix.iterate.RoundRobinResultIteratorWithStatsIT
testRoundRobinBehavior(org.apache.phoenix.iterate.RoundRobinResultIteratorWithStatsIT)  Time
elapsed: 1.189 sec  <<< ERROR!
java.sql.SQLException: Error while executing SQL "CREATE TABLE TESTROUNDROBINBEHAVIOR(K VARCHAR
PRIMARY KEY)": java.sql.SQLException: ERROR 1000 (42I00): Single column primary key may not
be NULL. columnName=K
	at org.apache.phoenix.iterate.RoundRobinResultIteratorWithStatsIT.testRoundRobinBehavior(RoundRobinResultIteratorWithStatsIT.java:66)
Caused by: java.lang.RuntimeException: java.sql.SQLException: ERROR 1000 (42I00): Single column
primary key may not be NULL. columnName=K
	at org.apache.phoenix.iterate.RoundRobinResultIteratorWithStatsIT.testRoundRobinBehavior(RoundRobinResultIteratorWithStatsIT.java:66)
Caused by: java.sql.SQLException: ERROR 1000 (42I00): Single column primary key may not be
NULL. columnName=K
	at org.apache.phoenix.iterate.RoundRobinResultIteratorWithStatsIT.testRoundRobinBehavior(RoundRobinResultIteratorWithStatsIT.java:66)

Running org.apache.phoenix.rpc.PhoenixClientRpcIT
Running org.apache.phoenix.rpc.PhoenixServerRpcIT
Tests run: 2, Failures: 0, Errors: 2, Skipped: 0, Time elapsed: 8.193 sec <<< FAILURE!
- in org.apache.phoenix.rpc.PhoenixClientRpcIT
testMetadataQos(org.apache.phoenix.rpc.PhoenixClientRpcIT)  Time elapsed: 0.532 sec  <<<
ERROR!
java.lang.NullPointerException
	at org.apache.phoenix.rpc.PhoenixClientRpcIT.testMetadataQos(PhoenixClientRpcIT.java:110)

testIndexQos(org.apache.phoenix.rpc.PhoenixClientRpcIT)  Time elapsed: 0.214 sec  <<<
ERROR!
java.lang.NullPointerException
	at org.apache.phoenix.rpc.PhoenixClientRpcIT.testIndexQos(PhoenixClientRpcIT.java:96)

Tests run: 1, Failures: 0, Errors: 1, Skipped: 0, Time elapsed: 3.788 sec <<< FAILURE!
- in org.apache.phoenix.rpc.PhoenixServerRpcIT
testIndexQos(org.apache.phoenix.rpc.PhoenixServerRpcIT)  Time elapsed: 0.458 sec  <<<
ERROR!
java.lang.NullPointerException
	at org.apache.phoenix.rpc.PhoenixServerRpcIT.testIndexQos(PhoenixServerRpcIT.java:148)

Tests run: 18, Failures: 7, Errors: 2, Skipped: 0, Time elapsed: 105.143 sec <<<
FAILURE! - in org.apache.phoenix.monitoring.PhoenixMetricsIT
testGlobalPhoenixMetricsForQueries(org.apache.phoenix.monitoring.PhoenixMetricsIT)  Time elapsed:
4.961 sec  <<< FAILURE!
java.lang.AssertionError: expected:<1> but was:<2>
	at org.apache.phoenix.monitoring.PhoenixMetricsIT.testGlobalPhoenixMetricsForQueries(PhoenixMetricsIT.java:101)

testNoMetricsCollectedForConnection(org.apache.phoenix.monitoring.PhoenixMetricsIT)  Time
elapsed: 4.942 sec  <<< ERROR!
java.sql.SQLException: does not implement 'class org.apache.phoenix.jdbc.PhoenixResultSet'
	at org.apache.phoenix.monitoring.PhoenixMetricsIT.testNoMetricsCollectedForConnection(PhoenixMetricsIT.java:327)

testMetricsForDelete(org.apache.phoenix.monitoring.PhoenixMetricsIT)  Time elapsed: 5.008
sec  <<< FAILURE!
java.lang.AssertionError: No read metrics present when there should have been!
	at org.apache.phoenix.monitoring.PhoenixMetricsIT.assertReadMetricsForMutatingSql(PhoenixMetricsIT.java:785)
	at org.apache.phoenix.monitoring.PhoenixMetricsIT.testMetricsForDelete(PhoenixMetricsIT.java:307)

testReadMetricsForSelect(org.apache.phoenix.monitoring.PhoenixMetricsIT)  Time elapsed: 5.517
sec  <<< ERROR!
java.sql.SQLException: does not implement 'class org.apache.phoenix.jdbc.PhoenixResultSet'
	at org.apache.phoenix.monitoring.PhoenixMetricsIT.testReadMetricsForSelect(PhoenixMetricsIT.java:206)

testGlobalPhoenixMetricsForUpsertSelect(org.apache.phoenix.monitoring.PhoenixMetricsIT)  Time
elapsed: 2.95 sec  <<< FAILURE!
java.lang.AssertionError: expected:<1> but was:<0>
	at org.apache.phoenix.monitoring.PhoenixMetricsIT.testGlobalPhoenixMetricsForUpsertSelect(PhoenixMetricsIT.java:144)

testGlobalPhoenixMetricsForMutations(org.apache.phoenix.monitoring.PhoenixMetricsIT)  Time
elapsed: 0.377 sec  <<< FAILURE!
java.lang.AssertionError: expected:<10> but was:<0>
	at org.apache.phoenix.monitoring.PhoenixMetricsIT.testGlobalPhoenixMetricsForMutations(PhoenixMetricsIT.java:121)

testMetricsForDeleteWithAutoCommit(org.apache.phoenix.monitoring.PhoenixMetricsIT)  Time elapsed:
5.073 sec  <<< FAILURE!
java.lang.AssertionError: The two metrics have different or unequal number of table names

	at org.apache.phoenix.monitoring.PhoenixMetricsIT.assertMetricsAreSame(PhoenixMetricsIT.java:650)
	at org.apache.phoenix.monitoring.PhoenixMetricsIT.testMetricsForDeleteWithAutoCommit(PhoenixMetricsIT.java:418)

testMetricsForUpsertSelect(org.apache.phoenix.monitoring.PhoenixMetricsIT)  Time elapsed:
9.291 sec  <<< FAILURE!
java.lang.AssertionError: No read metrics present when there should have been!
	at org.apache.phoenix.monitoring.PhoenixMetricsIT.assertReadMetricsForMutatingSql(PhoenixMetricsIT.java:785)
	at org.apache.phoenix.monitoring.PhoenixMetricsIT.testMetricsForUpsertSelect(PhoenixMetricsIT.java:284)

testMetricsForUpsertSelectSameTable(org.apache.phoenix.monitoring.PhoenixMetricsIT)  Time
elapsed: 4.95 sec  <<< FAILURE!
java.lang.AssertionError: No read metrics present when there should have been!
	at org.apache.phoenix.monitoring.PhoenixMetricsIT.assertReadMetricsForMutatingSql(PhoenixMetricsIT.java:785)
	at org.apache.phoenix.monitoring.PhoenixMetricsIT.testMetricsForUpsertSelectSameTable(PhoenixMetricsIT.java:611)

Tests run: 2, Failures: 0, Errors: 0, Skipped: 0, Time elapsed: 175.402 sec - in org.apache.phoenix.iterate.ScannerLeaseRenewalIT
Tests run: 11, Failures: 0, Errors: 0, Skipped: 0, Time elapsed: 211.909 sec - in org.apache.phoenix.hbase.index.covered.example.EndToEndCoveredIndexingIT
Tests run: 11, Failures: 0, Errors: 0, Skipped: 0, Time elapsed: 207.829 sec - in org.apache.phoenix.hbase.index.covered.example.EndtoEndIndexingWithCompressionIT

Results :

Failed tests: 
  QueryTimeoutIT.testSetRPCTimeOnConnection:94
  QueryWithLimitIT.testQueryWithoutLimitFails:98
  SpillableGroupByIT.testScanUri:125 Internal error: Error while applying rule AggregateExpandDistinctAggregatesRule,
args [rel#55059:LogicalAggregate.NONE.[](input=rel#55004:Subset#0.SERVER.[],group={1},EXPR$0=COUNT(),EXPR$1=COUNT(DISTINCT
$1),EXPR$2=SUM($2),EXPR$3=AVG($2),EXPR$5=MIN($0),EXPR$6=MAX($0))]
  ImmutableIndexWithStatsIT.testIndexCreationDeadlockWithStats:77
  PhoenixMetricsIT.testGlobalPhoenixMetricsForMutations:121->BaseTest.assertEquals:2129
expected:<10> but was:<0>
  PhoenixMetricsIT.testGlobalPhoenixMetricsForQueries:101->BaseTest.assertEquals:2129 expected:<1>
but was:<2>
  PhoenixMetricsIT.testGlobalPhoenixMetricsForUpsertSelect:144->BaseTest.assertEquals:2129
expected:<1> but was:<0>
  PhoenixMetricsIT.testMetricsForDelete:307->assertReadMetricsForMutatingSql:785 No read
metrics present when there should have been!
  PhoenixMetricsIT.testMetricsForDeleteWithAutoCommit:418->assertMetricsAreSame:650 The
two metrics have different or unequal number of table names 
  PhoenixMetricsIT.testMetricsForUpsertSelect:284->assertReadMetricsForMutatingSql:785
No read metrics present when there should have been!
  PhoenixMetricsIT.testMetricsForUpsertSelectSameTable:611->assertReadMetricsForMutatingSql:785
No read metrics present when there should have been!
Tests in error: 
  StatisticsCollectionRunTrackerIT.testMajorCompactionPreventsUpdateStatsFromRunning:105->createTableAndGetRegion:145
» SQL
  StatisticsCollectionRunTrackerIT.testStateBeforeAndAfterMajorCompaction:77->createTableAndGetRegion:145
» SQL
  StatisticsCollectionRunTrackerIT.testStateBeforeAndAfterUpdateStatsCommand:62->createTableAndGetRegion:145
» SQL
  StatisticsCollectionRunTrackerIT.testUpdateStatsPreventsAnotherUpdateStatsFromRunning:118->createTableAndGetRegion:145
» SQL
  CsvBulkLoadToolIT.doSetup:62->BaseTest.setUpTestDriver:625->BaseTest.setupTxManager:536
» SQL
  IndexExtendedIT.doSetup:99->BaseTest.setUpTestDriver:625->BaseTest.setupTxManager:536
» SQL
  KeyOnlyIT.testKeyOnly:82 » SQL Error while preparing statement [SELECT /*+ NO_...
  MultiCfQueryExecIT.testCFToDisambiguate2:307->initTableValues:66 » SQL Error w...
  MultiCfQueryExecIT.testCFToDisambiguateInSelectOnly1:123->initTableValues:66 » SQL
  MultiCfQueryExecIT.testCFToDisambiguateInSelectOnly2:144->initTableValues:66 » SQL
  MultiCfQueryExecIT.testConstantCount:103->initTableValues:66 » SQL Error while...
  MultiCfQueryExecIT.testDefaultCFToDisambiguate:323->initTableValues:66 » SQL E...
  MultiCfQueryExecIT.testEssentialColumnFamilyForRowKeyFilter:368->initTableValues:66 »
SQL
  MultiCfQueryExecIT.testGuidePostsForMultiCFs:160->initTableValues:66 » SQL Err...
  MultiCfQueryExecIT.testGuidePostsForMultiCFsOverUnevenDistrib:225 » SQL does n...
  MultiCfQueryExecIT.testGuidePostsRetrievedForMultiCF:246 » SQL Error while exe...
  ParallelIteratorsIT.testGetSplits:82->initTableValues:209->BaseTest.ensureTableCreated:788->BaseTest.ensureTableCreated:801->BaseTest.createTestTable:813->BaseTest.createTestTable:855
» SQL
  ParallelIteratorsIT.testGuidePostsLifeCycle:141->BaseTest.ensureTableCreated:788->BaseTest.ensureTableCreated:801->BaseTest.createTestTable:813->BaseTest.createTestTable:855
» SQL
  ParallelIteratorsIT.testServerNameOnScan:119->BaseTest.ensureTableCreated:788->BaseTest.ensureTableCreated:801->BaseTest.createTestTable:813->BaseTest.createTestTable:855
» SQL
  QueryTimeoutIT.testQueryTimeout:107 » SQL Error while executing SQL "CREATE TA...
  QueryWithOffsetIT.testMetaDataWithOffset:201 » SQL Error while preparing state...
  QueryWithOffsetIT.testMetaDataWithOffset:201 » SQL Error while preparing state...
  SaltedViewIT>BaseViewIT.doSetup:73->BaseTest.setUpTestDriver:617->BaseTest.setUpTestDriver:625->BaseTest.setupTxManager:536
» SQL
  StatsCollectionDisabledIT.testStatisticsAreNotWritten:68 » SQL Error while exe...
  StatsCollectorIT.doSetup:77->BaseTest.setUpTestDriver:617->BaseTest.setUpTestDriver:625->BaseTest.setupTxManager:536
» SQL
  StatsCollectorWithSplitsAndMultiCFIT.testRowCountAndByteCounts:171 » SQL Error...
  StatsCollectorWithSplitsAndMultiCFIT.testWithMultiCF:71 » SQL Error while exec...
  TenantSpecificTablesDDLIT>BaseTenantSpecificTablesIT.createTables:68->BaseTest.createTestTable:813->BaseTest.createTestTable:855
» SQL
  TenantSpecificTablesDDLIT>BaseTenantSpecificTablesIT.createTables:68->BaseTest.createTestTable:813->BaseTest.createTestTable:855
» SQL
  TenantSpecificTablesDDLIT>BaseTenantSpecificTablesIT.createTables:68->BaseTest.createTestTable:813->BaseTest.createTestTable:855
» SQL
  TenantSpecificTablesDDLIT>BaseTenantSpecificTablesIT.createTables:68->BaseTest.createTestTable:813->BaseTest.createTestTable:855
» SQL
  TenantSpecificTablesDDLIT>BaseTenantSpecificTablesIT.createTables:68->BaseTest.createTestTable:813->BaseTest.createTestTable:855
» SQL
  TenantSpecificTablesDDLIT>BaseTenantSpecificTablesIT.createTables:68->BaseTest.createTestTable:813->BaseTest.createTestTable:855
» SQL
  TenantSpecificTablesDDLIT>BaseTenantSpecificTablesIT.createTables:68->BaseTest.createTestTable:813->BaseTest.createTestTable:855
» SQL
  TenantSpecificTablesDDLIT>BaseTenantSpecificTablesIT.createTables:68->BaseTest.createTestTable:813->BaseTest.createTestTable:855
» SQL
  TenantSpecificTablesDDLIT>BaseTenantSpecificTablesIT.createTables:68->BaseTest.createTestTable:813->BaseTest.createTestTable:855
» SQL
  TenantSpecificTablesDDLIT>BaseTenantSpecificTablesIT.createTables:68->BaseTest.createTestTable:813->BaseTest.createTestTable:855
» SQL
  TenantSpecificTablesDDLIT>BaseTenantSpecificTablesIT.createTables:68->BaseTest.createTestTable:813->BaseTest.createTestTable:855
» SQL
  TenantSpecificTablesDDLIT>BaseTenantSpecificTablesIT.createTables:68->BaseTest.createTestTable:813->BaseTest.createTestTable:855
» SQL
  TenantSpecificTablesDDLIT>BaseTenantSpecificTablesIT.createTables:68->BaseTest.createTestTable:813->BaseTest.createTestTable:855
» SQL
  TenantSpecificTablesDDLIT>BaseTenantSpecificTablesIT.createTables:68->BaseTest.createTestTable:813->BaseTest.createTestTable:855
» SQL
  TenantSpecificTablesDDLIT>BaseTenantSpecificTablesIT.createTables:68->BaseTest.createTestTable:813->BaseTest.createTestTable:855
» SQL
  TenantSpecificTablesDDLIT>BaseTenantSpecificTablesIT.createTables:68->BaseTest.createTestTable:813->BaseTest.createTestTable:855
» SQL
  TenantSpecificTablesDDLIT>BaseTenantSpecificTablesIT.createTables:68->BaseTest.createTestTable:813->BaseTest.createTestTable:855
» SQL
  TenantSpecificTablesDMLIT>BaseTenantSpecificTablesIT.createTables:68->BaseTest.createTestTable:813->BaseTest.createTestTable:855
» SQL
  TenantSpecificTablesDMLIT>BaseTenantSpecificTablesIT.createTables:68->BaseTest.createTestTable:813->BaseTest.createTestTable:855
» SQL
  TenantSpecificTablesDMLIT>BaseTenantSpecificTablesIT.createTables:68->BaseTest.createTestTable:813->BaseTest.createTestTable:855
» SQL
  TenantSpecificTablesDMLIT>BaseTenantSpecificTablesIT.createTables:68->BaseTest.createTestTable:813->BaseTest.createTestTable:855
» SQL
  TenantSpecificTablesDMLIT>BaseTenantSpecificTablesIT.createTables:68->BaseTest.createTestTable:813->BaseTest.createTestTable:855
» SQL
  TenantSpecificTablesDMLIT>BaseTenantSpecificTablesIT.createTables:68->BaseTest.createTestTable:813->BaseTest.createTestTable:855
» SQL
  TenantSpecificTablesDMLIT>BaseTenantSpecificTablesIT.createTables:68->BaseTest.createTestTable:813->BaseTest.createTestTable:855
» SQL
  TenantSpecificTablesDMLIT>BaseTenantSpecificTablesIT.createTables:68->BaseTest.createTestTable:813->BaseTest.createTestTable:855
» SQL
  TenantSpecificTablesDMLIT>BaseTenantSpecificTablesIT.createTables:68->BaseTest.createTestTable:813->BaseTest.createTestTable:855
» SQL
  TenantSpecificTablesDMLIT>BaseTenantSpecificTablesIT.createTables:68->BaseTest.createTestTable:813->BaseTest.createTestTable:855
» SQL
  TenantSpecificTablesDMLIT>BaseTenantSpecificTablesIT.createTables:68->BaseTest.createTestTable:813->BaseTest.createTestTable:855
» SQL
  TenantSpecificTablesDMLIT>BaseTenantSpecificTablesIT.createTables:68->BaseTest.createTestTable:813->BaseTest.createTestTable:855
» SQL
  TenantSpecificTablesDMLIT>BaseTenantSpecificTablesIT.createTables:68->BaseTest.createTestTable:813->BaseTest.createTestTable:855
» SQL
  TenantSpecificTablesDMLIT>BaseTenantSpecificTablesIT.createTables:68->BaseTest.createTestTable:813->BaseTest.createTestTable:855
» SQL
  TenantSpecificTablesDMLIT>BaseTenantSpecificTablesIT.createTables:68->BaseTest.createTestTable:813->BaseTest.createTestTable:855
» SQL
  TenantSpecificTablesDMLIT>BaseTenantSpecificTablesIT.createTables:68->BaseTest.createTestTable:813->BaseTest.createTestTable:855
» SQL
  TransactionalViewIT.doSetup:45->BaseTest.setUpTestDriver:617->BaseTest.setUpTestDriver:625->BaseTest.setupTxManager:536
» SQL
  ViewIT>BaseViewIT.doSetup:73->BaseTest.setUpTestDriver:617->BaseTest.setUpTestDriver:625->BaseTest.setupTxManager:536
» SQL
  MutableIndexFailureIT.doSetup:115->BaseTest.setUpTestDriver:625->BaseTest.setupTxManager:536
» SQL
  ReadOnlyIndexFailureIT.doSetup:119->BaseTest.setUpTestDriver:625->BaseTest.setupTxManager:536
» SQL
  TxWriteFailureIT.doSetup:86->BaseTest.setUpTestDriver:625->BaseTest.setupTxManager:536
» SQL
  PartialCommitIT.doSetup:91->BaseTest.setUpTestDriver:625->BaseTest.setupTxManager:536
» SQL
  RoundRobinResultIteratorWithStatsIT.testRoundRobinBehavior:66 » SQL Error whil...
  PhoenixMetricsIT.testNoMetricsCollectedForConnection:327 » SQL does not implem...
  PhoenixMetricsIT.testReadMetricsForSelect:206 » SQL does not implement 'class ...
  PhoenixClientRpcIT.testIndexQos:96 NullPointer
  PhoenixClientRpcIT.testMetadataQos:110 NullPointer
  PhoenixServerRpcIT.testIndexQos:148 NullPointer

Tests run: 153, Failures: 11, Errors: 72, Skipped: 0

[INFO] 
[INFO] --- maven-failsafe-plugin:2.19.1:verify (ParallelStatsEnabledTest) @ phoenix-core ---
[INFO] ------------------------------------------------------------------------
[INFO] Reactor Summary:
[INFO] 
[INFO] Apache Phoenix ..................................... SUCCESS [  2.756 s]
[INFO] Phoenix Core ....................................... FAILURE [40:30 min]
[INFO] Phoenix - Flume .................................... SKIPPED
[INFO] Phoenix - Pig ...................................... SKIPPED
[INFO] Phoenix Query Server Client ........................ SKIPPED
[INFO] Phoenix Query Server ............................... SKIPPED
[INFO] Phoenix - Pherf .................................... SKIPPED
[INFO] Phoenix - Spark .................................... SKIPPED
[INFO] Phoenix - Hive ..................................... SKIPPED
[INFO] Phoenix Client ..................................... SKIPPED
[INFO] Phoenix Server ..................................... SKIPPED
[INFO] Phoenix Assembly ................................... SKIPPED
[INFO] Phoenix - Tracing Web Application .................. SKIPPED
[INFO] ------------------------------------------------------------------------
[INFO] BUILD FAILURE
[INFO] ------------------------------------------------------------------------
[INFO] Total time: 40:35 min
[INFO] Finished at: 2016-10-04T01:03:13+00:00
[INFO] Final Memory: 86M/978M
[INFO] ------------------------------------------------------------------------
[ERROR] Failed to execute goal org.apache.maven.plugins:maven-failsafe-plugin:2.19.1:verify
(ParallelStatsEnabledTest) on project phoenix-core: There was a timeout or other error in
the fork -> [Help 1]
[ERROR] 
[ERROR] To see the full stack trace of the errors, re-run Maven with the -e switch.
[ERROR] Re-run Maven using the -X switch to enable full debug logging.
[ERROR] 
[ERROR] For more information about the errors and possible solutions, please read the following
articles:
[ERROR] [Help 1] http://cwiki.apache.org/confluence/display/MAVEN/MojoExecutionException
[ERROR] 
[ERROR] After correcting the problems, you can resume the build with the command
[ERROR]   mvn <goals> -rf :phoenix-core
Build step 'Invoke top-level Maven targets' marked build as failure
Archiving artifacts
No prior successful build to compare, so performing full copy of artifacts
Recording test results

Mime
View raw message