phoenix-commits mailing list archives

Site index · List index
Message view « Date » · « Thread »
Top « Date » · « Thread »
From Apache Jenkins Server <jenk...@builds.apache.org>
Subject Build failed in Jenkins: Phoenix | Master #1456
Date Fri, 28 Oct 2016 10:30:22 GMT
See <https://builds.apache.org/job/Phoenix-master/1456/changes>

Changes:

[jamestaylor] PHOENIX-3396 Valid Multi-byte strings whose total byte size is greater

[jamestaylor] PHOENIX-3421 Column name lookups fail when on an indexed table

[rajeshbabu] PHOENIX-3417 Refactor function argument validation with function

------------------------------------------
[...truncated 306 lines...]
Running org.apache.phoenix.expression.function.ExternalSqlTypeIdFunctionTest
Tests run: 24, Failures: 0, Errors: 0, Skipped: 0, Time elapsed: 0.057 sec - in org.apache.phoenix.expression.ArrayToStringFunctionTest
Running org.apache.phoenix.expression.function.BuiltinFunctionConstructorTest
Running org.apache.phoenix.expression.RegexpSubstrFunctionTest
Tests run: 5, Failures: 0, Errors: 0, Skipped: 0, Time elapsed: 1.046 sec - in org.apache.phoenix.util.json.JsonUpsertExecutorTest
Tests run: 3, Failures: 0, Errors: 0, Skipped: 0, Time elapsed: 0.004 sec - in org.apache.phoenix.expression.function.ExternalSqlTypeIdFunctionTest
Running org.apache.phoenix.expression.SqrtFunctionTest
Running org.apache.phoenix.expression.SignFunctionTest
Tests run: 1, Failures: 0, Errors: 0, Skipped: 0, Time elapsed: 0.011 sec - in org.apache.phoenix.expression.SqrtFunctionTest
Tests run: 1, Failures: 0, Errors: 0, Skipped: 0, Time elapsed: 0.021 sec - in org.apache.phoenix.expression.SignFunctionTest
Running org.apache.phoenix.expression.SortOrderExpressionTest
Running org.apache.phoenix.expression.ArrayFillFunctionTest
Tests run: 14, Failures: 0, Errors: 0, Skipped: 0, Time elapsed: 0.027 sec - in org.apache.phoenix.expression.ArrayFillFunctionTest
Running org.apache.phoenix.expression.ArrayPrependFunctionTest
Tests run: 24, Failures: 0, Errors: 0, Skipped: 0, Time elapsed: 0.046 sec - in org.apache.phoenix.expression.SortOrderExpressionTest
Running org.apache.phoenix.expression.RoundFloorCeilExpressionsTest
Tests run: 2, Failures: 0, Errors: 0, Skipped: 0, Time elapsed: 0.116 sec - in org.apache.phoenix.expression.function.BuiltinFunctionConstructorTest
Running org.apache.phoenix.expression.PowerFunctionTest
Tests run: 1, Failures: 0, Errors: 0, Skipped: 0, Time elapsed: 0.133 sec - in org.apache.phoenix.expression.RegexpSubstrFunctionTest
Running org.apache.phoenix.expression.GetSetByteBitFunctionTest
Tests run: 1, Failures: 0, Errors: 0, Skipped: 0, Time elapsed: 0.049 sec - in org.apache.phoenix.expression.PowerFunctionTest
Running org.apache.phoenix.expression.ColumnExpressionTest
Tests run: 4, Failures: 0, Errors: 0, Skipped: 0, Time elapsed: 0.007 sec - in org.apache.phoenix.expression.ColumnExpressionTest
Running org.apache.phoenix.expression.RegexpSplitFunctionTest
Tests run: 1, Failures: 0, Errors: 0, Skipped: 0, Time elapsed: 0.179 sec - in org.apache.phoenix.expression.RegexpSplitFunctionTest
Running org.apache.phoenix.expression.LnLogFunctionTest
Tests run: 37, Failures: 0, Errors: 0, Skipped: 0, Time elapsed: 0.33 sec - in org.apache.phoenix.expression.ArrayPrependFunctionTest
Running org.apache.phoenix.expression.AbsFunctionTest
Tests run: 3, Failures: 0, Errors: 0, Skipped: 0, Time elapsed: 0.576 sec - in org.apache.phoenix.expression.NullValueTest
Running org.apache.phoenix.expression.LikeExpressionTest
Tests run: 1, Failures: 0, Errors: 0, Skipped: 0, Time elapsed: 0.036 sec - in org.apache.phoenix.expression.AbsFunctionTest
Running org.apache.phoenix.expression.ExpFunctionTest
Tests run: 1, Failures: 0, Errors: 0, Skipped: 0, Time elapsed: 0.071 sec - in org.apache.phoenix.expression.LnLogFunctionTest
Running org.apache.phoenix.expression.ILikeExpressionTest
Tests run: 1, Failures: 0, Errors: 0, Skipped: 0, Time elapsed: 0.026 sec - in org.apache.phoenix.expression.ExpFunctionTest
Running org.apache.phoenix.expression.ArrayAppendFunctionTest
Tests run: 3, Failures: 0, Errors: 0, Skipped: 0, Time elapsed: 0.046 sec - in org.apache.phoenix.expression.ILikeExpressionTest
Running org.apache.phoenix.expression.CbrtFunctionTest
Tests run: 1, Failures: 0, Errors: 0, Skipped: 0, Time elapsed: 0.015 sec - in org.apache.phoenix.expression.CbrtFunctionTest
Running org.apache.phoenix.expression.ArrayConcatFunctionTest
Tests run: 25, Failures: 0, Errors: 0, Skipped: 0, Time elapsed: 0.135 sec - in org.apache.phoenix.expression.ArrayAppendFunctionTest
Running org.apache.phoenix.expression.StringToArrayFunctionTest
Tests run: 20, Failures: 0, Errors: 0, Skipped: 0, Time elapsed: 0.031 sec - in org.apache.phoenix.expression.StringToArrayFunctionTest
Running org.apache.phoenix.filter.DistinctPrefixFilterTest
Tests run: 6, Failures: 0, Errors: 0, Skipped: 0, Time elapsed: 0.286 sec - in org.apache.phoenix.expression.LikeExpressionTest
Tests run: 8, Failures: 0, Errors: 0, Skipped: 0, Time elapsed: 0.032 sec - in org.apache.phoenix.filter.DistinctPrefixFilterTest
Running org.apache.phoenix.filter.SkipScanFilterTest
Running org.apache.phoenix.filter.SkipScanBigFilterTest
Tests run: 23, Failures: 0, Errors: 0, Skipped: 0, Time elapsed: 0.754 sec - in org.apache.phoenix.expression.RoundFloorCeilExpressionsTest
Running org.apache.phoenix.filter.SkipScanFilterIntersectTest
Tests run: 19, Failures: 0, Errors: 0, Skipped: 0, Time elapsed: 0.053 sec - in org.apache.phoenix.filter.SkipScanFilterIntersectTest
Tests run: 15, Failures: 0, Errors: 0, Skipped: 0, Time elapsed: 0.164 sec - in org.apache.phoenix.filter.SkipScanFilterTest
Running org.apache.phoenix.cache.JodaTimezoneCacheTest
Tests run: 12, Failures: 0, Errors: 0, Skipped: 0, Time elapsed: 1.826 sec - in org.apache.phoenix.util.PhoenixRuntimeTest
Running org.apache.phoenix.jdbc.SecureUserConnectionsTest
Running org.apache.phoenix.cache.TenantCacheTest
Tests run: 4, Failures: 0, Errors: 0, Skipped: 0, Time elapsed: 0.025 sec - in org.apache.phoenix.cache.JodaTimezoneCacheTest
Tests run: 2, Failures: 0, Errors: 0, Skipped: 0, Time elapsed: 0.023 sec - in org.apache.phoenix.cache.TenantCacheTest
Running org.apache.phoenix.jdbc.ReadOnlyPropertiesTest
Running org.apache.phoenix.jdbc.PhoenixPreparedStatementTest
Tests run: 4, Failures: 0, Errors: 0, Skipped: 0, Time elapsed: 0.043 sec - in org.apache.phoenix.jdbc.ReadOnlyPropertiesTest
Running org.apache.phoenix.jdbc.PhoenixResultSetMetadataTest
Tests run: 2, Failures: 0, Errors: 0, Skipped: 0, Time elapsed: 0.991 sec - in org.apache.phoenix.expression.GetSetByteBitFunctionTest
Running org.apache.phoenix.jdbc.PhoenixEmbeddedDriverTest
Tests run: 3, Failures: 0, Errors: 0, Skipped: 0, Time elapsed: 0.128 sec - in org.apache.phoenix.jdbc.PhoenixEmbeddedDriverTest
Running org.apache.phoenix.jdbc.PhoenixDriverTest
Tests run: 11, Failures: 0, Errors: 0, Skipped: 0, Time elapsed: 0.417 sec - in org.apache.phoenix.jdbc.PhoenixPreparedStatementTest
Running org.apache.phoenix.index.IndexMaintainerTest
Tests run: 35, Failures: 0, Errors: 0, Skipped: 0, Time elapsed: 1.097 sec - in org.apache.phoenix.expression.ArrayConcatFunctionTest
Running org.apache.phoenix.index.automated.MRJobSubmitterTest
Tests run: 5, Failures: 0, Errors: 0, Skipped: 0, Time elapsed: 0.148 sec - in org.apache.phoenix.index.automated.MRJobSubmitterTest
Running org.apache.phoenix.trace.TraceMetricsSourceTest
Tests run: 6, Failures: 0, Errors: 0, Skipped: 1, Time elapsed: 0.722 sec - in org.apache.phoenix.jdbc.PhoenixDriverTest
Running org.apache.phoenix.execute.CorrelatePlanTest
Tests run: 1, Failures: 0, Errors: 0, Skipped: 0, Time elapsed: 1.161 sec - in org.apache.phoenix.jdbc.PhoenixResultSetMetadataTest
Tests run: 6, Failures: 0, Errors: 0, Skipped: 0, Time elapsed: 0.243 sec - in org.apache.phoenix.execute.CorrelatePlanTest
Running org.apache.phoenix.execute.MutationStateTest
Running org.apache.phoenix.execute.LiteralResultIteratorPlanTest
Tests run: 1, Failures: 0, Errors: 0, Skipped: 0, Time elapsed: 0.002 sec - in org.apache.phoenix.execute.MutationStateTest
Running org.apache.phoenix.execute.DescVarLengthFastByteComparisonsTest
Tests run: 3, Failures: 0, Errors: 0, Skipped: 0, Time elapsed: 0.008 sec - in org.apache.phoenix.execute.LiteralResultIteratorPlanTest
Tests run: 2, Failures: 0, Errors: 0, Skipped: 0, Time elapsed: 0.004 sec - in org.apache.phoenix.execute.DescVarLengthFastByteComparisonsTest
Running org.apache.phoenix.execute.UnnestArrayPlanTest
Running org.apache.phoenix.compile.HavingCompilerTest
Tests run: 6, Failures: 0, Errors: 0, Skipped: 0, Time elapsed: 0.012 sec - in org.apache.phoenix.execute.UnnestArrayPlanTest
Running org.apache.phoenix.compile.StatementHintsCompilationTest
Tests run: 3, Failures: 0, Errors: 0, Skipped: 0, Time elapsed: 0.579 sec - in org.apache.phoenix.trace.TraceMetricsSourceTest
Tests run: 2, Failures: 0, Errors: 0, Skipped: 0, Time elapsed: 1.684 sec - in org.apache.phoenix.filter.SkipScanBigFilterTest
Running org.apache.phoenix.compile.SaltedScanRangesTest
Running org.apache.phoenix.compile.ScanRangesIntersectTest
Tests run: 1, Failures: 0, Errors: 0, Skipped: 0, Time elapsed: 0.003 sec - in org.apache.phoenix.compile.ScanRangesIntersectTest
Running org.apache.phoenix.compile.QueryOptimizerTest
Tests run: 9, Failures: 0, Errors: 0, Skipped: 0, Time elapsed: 0.036 sec - in org.apache.phoenix.compile.SaltedScanRangesTest
Running org.apache.phoenix.compile.TenantSpecificViewIndexCompileTest
Tests run: 24, Failures: 0, Errors: 0, Skipped: 0, Time elapsed: 1.203 sec - in org.apache.phoenix.index.IndexMaintainerTest
Running org.apache.phoenix.compile.CreateTableCompilerTest
Tests run: 11, Failures: 0, Errors: 0, Skipped: 0, Time elapsed: 0.572 sec - in org.apache.phoenix.compile.HavingCompilerTest
Running org.apache.phoenix.compile.QueryMetaDataTest
Tests run: 1, Failures: 0, Errors: 0, Skipped: 0, Time elapsed: 0.379 sec - in org.apache.phoenix.compile.CreateTableCompilerTest
Running org.apache.phoenix.compile.JoinQueryCompilerTest
Tests run: 4, Failures: 0, Errors: 0, Skipped: 0, Time elapsed: 0.877 sec - in org.apache.phoenix.compile.StatementHintsCompilationTest
Running org.apache.phoenix.compile.WhereOptimizerTest
Tests run: 33, Failures: 0, Errors: 0, Skipped: 0, Time elapsed: 0.445 sec - in org.apache.phoenix.compile.QueryMetaDataTest
Running org.apache.phoenix.compile.ViewCompilerTest
Tests run: 2, Failures: 0, Errors: 0, Skipped: 0, Time elapsed: 0.694 sec - in org.apache.phoenix.compile.JoinQueryCompilerTest
Running org.apache.phoenix.compile.QueryCompilerTest
Tests run: 3, Failures: 0, Errors: 0, Skipped: 0, Time elapsed: 0.514 sec - in org.apache.phoenix.compile.ViewCompilerTest
Running org.apache.phoenix.compile.SelectStatementRewriterTest
Tests run: 6, Failures: 0, Errors: 0, Skipped: 0, Time elapsed: 1.345 sec - in org.apache.phoenix.compile.TenantSpecificViewIndexCompileTest
Running org.apache.phoenix.compile.WhereCompilerTest
Tests run: 5, Failures: 0, Errors: 0, Skipped: 0, Time elapsed: 0.376 sec - in org.apache.phoenix.compile.SelectStatementRewriterTest
Running org.apache.phoenix.compile.LimitCompilerTest
Tests run: 42, Failures: 0, Errors: 0, Skipped: 0, Time elapsed: 1.908 sec - in org.apache.phoenix.compile.QueryOptimizerTest
Running org.apache.phoenix.compile.ScanRangesTest
Tests run: 34, Failures: 0, Errors: 0, Skipped: 0, Time elapsed: 0.058 sec - in org.apache.phoenix.compile.ScanRangesTest
Running org.apache.phoenix.parse.BuiltInFunctionInfoTest
Tests run: 3, Failures: 0, Errors: 0, Skipped: 0, Time elapsed: 0.005 sec - in org.apache.phoenix.parse.BuiltInFunctionInfoTest
Tests run: 109, Failures: 0, Errors: 0, Skipped: 0, Time elapsed: 1.239 sec - in org.apache.phoenix.compile.WhereOptimizerTest
Running org.apache.phoenix.parse.QueryParserTest
Running org.apache.phoenix.parse.CastParseNodeTest
Tests run: 3, Failures: 0, Errors: 0, Skipped: 0, Time elapsed: 0.004 sec - in org.apache.phoenix.parse.CastParseNodeTest
Running org.apache.phoenix.iterate.AggregateResultScannerTest
Tests run: 6, Failures: 0, Errors: 0, Skipped: 0, Time elapsed: 0.291 sec - in org.apache.phoenix.compile.LimitCompilerTest
Running org.apache.phoenix.iterate.RowKeyOrderedAggregateResultIteratorTest
Tests run: 60, Failures: 0, Errors: 0, Skipped: 0, Time elapsed: 0.193 sec - in org.apache.phoenix.parse.QueryParserTest
Running org.apache.phoenix.iterate.MergeSortResultIteratorTest
Tests run: 2, Failures: 0, Errors: 0, Skipped: 0, Time elapsed: 0.013 sec - in org.apache.phoenix.iterate.MergeSortResultIteratorTest
Running org.apache.phoenix.iterate.ConcatResultIteratorTest
Tests run: 2, Failures: 0, Errors: 0, Skipped: 0, Time elapsed: 0.004 sec - in org.apache.phoenix.iterate.ConcatResultIteratorTest
Tests run: 45, Failures: 0, Errors: 0, Skipped: 1, Time elapsed: 0.821 sec - in org.apache.phoenix.compile.WhereCompilerTest
Running org.apache.phoenix.iterate.SpoolingResultIteratorTest
Running org.apache.phoenix.hbase.index.parallel.TestThreadPoolManager
Tests run: 3, Failures: 0, Errors: 0, Skipped: 0, Time elapsed: 0.037 sec - in org.apache.phoenix.hbase.index.parallel.TestThreadPoolManager
Running org.apache.phoenix.hbase.index.parallel.TestThreadPoolBuilder
Tests run: 2, Failures: 0, Errors: 0, Skipped: 0, Time elapsed: 0.003 sec - in org.apache.phoenix.hbase.index.parallel.TestThreadPoolBuilder
Running org.apache.phoenix.hbase.index.util.TestIndexManagementUtil
Tests run: 4, Failures: 0, Errors: 0, Skipped: 0, Time elapsed: 0.266 sec - in org.apache.phoenix.iterate.RowKeyOrderedAggregateResultIteratorTest
Running org.apache.phoenix.hbase.index.covered.update.TestIndexUpdateManager
Tests run: 3, Failures: 0, Errors: 0, Skipped: 0, Time elapsed: 0.063 sec - in org.apache.phoenix.hbase.index.util.TestIndexManagementUtil
Tests run: 3, Failures: 0, Errors: 0, Skipped: 0, Time elapsed: 0.154 sec - in org.apache.phoenix.iterate.SpoolingResultIteratorTest
Running org.apache.phoenix.hbase.index.covered.TestCoveredColumns
Tests run: 2, Failures: 0, Errors: 0, Skipped: 0, Time elapsed: 0.006 sec - in org.apache.phoenix.hbase.index.covered.update.TestIndexUpdateManager
Running org.apache.phoenix.hbase.index.covered.filter.TestApplyAndFilterDeletesFilter
Running org.apache.phoenix.hbase.index.covered.filter.TestNewerTimestampFilter
Tests run: 1, Failures: 0, Errors: 0, Skipped: 0, Time elapsed: 0.003 sec - in org.apache.phoenix.hbase.index.covered.TestCoveredColumns
Running org.apache.phoenix.hbase.index.covered.TestLocalTableState
Tests run: 1, Failures: 0, Errors: 0, Skipped: 0, Time elapsed: 0.003 sec - in org.apache.phoenix.hbase.index.covered.filter.TestNewerTimestampFilter
Running org.apache.phoenix.hbase.index.covered.example.TestColumnTracker
Tests run: 6, Failures: 0, Errors: 0, Skipped: 0, Time elapsed: 0.011 sec - in org.apache.phoenix.hbase.index.covered.filter.TestApplyAndFilterDeletesFilter
Running org.apache.phoenix.hbase.index.covered.example.TestCoveredIndexSpecifierBuilder
Tests run: 3, Failures: 0, Errors: 0, Skipped: 0, Time elapsed: 0.004 sec - in org.apache.phoenix.hbase.index.covered.example.TestColumnTracker
Running org.apache.phoenix.hbase.index.covered.example.TestCoveredColumnIndexCodec
Tests run: 1, Failures: 0, Errors: 0, Skipped: 0, Time elapsed: 0.013 sec - in org.apache.phoenix.hbase.index.covered.example.TestCoveredIndexSpecifierBuilder
Running org.apache.phoenix.hbase.index.covered.data.TestIndexMemStore
Tests run: 2, Failures: 0, Errors: 0, Skipped: 0, Time elapsed: 0.011 sec - in org.apache.phoenix.hbase.index.covered.data.TestIndexMemStore
Running org.apache.phoenix.hbase.index.write.TestIndexWriter
Tests run: 3, Failures: 0, Errors: 0, Skipped: 0, Time elapsed: 0.056 sec - in org.apache.phoenix.hbase.index.covered.example.TestCoveredColumnIndexCodec
Running org.apache.phoenix.hbase.index.write.recovery.TestPerRegionIndexWriteCache
Tests run: 3, Failures: 0, Errors: 0, Skipped: 0, Time elapsed: 0.172 sec - in org.apache.phoenix.hbase.index.covered.TestLocalTableState
Running org.apache.phoenix.hbase.index.write.TestParalleWriterIndexCommitter
Tests run: 1, Failures: 0, Errors: 0, Skipped: 0, Time elapsed: 0.639 sec - in org.apache.phoenix.iterate.AggregateResultScannerTest
Running org.apache.phoenix.hbase.index.write.TestCachingHTableFactory
Tests run: 5, Failures: 0, Errors: 0, Skipped: 0, Time elapsed: 0.28 sec - in org.apache.phoenix.hbase.index.write.TestIndexWriter
Running org.apache.phoenix.hbase.index.write.TestWALRecoveryCaching
Tests run: 1, Failures: 0, Errors: 0, Skipped: 1, Time elapsed: 0.01 sec - in org.apache.phoenix.hbase.index.write.TestWALRecoveryCaching
Running org.apache.phoenix.hbase.index.write.TestParalleIndexWriter
Tests run: 2, Failures: 0, Errors: 0, Skipped: 0, Time elapsed: 0.078 sec - in org.apache.phoenix.hbase.index.write.TestParalleIndexWriter
Running org.apache.phoenix.memory.MemoryManagerTest
Tests run: 2, Failures: 0, Errors: 0, Skipped: 0, Time elapsed: 0.334 sec - in org.apache.phoenix.hbase.index.write.TestParalleWriterIndexCommitter
Running org.apache.phoenix.query.OrderByTest
Tests run: 6, Failures: 0, Errors: 0, Skipped: 3, Time elapsed: 0.046 sec - in org.apache.phoenix.memory.MemoryManagerTest
Running org.apache.phoenix.query.PhoenixStatsCacheRemovalListenerTest
Tests run: 1, Failures: 0, Errors: 0, Skipped: 0, Time elapsed: 0.006 sec - in org.apache.phoenix.query.PhoenixStatsCacheRemovalListenerTest
Running org.apache.phoenix.query.KeyRangeCoalesceTest
Tests run: 13, Failures: 0, Errors: 0, Skipped: 0, Time elapsed: 0.065 sec - in org.apache.phoenix.query.KeyRangeCoalesceTest
Running org.apache.phoenix.query.KeyRangeUnionTest
Tests run: 8, Failures: 0, Errors: 0, Skipped: 0, Time elapsed: 0.037 sec - in org.apache.phoenix.query.KeyRangeUnionTest
Running org.apache.phoenix.query.ConnectionlessTest
Tests run: 1, Failures: 0, Errors: 0, Skipped: 0, Time elapsed: 0.42 sec - in org.apache.phoenix.hbase.index.write.TestCachingHTableFactory
Running org.apache.phoenix.query.HBaseFactoryProviderTest
Tests run: 3, Failures: 0, Errors: 0, Skipped: 0, Time elapsed: 0.002 sec - in org.apache.phoenix.query.HBaseFactoryProviderTest
Running org.apache.phoenix.query.ScannerLeaseRenewalTest
Tests run: 144, Failures: 0, Errors: 0, Skipped: 0, Time elapsed: 1.943 sec - in org.apache.phoenix.compile.QueryCompilerTest
Running org.apache.phoenix.query.ParallelIteratorsSplitTest
Tests run: 3, Failures: 0, Errors: 0, Skipped: 0, Time elapsed: 0.945 sec - in org.apache.phoenix.hbase.index.write.recovery.TestPerRegionIndexWriteCache
Running org.apache.phoenix.query.KeyRangeIntersectTest
Tests run: 3, Failures: 0, Errors: 0, Skipped: 0, Time elapsed: 0.384 sec - in org.apache.phoenix.query.ConnectionlessTest
Running org.apache.phoenix.query.QueryPlanTest
Tests run: 8, Failures: 0, Errors: 0, Skipped: 0, Time elapsed: 0.037 sec - in org.apache.phoenix.query.KeyRangeIntersectTest
Running org.apache.hadoop.hbase.regionserver.PhoenixRpcSchedulerFactoryTest
Tests run: 4, Failures: 0, Errors: 0, Skipped: 0, Time elapsed: 0.622 sec - in org.apache.phoenix.query.OrderByTest
Running org.apache.hadoop.hbase.ipc.PhoenixIndexRpcSchedulerTest
Tests run: 2, Failures: 0, Errors: 0, Skipped: 0, Time elapsed: 0.039 sec - in org.apache.hadoop.hbase.regionserver.PhoenixRpcSchedulerFactoryTest
Tests run: 8, Failures: 0, Errors: 0, Skipped: 0, Time elapsed: 0.449 sec - in org.apache.phoenix.query.ParallelIteratorsSplitTest
Tests run: 5, Failures: 0, Errors: 0, Skipped: 0, Time elapsed: 0.585 sec - in org.apache.phoenix.query.QueryPlanTest
Tests run: 2, Failures: 0, Errors: 0, Skipped: 0, Time elapsed: 0.546 sec - in org.apache.hadoop.hbase.ipc.PhoenixIndexRpcSchedulerTest
Tests run: 2, Failures: 0, Errors: 0, Skipped: 0, Time elapsed: 5.628 sec - in org.apache.phoenix.query.ScannerLeaseRenewalTest
Tests run: 7, Failures: 0, Errors: 0, Skipped: 0, Time elapsed: 41.203 sec - in org.apache.phoenix.jdbc.SecureUserConnectionsTest

Results :

Failed tests: 
  MutationTest.testSizeConstraint:87

Tests run: 1430, Failures: 1, Errors: 0, Skipped: 6

[INFO] ------------------------------------------------------------------------
[INFO] Reactor Summary:
[INFO] 
[INFO] Apache Phoenix ..................................... SUCCESS [  3.914 s]
[INFO] Phoenix Core ....................................... FAILURE [01:43 min]
[INFO] Phoenix - Flume .................................... SKIPPED
[INFO] Phoenix - Pig ...................................... SKIPPED
[INFO] Phoenix Query Server Client ........................ SKIPPED
[INFO] Phoenix Query Server ............................... SKIPPED
[INFO] Phoenix - Pherf .................................... SKIPPED
[INFO] Phoenix - Spark .................................... SKIPPED
[INFO] Phoenix - Hive ..................................... SKIPPED
[INFO] Phoenix Client ..................................... SKIPPED
[INFO] Phoenix Server ..................................... SKIPPED
[INFO] Phoenix Assembly ................................... SKIPPED
[INFO] Phoenix - Tracing Web Application .................. SKIPPED
[INFO] ------------------------------------------------------------------------
[INFO] BUILD FAILURE
[INFO] ------------------------------------------------------------------------
[INFO] Total time: 01:50 min
[INFO] Finished at: 2016-10-28T10:10:00+00:00
[INFO] Final Memory: 80M/1348M
[INFO] ------------------------------------------------------------------------
[ERROR] Failed to execute goal org.apache.maven.plugins:maven-surefire-plugin:2.19.1:test
(default-test) on project phoenix-core: There are test failures.
[ERROR] 
[ERROR] Please refer to <https://builds.apache.org/job/Phoenix-master/ws/phoenix-core/target/surefire-reports>
for the individual test results.
[ERROR] -> [Help 1]
[ERROR] 
[ERROR] To see the full stack trace of the errors, re-run Maven with the -e switch.
[ERROR] Re-run Maven using the -X switch to enable full debug logging.
[ERROR] 
[ERROR] For more information about the errors and possible solutions, please read the following
articles:
[ERROR] [Help 1] http://cwiki.apache.org/confluence/display/MAVEN/MojoFailureException
[ERROR] 
[ERROR] After correcting the problems, you can resume the build with the command
[ERROR]   mvn <goals> -rf :phoenix-core
Build step 'Invoke top-level Maven targets' marked build as failure
Archiving artifacts
Compressed 658.20 MB of artifacts by 99.7% relative to #1455
Updating PHOENIX-3417
Updating PHOENIX-3396
Updating PHOENIX-3421
Recording test results

Mime
View raw message