phoenix-commits mailing list archives

Site index · List index
Message view « Date » · « Thread »
Top « Date » · « Thread »
From Apache Jenkins Server <jenk...@builds.apache.org>
Subject Build failed in Jenkins: Phoenix-4.x-HBase-1.1 #225
Date Wed, 12 Oct 2016 20:24:58 GMT
See <https://builds.apache.org/job/Phoenix-4.x-HBase-1.1/225/changes>

Changes:

[maryannxue] PHOENIX-3265 Double-quote column names that use reserved keywords (Eric

------------------------------------------
[...truncated 743 lines...]
testNestedSubqueries[2](org.apache.phoenix.end2end.HashJoinIT)  Time elapsed: 24.515 sec 
<<< ERROR!
org.apache.phoenix.schema.ColumnNotFoundException: ERROR 504 (42703): Undefined column. columnName=C."DATE"
	at org.apache.phoenix.end2end.HashJoinIT.testNestedSubqueries(HashJoinIT.java:3160)

testSubJoin[2](org.apache.phoenix.end2end.HashJoinIT)  Time elapsed: 23.091 sec  <<<
ERROR!
org.apache.phoenix.schema.ColumnNotFoundException: ERROR 504 (42703): Undefined column. columnName=C."DATE"
	at org.apache.phoenix.end2end.HashJoinIT.testSubJoin(HashJoinIT.java:2816)

Tests run: 6, Failures: 0, Errors: 0, Skipped: 0, Time elapsed: 33.885 sec - in org.apache.phoenix.end2end.index.ViewIndexIT
Running org.apache.phoenix.end2end.index.txn.RollbackIT
Running org.apache.phoenix.end2end.index.txn.MutableRollbackIT
Tests run: 8, Failures: 0, Errors: 0, Skipped: 0, Time elapsed: 41.211 sec - in org.apache.phoenix.end2end.index.txn.RollbackIT
Running org.apache.phoenix.end2end.salted.SaltedTableUpsertSelectIT
Tests run: 66, Failures: 0, Errors: 0, Skipped: 0, Time elapsed: 386.61 sec - in org.apache.phoenix.end2end.index.IndexExpressionIT
Tests run: 6, Failures: 0, Errors: 0, Skipped: 0, Time elapsed: 20.647 sec - in org.apache.phoenix.end2end.salted.SaltedTableUpsertSelectIT
Running org.apache.phoenix.end2end.salted.SaltedTableVarLengthRowKeyIT
Tests run: 1, Failures: 0, Errors: 0, Skipped: 0, Time elapsed: 1.294 sec - in org.apache.phoenix.end2end.salted.SaltedTableVarLengthRowKeyIT
Running org.apache.phoenix.iterate.PhoenixQueryTimeoutIT
Tests run: 2, Failures: 0, Errors: 0, Skipped: 0, Time elapsed: 3.949 sec - in org.apache.phoenix.iterate.PhoenixQueryTimeoutIT
Running org.apache.phoenix.iterate.RoundRobinResultIteratorIT
Tests run: 6, Failures: 0, Errors: 0, Skipped: 0, Time elapsed: 59.212 sec - in org.apache.phoenix.end2end.index.txn.MutableRollbackIT
Running org.apache.phoenix.rpc.UpdateCacheIT
Tests run: 7, Failures: 0, Errors: 0, Skipped: 0, Time elapsed: 22.636 sec - in org.apache.phoenix.rpc.UpdateCacheIT
Running org.apache.phoenix.trace.PhoenixTraceReaderIT
Tests run: 2, Failures: 0, Errors: 0, Skipped: 0, Time elapsed: 2.624 sec - in org.apache.phoenix.trace.PhoenixTraceReaderIT
Running org.apache.phoenix.trace.PhoenixTracingEndToEndIT
Running org.apache.phoenix.trace.PhoenixTableMetricsWriterIT
Tests run: 2, Failures: 0, Errors: 0, Skipped: 0, Time elapsed: 2.528 sec - in org.apache.phoenix.trace.PhoenixTableMetricsWriterIT
Running org.apache.phoenix.tx.FlappingTransactionIT
Tests run: 4, Failures: 0, Errors: 0, Skipped: 0, Time elapsed: 5.316 sec - in org.apache.phoenix.tx.FlappingTransactionIT
Running org.apache.phoenix.tx.TransactionIT
Tests run: 9, Failures: 0, Errors: 0, Skipped: 0, Time elapsed: 42.614 sec - in org.apache.phoenix.iterate.RoundRobinResultIteratorIT
Running org.apache.phoenix.tx.TxCheckpointIT
Tests run: 102, Failures: 0, Errors: 0, Skipped: 0, Time elapsed: 862.46 sec - in org.apache.phoenix.end2end.SortMergeJoinIT
Tests run: 6, Failures: 0, Errors: 0, Skipped: 0, Time elapsed: 85.011 sec - in org.apache.phoenix.trace.PhoenixTracingEndToEndIT
Tests run: 18, Failures: 0, Errors: 0, Skipped: 1, Time elapsed: 79.362 sec - in org.apache.phoenix.tx.TransactionIT
Tests run: 40, Failures: 0, Errors: 0, Skipped: 0, Time elapsed: 478.991 sec - in org.apache.phoenix.end2end.index.MutableIndexIT
Tests run: 20, Failures: 0, Errors: 0, Skipped: 0, Time elapsed: 116.949 sec - in org.apache.phoenix.tx.TxCheckpointIT
Tests run: 144, Failures: 0, Errors: 0, Skipped: 0, Time elapsed: 739.533 sec - in org.apache.phoenix.end2end.index.IndexIT

Results :

Tests in error: 
  HashJoinIT.testNestedSubqueries:3160 » ColumnNotFound ERROR 504 (42703): Undef...
  HashJoinIT.testNestedSubqueries:3160 » ColumnNotFound ERROR 504 (42703): Undef...
  HashJoinIT.testNestedSubqueries:3160 » ColumnNotFound ERROR 504 (42703): Undef...
  HashJoinIT.testSubJoin:2816 » ColumnNotFound ERROR 504 (42703): Undefined colu...
  HashJoinIT.testSubJoin:2816 » ColumnNotFound ERROR 504 (42703): Undefined colu...
  HashJoinIT.testSubJoin:2816 » ColumnNotFound ERROR 504 (42703): Undefined colu...

Tests run: 1554, Failures: 0, Errors: 6, Skipped: 1

[INFO] 
[INFO] --- maven-failsafe-plugin:2.19.1:integration-test (ClientManagedTimeTests) @ phoenix-core
---

-------------------------------------------------------
 T E S T S
-------------------------------------------------------
Running org.apache.phoenix.end2end.AggregateQueryIT
Running org.apache.phoenix.end2end.CaseStatementIT
Running org.apache.phoenix.end2end.ColumnProjectionOptimizationIT
Running org.apache.phoenix.end2end.CastAndCoerceIT
Running org.apache.phoenix.end2end.ClientTimeArithmeticQueryIT
Running org.apache.phoenix.end2end.ArrayIT
Tests run: 3, Failures: 0, Errors: 0, Skipped: 0, Time elapsed: 28.69 sec - in org.apache.phoenix.end2end.ColumnProjectionOptimizationIT
Running org.apache.phoenix.end2end.CreateSchemaIT
Tests run: 1, Failures: 0, Errors: 0, Skipped: 0, Time elapsed: 0.579 sec - in org.apache.phoenix.end2end.CreateSchemaIT
Running org.apache.phoenix.end2end.CreateTableIT
Tests run: 49, Failures: 0, Errors: 0, Skipped: 0, Time elapsed: 50.642 sec - in org.apache.phoenix.end2end.CastAndCoerceIT
Running org.apache.phoenix.end2end.CustomEntityDataIT
Tests run: 63, Failures: 0, Errors: 0, Skipped: 0, Time elapsed: 55.938 sec - in org.apache.phoenix.end2end.CaseStatementIT
Running org.apache.phoenix.end2end.DerivedTableIT
Tests run: 3, Failures: 0, Errors: 0, Skipped: 0, Time elapsed: 5.985 sec - in org.apache.phoenix.end2end.CustomEntityDataIT
Running org.apache.phoenix.end2end.DistinctCountIT
Tests run: 49, Failures: 0, Errors: 0, Skipped: 0, Time elapsed: 71.414 sec - in org.apache.phoenix.end2end.AggregateQueryIT
Running org.apache.phoenix.end2end.DropSchemaIT
Tests run: 18, Failures: 0, Errors: 0, Skipped: 0, Time elapsed: 17.989 sec - in org.apache.phoenix.end2end.DerivedTableIT
Running org.apache.phoenix.end2end.ExtendedQueryExecIT
Tests run: 10, Failures: 0, Errors: 0, Skipped: 0, Time elapsed: 19.524 sec - in org.apache.phoenix.end2end.DistinctCountIT
Running org.apache.phoenix.end2end.FunkyNamesIT
Tests run: 4, Failures: 0, Errors: 0, Skipped: 0, Time elapsed: 6.761 sec - in org.apache.phoenix.end2end.ExtendedQueryExecIT
Running org.apache.phoenix.end2end.GroupByIT
Tests run: 2, Failures: 0, Errors: 0, Skipped: 0, Time elapsed: 10.874 sec - in org.apache.phoenix.end2end.DropSchemaIT
Tests run: 3, Failures: 0, Errors: 0, Skipped: 0, Time elapsed: 5.262 sec - in org.apache.phoenix.end2end.FunkyNamesIT
Running org.apache.phoenix.end2end.NotQueryIT
Running org.apache.phoenix.end2end.NativeHBaseTypesIT
Tests run: 7, Failures: 0, Errors: 0, Skipped: 0, Time elapsed: 4.881 sec - in org.apache.phoenix.end2end.NativeHBaseTypesIT
Running org.apache.phoenix.end2end.PointInTimeQueryIT
Tests run: 79, Failures: 0, Errors: 0, Skipped: 0, Time elapsed: 94.023 sec - in org.apache.phoenix.end2end.ArrayIT
Running org.apache.phoenix.end2end.ProductMetricsIT
Tests run: 14, Failures: 0, Errors: 0, Skipped: 0, Time elapsed: 27.941 sec - in org.apache.phoenix.end2end.PointInTimeQueryIT
Running org.apache.phoenix.end2end.QueryDatabaseMetaDataIT
Tests run: 15, Failures: 0, Errors: 0, Skipped: 0, Time elapsed: 96.671 sec - in org.apache.phoenix.end2end.CreateTableIT
Running org.apache.phoenix.end2end.QueryIT
Tests run: 61, Failures: 0, Errors: 0, Skipped: 0, Time elapsed: 31.414 sec - in org.apache.phoenix.end2end.ProductMetricsIT
Running org.apache.phoenix.end2end.ReadIsolationLevelIT
Tests run: 77, Failures: 0, Errors: 0, Skipped: 0, Time elapsed: 47.512 sec - in org.apache.phoenix.end2end.NotQueryIT
Running org.apache.phoenix.end2end.RowValueConstructorIT
Tests run: 2, Failures: 0, Errors: 0, Skipped: 0, Time elapsed: 6.366 sec - in org.apache.phoenix.end2end.ReadIsolationLevelIT
Running org.apache.phoenix.end2end.ScanQueryIT
Tests run: 105, Failures: 0, Errors: 0, Skipped: 0, Time elapsed: 66.333 sec - in org.apache.phoenix.end2end.GroupByIT
Tests run: 245, Failures: 0, Errors: 0, Skipped: 0, Time elapsed: 148.076 sec - in org.apache.phoenix.end2end.ClientTimeArithmeticQueryIT
Running org.apache.phoenix.end2end.SequenceBulkAllocationIT
Running org.apache.phoenix.end2end.SequenceIT
Tests run: 119, Failures: 0, Errors: 0, Skipped: 0, Time elapsed: 66.407 sec - in org.apache.phoenix.end2end.ScanQueryIT
Tests run: 126, Failures: 0, Errors: 0, Skipped: 0, Time elapsed: 74.262 sec - in org.apache.phoenix.end2end.QueryIT
Running org.apache.phoenix.end2end.ToNumberFunctionIT
Tests run: 56, Failures: 0, Errors: 0, Skipped: 0, Time elapsed: 31.047 sec - in org.apache.phoenix.end2end.SequenceBulkAllocationIT
Running org.apache.phoenix.end2end.TruncateFunctionIT
Tests run: 18, Failures: 0, Errors: 0, Skipped: 0, Time elapsed: 8.422 sec - in org.apache.phoenix.end2end.ToNumberFunctionIT
Tests run: 1, Failures: 0, Errors: 0, Skipped: 0, Time elapsed: 5.825 sec - in org.apache.phoenix.end2end.TruncateFunctionIT
Running org.apache.phoenix.end2end.UpsertSelectIT
Tests run: 54, Failures: 0, Errors: 0, Skipped: 0, Time elapsed: 48.164 sec - in org.apache.phoenix.end2end.SequenceIT
Running org.apache.phoenix.end2end.VariableLengthPKIT
Running org.apache.phoenix.end2end.TopNIT
Tests run: 4, Failures: 0, Errors: 0, Skipped: 0, Time elapsed: 5.428 sec - in org.apache.phoenix.end2end.TopNIT
Running org.apache.phoenix.end2end.salted.SaltedTableIT
Tests run: 8, Failures: 0, Errors: 0, Skipped: 0, Time elapsed: 7.071 sec - in org.apache.phoenix.end2end.salted.SaltedTableIT
Running org.apache.phoenix.rpc.UpdateCacheWithScnIT
Running org.apache.phoenix.end2end.UpsertValuesIT
Tests run: 1, Failures: 0, Errors: 0, Skipped: 0, Time elapsed: 6.367 sec - in org.apache.phoenix.rpc.UpdateCacheWithScnIT
Tests run: 19, Failures: 0, Errors: 0, Skipped: 0, Time elapsed: 124.31 sec - in org.apache.phoenix.end2end.QueryDatabaseMetaDataIT
Tests run: 46, Failures: 0, Errors: 0, Skipped: 0, Time elapsed: 119.946 sec - in org.apache.phoenix.end2end.RowValueConstructorIT
Tests run: 50, Failures: 0, Errors: 0, Skipped: 0, Time elapsed: 40.553 sec - in org.apache.phoenix.end2end.VariableLengthPKIT
Tests run: 20, Failures: 0, Errors: 0, Skipped: 0, Time elapsed: 123.932 sec - in org.apache.phoenix.end2end.UpsertSelectIT
Tests run: 24, Failures: 0, Errors: 0, Skipped: 0, Time elapsed: 101.605 sec - in org.apache.phoenix.end2end.UpsertValuesIT

Results :

Tests run: 1356, Failures: 0, Errors: 0, Skipped: 0

[INFO] 
[INFO] --- maven-failsafe-plugin:2.19.1:integration-test (HBaseManagedTimeTests) @ phoenix-core
---

-------------------------------------------------------
 T E S T S
-------------------------------------------------------

Results :

Tests run: 0, Failures: 0, Errors: 0, Skipped: 0

[INFO] 
[INFO] --- maven-failsafe-plugin:2.19.1:integration-test (NeedTheirOwnClusterTests) @ phoenix-core
---

-------------------------------------------------------
 T E S T S
-------------------------------------------------------
Running org.apache.hadoop.hbase.regionserver.wal.WALReplayWithIndexWritesAndCompressedWALIT
Running org.apache.phoenix.end2end.ConnectionUtilIT
Tests run: 1, Failures: 0, Errors: 0, Skipped: 0, Time elapsed: 38.381 sec - in org.apache.hadoop.hbase.regionserver.wal.WALReplayWithIndexWritesAndCompressedWALIT
Running org.apache.phoenix.end2end.CsvBulkLoadToolIT
Running org.apache.phoenix.end2end.ContextClassloaderIT
Running org.apache.phoenix.end2end.CountDistinctCompressionIT
Tests run: 3, Failures: 0, Errors: 0, Skipped: 0, Time elapsed: 12.007 sec - in org.apache.phoenix.end2end.ContextClassloaderIT
Tests run: 1, Failures: 0, Errors: 0, Skipped: 0, Time elapsed: 28.406 sec - in org.apache.phoenix.end2end.ConnectionUtilIT
Tests run: 1, Failures: 0, Errors: 0, Skipped: 0, Time elapsed: 12.793 sec - in org.apache.phoenix.end2end.CountDistinctCompressionIT
Running org.apache.phoenix.end2end.IndexExtendedIT
Running org.apache.phoenix.end2end.QueryTimeoutIT
Running org.apache.phoenix.end2end.QueryWithLimitIT
Running org.apache.phoenix.end2end.RenewLeaseIT
Tests run: 2, Failures: 0, Errors: 0, Skipped: 0, Time elapsed: 12.67 sec - in org.apache.phoenix.end2end.QueryTimeoutIT
Tests run: 2, Failures: 0, Errors: 0, Skipped: 0, Time elapsed: 12.241 sec - in org.apache.phoenix.end2end.QueryWithLimitIT
Tests run: 1, Failures: 0, Errors: 0, Skipped: 0, Time elapsed: 13.202 sec - in org.apache.phoenix.end2end.RenewLeaseIT
Running org.apache.phoenix.end2end.SpillableGroupByIT
Tests run: 10, Failures: 0, Errors: 0, Skipped: 0, Time elapsed: 73.83 sec - in org.apache.phoenix.end2end.CsvBulkLoadToolIT
Tests run: 2, Failures: 0, Errors: 0, Skipped: 0, Time elapsed: 14.981 sec - in org.apache.phoenix.end2end.SpillableGroupByIT
Running org.apache.phoenix.end2end.index.ImmutableIndexIT
Running org.apache.phoenix.end2end.UserDefinedFunctionsIT
Running org.apache.phoenix.end2end.index.MutableIndexFailureIT
Running org.apache.phoenix.end2end.index.ReadOnlyIndexFailureIT
Running org.apache.phoenix.end2end.index.MutableIndexReplicationIT
Tests run: 1, Failures: 0, Errors: 0, Skipped: 0, Time elapsed: 25.974 sec - in org.apache.phoenix.end2end.index.MutableIndexReplicationIT
Tests run: 14, Failures: 0, Errors: 0, Skipped: 0, Time elapsed: 41.167 sec - in org.apache.phoenix.end2end.UserDefinedFunctionsIT
Tests run: 2, Failures: 0, Errors: 0, Skipped: 0, Time elapsed: 33.013 sec - in org.apache.phoenix.end2end.index.ReadOnlyIndexFailureIT
Running org.apache.phoenix.hbase.index.FailForUnsupportedHBaseVersionsIT
Tests run: 2, Failures: 0, Errors: 0, Skipped: 0, Time elapsed: 21.393 sec - in org.apache.phoenix.hbase.index.FailForUnsupportedHBaseVersionsIT
Running org.apache.phoenix.end2end.index.txn.TxWriteFailureIT
Running org.apache.phoenix.hbase.index.covered.EndToEndCoveredColumnsIndexBuilderIT
Running org.apache.phoenix.execute.PartialCommitIT
Tests run: 2, Failures: 0, Errors: 0, Skipped: 0, Time elapsed: 18.936 sec - in org.apache.phoenix.hbase.index.covered.EndToEndCoveredColumnsIndexBuilderIT
Tests run: 12, Failures: 0, Errors: 0, Skipped: 0, Time elapsed: 9.557 sec - in org.apache.phoenix.execute.PartialCommitIT
Tests run: 8, Failures: 0, Errors: 0, Skipped: 0, Time elapsed: 33.287 sec - in org.apache.phoenix.end2end.index.txn.TxWriteFailureIT
Running org.apache.phoenix.hbase.index.covered.example.FailWithoutRetriesIT
Tests run: 1, Failures: 0, Errors: 0, Skipped: 0, Time elapsed: 8.325 sec - in org.apache.phoenix.hbase.index.covered.example.FailWithoutRetriesIT
Running org.apache.phoenix.hbase.index.covered.example.EndToEndCoveredIndexingIT
Running org.apache.phoenix.hbase.index.covered.example.EndtoEndIndexingWithCompressionIT
Tests run: 12, Failures: 0, Errors: 0, Skipped: 0, Time elapsed: 144.595 sec - in org.apache.phoenix.end2end.index.ImmutableIndexIT
Running org.apache.phoenix.iterate.RoundRobinResultIteratorWithStatsIT
Running org.apache.phoenix.iterate.ScannerLeaseRenewalIT
Tests run: 1, Failures: 0, Errors: 0, Skipped: 0, Time elapsed: 14.579 sec - in org.apache.phoenix.iterate.RoundRobinResultIteratorWithStatsIT
Tests run: 80, Failures: 0, Errors: 0, Skipped: 0, Time elapsed: 263.894 sec - in org.apache.phoenix.end2end.IndexExtendedIT
Running org.apache.phoenix.monitoring.PhoenixMetricsIT
Running org.apache.phoenix.rpc.PhoenixClientRpcIT
Tests run: 2, Failures: 0, Errors: 0, Skipped: 0, Time elapsed: 4.827 sec - in org.apache.phoenix.rpc.PhoenixClientRpcIT
Running org.apache.phoenix.rpc.PhoenixServerRpcIT
Tests run: 1, Failures: 0, Errors: 0, Skipped: 0, Time elapsed: 14.758 sec - in org.apache.phoenix.rpc.PhoenixServerRpcIT
Tests run: 18, Failures: 0, Errors: 0, Skipped: 0, Time elapsed: 54.547 sec - in org.apache.phoenix.monitoring.PhoenixMetricsIT
Tests run: 11, Failures: 0, Errors: 0, Skipped: 0, Time elapsed: 123.149 sec - in org.apache.phoenix.hbase.index.covered.example.EndtoEndIndexingWithCompressionIT
Tests run: 11, Failures: 0, Errors: 0, Skipped: 0, Time elapsed: 124.047 sec - in org.apache.phoenix.hbase.index.covered.example.EndToEndCoveredIndexingIT
Tests run: 2, Failures: 0, Errors: 0, Skipped: 0, Time elapsed: 165.487 sec - in org.apache.phoenix.iterate.ScannerLeaseRenewalIT
Tests run: 8, Failures: 0, Errors: 0, Skipped: 0, Time elapsed: 3,732.573 sec - in org.apache.phoenix.end2end.index.MutableIndexFailureIT

Results :

Tests run: 211, Failures: 0, Errors: 0, Skipped: 0

[INFO] 
[INFO] --- maven-failsafe-plugin:2.19.1:verify (ParallelStatsEnabledTest) @ phoenix-core ---
[INFO] ------------------------------------------------------------------------
[INFO] Reactor Summary:
[INFO] 
[INFO] Apache Phoenix ..................................... SUCCESS [  2.014 s]
[INFO] Phoenix Core ....................................... FAILURE [  01:41 h]
[INFO] Phoenix - Flume .................................... SKIPPED
[INFO] Phoenix - Pig ...................................... SKIPPED
[INFO] Phoenix Query Server Client ........................ SKIPPED
[INFO] Phoenix Query Server ............................... SKIPPED
[INFO] Phoenix - Pherf .................................... SKIPPED
[INFO] Phoenix - Spark .................................... SKIPPED
[INFO] Phoenix - Hive ..................................... SKIPPED
[INFO] Phoenix Client ..................................... SKIPPED
[INFO] Phoenix Server ..................................... SKIPPED
[INFO] Phoenix Assembly ................................... SKIPPED
[INFO] Phoenix - Tracing Web Application .................. SKIPPED
[INFO] ------------------------------------------------------------------------
[INFO] BUILD FAILURE
[INFO] ------------------------------------------------------------------------
[INFO] Total time: 01:41 h
[INFO] Finished at: 2016-10-12T20:20:08+00:00
[INFO] Final Memory: 62M/1148M
[INFO] ------------------------------------------------------------------------
[ERROR] Failed to execute goal org.apache.maven.plugins:maven-failsafe-plugin:2.19.1:verify
(ParallelStatsEnabledTest) on project phoenix-core: There are test failures.
[ERROR] 
[ERROR] Please refer to <https://builds.apache.org/job/Phoenix-4.x-HBase-1.1/ws/phoenix-core/target/failsafe-reports>
for the individual test results.
[ERROR] -> [Help 1]
[ERROR] 
[ERROR] To see the full stack trace of the errors, re-run Maven with the -e switch.
[ERROR] Re-run Maven using the -X switch to enable full debug logging.
[ERROR] 
[ERROR] For more information about the errors and possible solutions, please read the following
articles:
[ERROR] [Help 1] http://cwiki.apache.org/confluence/display/MAVEN/MojoFailureException
[ERROR] 
[ERROR] After correcting the problems, you can resume the build with the command
[ERROR]   mvn <goals> -rf :phoenix-core
Build step 'Invoke top-level Maven targets' marked build as failure
Archiving artifacts
Compressed 1.04 GB of artifacts by 60.9% relative to #224
Recording test results

Mime
View raw message