phoenix-commits mailing list archives

Site index · List index
Message view « Date » · « Thread »
Top « Date » · « Thread »
From Apache Jenkins Server <jenk...@builds.apache.org>
Subject Build failed in Jenkins: Phoenix-4.x-HBase-1.1 #203
Date Tue, 20 Sep 2016 04:20:32 GMT
See <https://builds.apache.org/job/Phoenix-4.x-HBase-1.1/203/changes>

Changes:

[samarth] PHOENIX-3174 Make minor upgrade a manual step

------------------------------------------
[...truncated 710 lines...]
Running org.apache.phoenix.tx.TransactionIT
Tests run: 36, Failures: 0, Errors: 0, Skipped: 0, Time elapsed: 283.755 sec - in org.apache.phoenix.end2end.index.LocalIndexIT
Running org.apache.phoenix.tx.TxCheckpointIT
Tests run: 22, Failures: 0, Errors: 0, Skipped: 1, Time elapsed: 103.505 sec - in org.apache.phoenix.tx.TransactionIT
Tests run: 28, Failures: 0, Errors: 0, Skipped: 0, Time elapsed: 656.158 sec - in org.apache.phoenix.end2end.InListIT
Tests run: 66, Failures: 0, Errors: 0, Skipped: 0, Time elapsed: 449.104 sec - in org.apache.phoenix.end2end.index.IndexExpressionIT
Tests run: 20, Failures: 0, Errors: 0, Skipped: 0, Time elapsed: 136.672 sec - in org.apache.phoenix.tx.TxCheckpointIT
Tests run: 40, Failures: 0, Errors: 0, Skipped: 0, Time elapsed: 526.044 sec - in org.apache.phoenix.end2end.index.MutableIndexIT

Results :

Tests run: 1173, Failures: 0, Errors: 0, Skipped: 5

[INFO] 
[INFO] --- maven-failsafe-plugin:2.19.1:integration-test (ClientManagedTimeTests) @ phoenix-core
---

-------------------------------------------------------
 T E S T S
-------------------------------------------------------
Running org.apache.phoenix.end2end.CaseStatementIT
Running org.apache.phoenix.end2end.CastAndCoerceIT
Running org.apache.phoenix.end2end.CreateSchemaIT
Running org.apache.phoenix.end2end.AggregateQueryIT
Tests run: 1, Failures: 0, Errors: 0, Skipped: 0, Time elapsed: 0.747 sec - in org.apache.phoenix.end2end.CreateSchemaIT
Running org.apache.phoenix.end2end.ColumnProjectionOptimizationIT
Running org.apache.phoenix.end2end.ClientTimeArithmeticQueryIT
Running org.apache.phoenix.end2end.CreateTableIT
Running org.apache.phoenix.end2end.ArrayIT
Tests run: 3, Failures: 0, Errors: 0, Skipped: 0, Time elapsed: 29.807 sec - in org.apache.phoenix.end2end.ColumnProjectionOptimizationIT
Running org.apache.phoenix.end2end.CustomEntityDataIT
Tests run: 3, Failures: 0, Errors: 0, Skipped: 0, Time elapsed: 8.271 sec - in org.apache.phoenix.end2end.CustomEntityDataIT
Running org.apache.phoenix.end2end.DerivedTableIT
Tests run: 49, Failures: 0, Errors: 0, Skipped: 0, Time elapsed: 55.872 sec - in org.apache.phoenix.end2end.CastAndCoerceIT
Running org.apache.phoenix.end2end.DistinctCountIT
Tests run: 63, Failures: 0, Errors: 0, Skipped: 0, Time elapsed: 67.98 sec - in org.apache.phoenix.end2end.CaseStatementIT
Running org.apache.phoenix.end2end.DropSchemaIT
Tests run: 18, Failures: 0, Errors: 0, Skipped: 0, Time elapsed: 30.597 sec - in org.apache.phoenix.end2end.DerivedTableIT
Running org.apache.phoenix.end2end.ExtendedQueryExecIT
Tests run: 10, Failures: 0, Errors: 0, Skipped: 0, Time elapsed: 20.703 sec - in org.apache.phoenix.end2end.DistinctCountIT
Running org.apache.phoenix.end2end.FunkyNamesIT
Tests run: 2, Failures: 0, Errors: 0, Skipped: 0, Time elapsed: 11.394 sec - in org.apache.phoenix.end2end.DropSchemaIT
Running org.apache.phoenix.end2end.GroupByIT
Tests run: 4, Failures: 0, Errors: 0, Skipped: 0, Time elapsed: 7.471 sec - in org.apache.phoenix.end2end.ExtendedQueryExecIT
Tests run: 3, Failures: 0, Errors: 0, Skipped: 0, Time elapsed: 5.72 sec - in org.apache.phoenix.end2end.FunkyNamesIT
Running org.apache.phoenix.end2end.NotQueryIT
Tests run: 49, Failures: 0, Errors: 0, Skipped: 0, Time elapsed: 83.577 sec - in org.apache.phoenix.end2end.AggregateQueryIT
Running org.apache.phoenix.end2end.PointInTimeQueryIT
Running org.apache.phoenix.end2end.NativeHBaseTypesIT
Tests run: 7, Failures: 0, Errors: 0, Skipped: 0, Time elapsed: 5.924 sec - in org.apache.phoenix.end2end.NativeHBaseTypesIT
Running org.apache.phoenix.end2end.ProductMetricsIT
Tests run: 15, Failures: 0, Errors: 0, Skipped: 0, Time elapsed: 98.301 sec - in org.apache.phoenix.end2end.CreateTableIT
Running org.apache.phoenix.end2end.QueryDatabaseMetaDataIT
Tests run: 79, Failures: 0, Errors: 0, Skipped: 0, Time elapsed: 107.054 sec - in org.apache.phoenix.end2end.ArrayIT
Running org.apache.phoenix.end2end.QueryIT
Tests run: 14, Failures: 0, Errors: 0, Skipped: 0, Time elapsed: 28.281 sec - in org.apache.phoenix.end2end.PointInTimeQueryIT
Running org.apache.phoenix.end2end.ReadIsolationLevelIT
Tests run: 2, Failures: 0, Errors: 0, Skipped: 0, Time elapsed: 6.081 sec - in org.apache.phoenix.end2end.ReadIsolationLevelIT
Running org.apache.phoenix.end2end.RowValueConstructorIT
Tests run: 61, Failures: 0, Errors: 0, Skipped: 0, Time elapsed: 43.612 sec - in org.apache.phoenix.end2end.ProductMetricsIT
Running org.apache.phoenix.end2end.ScanQueryIT
Tests run: 77, Failures: 0, Errors: 0, Skipped: 0, Time elapsed: 74.948 sec - in org.apache.phoenix.end2end.NotQueryIT
Running org.apache.phoenix.end2end.SequenceBulkAllocationIT
Tests run: 105, Failures: 0, Errors: 0, Skipped: 0, Time elapsed: 108.959 sec - in org.apache.phoenix.end2end.GroupByIT
Running org.apache.phoenix.end2end.SequenceIT
Tests run: 56, Failures: 0, Errors: 0, Skipped: 0, Time elapsed: 56.943 sec - in org.apache.phoenix.end2end.SequenceBulkAllocationIT
Running org.apache.phoenix.end2end.ToNumberFunctionIT
Tests run: 18, Failures: 0, Errors: 0, Skipped: 0, Time elapsed: 12.234 sec - in org.apache.phoenix.end2end.ToNumberFunctionIT
Running org.apache.phoenix.end2end.TopNIT
Tests run: 126, Failures: 0, Errors: 0, Skipped: 0, Time elapsed: 124.773 sec - in org.apache.phoenix.end2end.QueryIT
Running org.apache.phoenix.end2end.TruncateFunctionIT
Tests run: 4, Failures: 0, Errors: 0, Skipped: 0, Time elapsed: 7.734 sec - in org.apache.phoenix.end2end.TopNIT
Tests run: 245, Failures: 0, Errors: 0, Skipped: 0, Time elapsed: 235.609 sec - in org.apache.phoenix.end2end.ClientTimeArithmeticQueryIT
Running org.apache.phoenix.end2end.UpsertSelectIT
Running org.apache.phoenix.end2end.UpsertValuesIT
Tests run: 1, Failures: 0, Errors: 0, Skipped: 0, Time elapsed: 5.543 sec - in org.apache.phoenix.end2end.TruncateFunctionIT
Running org.apache.phoenix.end2end.VariableLengthPKIT
Tests run: 119, Failures: 0, Errors: 0, Skipped: 0, Time elapsed: 106.29 sec - in org.apache.phoenix.end2end.ScanQueryIT
Running org.apache.phoenix.end2end.salted.SaltedTableIT
Tests run: 19, Failures: 0, Errors: 0, Skipped: 0, Time elapsed: 146.011 sec - in org.apache.phoenix.end2end.QueryDatabaseMetaDataIT
Running org.apache.phoenix.rpc.UpdateCacheWithScnIT
Tests run: 54, Failures: 0, Errors: 0, Skipped: 0, Time elapsed: 62.053 sec - in org.apache.phoenix.end2end.SequenceIT
Tests run: 1, Failures: 0, Errors: 0, Skipped: 0, Time elapsed: 6.488 sec - in org.apache.phoenix.rpc.UpdateCacheWithScnIT
Tests run: 46, Failures: 0, Errors: 0, Skipped: 0, Time elapsed: 134.005 sec - in org.apache.phoenix.end2end.RowValueConstructorIT
Tests run: 8, Failures: 0, Errors: 0, Skipped: 0, Time elapsed: 10.068 sec - in org.apache.phoenix.end2end.salted.SaltedTableIT
Tests run: 50, Failures: 0, Errors: 0, Skipped: 0, Time elapsed: 60.881 sec - in org.apache.phoenix.end2end.VariableLengthPKIT
Tests run: 24, Failures: 0, Errors: 0, Skipped: 0, Time elapsed: 117.762 sec - in org.apache.phoenix.end2end.UpsertValuesIT
Tests run: 20, Failures: 0, Errors: 0, Skipped: 0, Time elapsed: 147.653 sec - in org.apache.phoenix.end2end.UpsertSelectIT

Results :

Tests run: 1356, Failures: 0, Errors: 0, Skipped: 0

[INFO] 
[INFO] --- maven-failsafe-plugin:2.19.1:integration-test (HBaseManagedTimeTests) @ phoenix-core
---

-------------------------------------------------------
 T E S T S
-------------------------------------------------------
Running org.apache.phoenix.end2end.SortMergeJoinIT
Running org.apache.phoenix.end2end.SpooledSortMergeJoinIT
Running org.apache.phoenix.end2end.SubqueryIT
Running org.apache.phoenix.end2end.HashJoinIT
Running org.apache.phoenix.end2end.HashJoinLocalIndexIT
Running org.apache.phoenix.end2end.SubqueryUsingSortMergeJoinIT
Running org.apache.phoenix.end2end.UpgradeIT
Tests run: 1, Failures: 0, Errors: 0, Skipped: 0, Time elapsed: 54.097 sec - in org.apache.phoenix.end2end.HashJoinLocalIndexIT
Tests run: 15, Failures: 0, Errors: 0, Skipped: 0, Time elapsed: 136.512 sec - in org.apache.phoenix.end2end.SubqueryUsingSortMergeJoinIT
Tests run: 21, Failures: 0, Errors: 0, Skipped: 0, Time elapsed: 155.228 sec - in org.apache.phoenix.end2end.SubqueryIT
Tests run: 99, Failures: 0, Errors: 0, Skipped: 0, Time elapsed: 282.598 sec - in org.apache.phoenix.end2end.HashJoinIT
Tests run: 102, Failures: 0, Errors: 0, Skipped: 0, Time elapsed: 293.23 sec - in org.apache.phoenix.end2end.SortMergeJoinIT
Tests run: 102, Failures: 0, Errors: 0, Skipped: 0, Time elapsed: 298.282 sec - in org.apache.phoenix.end2end.SpooledSortMergeJoinIT
Tests run: 11, Failures: 0, Errors: 0, Skipped: 0, Time elapsed: 436.131 sec - in org.apache.phoenix.end2end.UpgradeIT

Results :

Tests run: 351, Failures: 0, Errors: 0, Skipped: 0

[INFO] 
[INFO] --- maven-failsafe-plugin:2.19.1:integration-test (NeedTheirOwnClusterTests) @ phoenix-core
---

-------------------------------------------------------
 T E S T S
-------------------------------------------------------
Running org.apache.hadoop.hbase.regionserver.wal.WALReplayWithIndexWritesAndUncompressedWALInHBase_094_9_IT
Running org.apache.hadoop.hbase.regionserver.wal.WALReplayWithIndexWritesAndCompressedWALIT
Tests run: 1, Failures: 0, Errors: 0, Skipped: 0, Time elapsed: 74.065 sec - in org.apache.hadoop.hbase.regionserver.wal.WALReplayWithIndexWritesAndUncompressedWALInHBase_094_9_IT
Running org.apache.phoenix.coprocessor.StatisticsCollectionRunTrackerIT
Tests run: 1, Failures: 0, Errors: 0, Skipped: 0, Time elapsed: 78.321 sec - in org.apache.hadoop.hbase.regionserver.wal.WALReplayWithIndexWritesAndCompressedWALIT
Running org.apache.phoenix.end2end.ConnectionUtilIT
Running org.apache.phoenix.end2end.CountDistinctCompressionIT
Running org.apache.phoenix.end2end.ContextClassloaderIT
Tests run: 4, Failures: 0, Errors: 0, Skipped: 0, Time elapsed: 38.645 sec - in org.apache.phoenix.coprocessor.StatisticsCollectionRunTrackerIT
Running org.apache.phoenix.end2end.CsvBulkLoadToolIT
Tests run: 1, Failures: 0, Errors: 0, Skipped: 0, Time elapsed: 35.772 sec - in org.apache.phoenix.end2end.ConnectionUtilIT
Tests run: 1, Failures: 0, Errors: 0, Skipped: 0, Time elapsed: 13.904 sec - in org.apache.phoenix.end2end.CountDistinctCompressionIT
Tests run: 3, Failures: 0, Errors: 0, Skipped: 0, Time elapsed: 14.197 sec - in org.apache.phoenix.end2end.ContextClassloaderIT
Running org.apache.phoenix.end2end.IndexExtendedIT
Running org.apache.phoenix.end2end.KeyOnlyIT
Running org.apache.phoenix.end2end.MultiCfQueryExecIT
Running org.apache.phoenix.end2end.ParallelIteratorsIT
Tests run: 3, Failures: 0, Errors: 0, Skipped: 0, Time elapsed: 23.725 sec - in org.apache.phoenix.end2end.KeyOnlyIT
Running org.apache.phoenix.end2end.QueryWithLimitIT
Running org.apache.phoenix.end2end.QueryTimeoutIT
Tests run: 9, Failures: 0, Errors: 0, Skipped: 0, Time elapsed: 43.601 sec - in org.apache.phoenix.end2end.MultiCfQueryExecIT
Tests run: 3, Failures: 0, Errors: 0, Skipped: 0, Time elapsed: 49.281 sec - in org.apache.phoenix.end2end.ParallelIteratorsIT
Tests run: 2, Failures: 0, Errors: 0, Skipped: 0, Time elapsed: 25.188 sec - in org.apache.phoenix.end2end.QueryWithLimitIT
Tests run: 10, Failures: 0, Errors: 0, Skipped: 0, Time elapsed: 167.686 sec - in org.apache.phoenix.end2end.CsvBulkLoadToolIT
Tests run: 2, Failures: 0, Errors: 0, Skipped: 0, Time elapsed: 47.501 sec - in org.apache.phoenix.end2end.QueryTimeoutIT
Running org.apache.phoenix.end2end.QueryWithOffsetIT
Running org.apache.phoenix.end2end.RenewLeaseIT
Running org.apache.phoenix.end2end.SaltedViewIT
Tests run: 8, Failures: 0, Errors: 0, Skipped: 0, Time elapsed: 19.303 sec - in org.apache.phoenix.end2end.QueryWithOffsetIT
Tests run: 1, Failures: 0, Errors: 0, Skipped: 0, Time elapsed: 9.792 sec - in org.apache.phoenix.end2end.RenewLeaseIT
Running org.apache.phoenix.end2end.SpillableGroupByIT
Running org.apache.phoenix.end2end.StatsCollectorIT
Running org.apache.phoenix.end2end.StatsCollectionDisabledIT
Tests run: 1, Failures: 0, Errors: 0, Skipped: 0, Time elapsed: 8.74 sec - in org.apache.phoenix.end2end.StatsCollectionDisabledIT
Tests run: 1, Failures: 0, Errors: 0, Skipped: 0, Time elapsed: 19.935 sec - in org.apache.phoenix.end2end.SpillableGroupByIT
Running org.apache.phoenix.end2end.StatsCollectorWithSplitsAndMultiCFIT
Tests run: 4, Failures: 0, Errors: 0, Skipped: 0, Time elapsed: 50.894 sec - in org.apache.phoenix.end2end.SaltedViewIT
Tests run: 2, Failures: 0, Errors: 0, Skipped: 0, Time elapsed: 18.282 sec - in org.apache.phoenix.end2end.StatsCollectorWithSplitsAndMultiCFIT
Running org.apache.phoenix.end2end.TenantSpecificTablesDDLIT
Running org.apache.phoenix.end2end.TenantSpecificTablesDMLIT
Running org.apache.phoenix.end2end.TransactionalViewIT
Tests run: 2, Failures: 0, Errors: 0, Skipped: 0, Time elapsed: 18.5 sec - in org.apache.phoenix.end2end.TransactionalViewIT
Running org.apache.phoenix.end2end.ViewIT
Tests run: 16, Failures: 0, Errors: 0, Skipped: 0, Time elapsed: 39.297 sec - in org.apache.phoenix.end2end.TenantSpecificTablesDMLIT
Tests run: 17, Failures: 0, Errors: 0, Skipped: 0, Time elapsed: 49.849 sec - in org.apache.phoenix.end2end.TenantSpecificTablesDDLIT
Running org.apache.phoenix.end2end.UserDefinedFunctionsIT
Running org.apache.phoenix.end2end.index.ImmutableIndexWithStatsIT
Tests run: 16, Failures: 0, Errors: 0, Skipped: 0, Time elapsed: 150.774 sec - in org.apache.phoenix.end2end.StatsCollectorIT
Tests run: 1, Failures: 0, Errors: 0, Skipped: 0, Time elapsed: 9.366 sec - in org.apache.phoenix.end2end.index.ImmutableIndexWithStatsIT
Tests run: 14, Failures: 0, Errors: 0, Skipped: 0, Time elapsed: 50.284 sec - in org.apache.phoenix.end2end.UserDefinedFunctionsIT
Running org.apache.phoenix.end2end.index.MutableIndexFailureIT
Running org.apache.phoenix.end2end.index.MutableIndexReplicationIT
Running org.apache.phoenix.end2end.index.ReadOnlyIndexFailureIT
Tests run: 1, Failures: 0, Errors: 0, Skipped: 0, Time elapsed: 33.999 sec - in org.apache.phoenix.end2end.index.MutableIndexReplicationIT
Running org.apache.phoenix.hbase.index.FailForUnsupportedHBaseVersionsIT
Running org.apache.phoenix.end2end.index.txn.TxWriteFailureIT
Running org.apache.phoenix.execute.PartialCommitIT
Tests run: 2, Failures: 0, Errors: 0, Skipped: 0, Time elapsed: 30.348 sec - in org.apache.phoenix.end2end.index.ReadOnlyIndexFailureIT
Tests run: 12, Failures: 0, Errors: 0, Skipped: 0, Time elapsed: 6.702 sec - in org.apache.phoenix.execute.PartialCommitIT
Tests run: 2, Failures: 0, Errors: 0, Skipped: 0, Time elapsed: 30.901 sec - in org.apache.phoenix.hbase.index.FailForUnsupportedHBaseVersionsIT
Tests run: 8, Failures: 0, Errors: 0, Skipped: 0, Time elapsed: 45.053 sec - in org.apache.phoenix.end2end.index.txn.TxWriteFailureIT
Tests run: 80, Failures: 0, Errors: 0, Skipped: 0, Time elapsed: 391.612 sec - in org.apache.phoenix.end2end.IndexExtendedIT
Running org.apache.phoenix.hbase.index.covered.EndToEndCoveredColumnsIndexBuilderIT
Tests run: 2, Failures: 0, Errors: 0, Skipped: 0, Time elapsed: 14.893 sec - in org.apache.phoenix.hbase.index.covered.EndToEndCoveredColumnsIndexBuilderIT
Running org.apache.phoenix.hbase.index.covered.example.FailWithoutRetriesIT
Tests run: 48, Failures: 0, Errors: 0, Skipped: 0, Time elapsed: 201.419 sec - in org.apache.phoenix.end2end.ViewIT
Running org.apache.phoenix.hbase.index.covered.example.EndToEndCoveredIndexingIT
Tests run: 1, Failures: 0, Errors: 0, Skipped: 0, Time elapsed: 5.832 sec - in org.apache.phoenix.hbase.index.covered.example.FailWithoutRetriesIT
Running org.apache.phoenix.hbase.index.covered.example.EndtoEndIndexingWithCompressionIT
Running org.apache.phoenix.iterate.RoundRobinResultIteratorWithStatsIT
Tests run: 1, Failures: 0, Errors: 0, Skipped: 0, Time elapsed: 26.58 sec - in org.apache.phoenix.iterate.RoundRobinResultIteratorWithStatsIT
Running org.apache.phoenix.iterate.ScannerLeaseRenewalIT
Running org.apache.phoenix.monitoring.PhoenixMetricsIT
Running org.apache.phoenix.rpc.PhoenixClientRpcIT
Tests run: 2, Failures: 0, Errors: 0, Skipped: 0, Time elapsed: 17.197 sec - in org.apache.phoenix.rpc.PhoenixClientRpcIT
Running org.apache.phoenix.rpc.PhoenixServerRpcIT
Tests run: 1, Failures: 0, Errors: 0, Skipped: 0, Time elapsed: 21.044 sec - in org.apache.phoenix.rpc.PhoenixServerRpcIT
Tests run: 11, Failures: 0, Errors: 0, Skipped: 0, Time elapsed: 137.902 sec - in org.apache.phoenix.hbase.index.covered.example.EndToEndCoveredIndexingIT
Tests run: 11, Failures: 0, Errors: 0, Skipped: 0, Time elapsed: 136.98 sec - in org.apache.phoenix.hbase.index.covered.example.EndtoEndIndexingWithCompressionIT
Tests run: 18, Failures: 0, Errors: 0, Skipped: 0, Time elapsed: 83.786 sec - in org.apache.phoenix.monitoring.PhoenixMetricsIT
Tests run: 2, Failures: 0, Errors: 0, Skipped: 0, Time elapsed: 172.243 sec - in org.apache.phoenix.iterate.ScannerLeaseRenewalIT
Tests run: 8, Failures: 0, Errors: 0, Skipped: 0, Time elapsed: 3,937.525 sec - in org.apache.phoenix.end2end.index.MutableIndexFailureIT

Results :

Tests run: 333, Failures: 0, Errors: 0, Skipped: 0

[INFO] 
[INFO] --- maven-failsafe-plugin:2.19.1:verify (ParallelStatsEnabledTest) @ phoenix-core ---
[INFO] ------------------------------------------------------------------------
[INFO] Reactor Summary:
[INFO] 
[INFO] Apache Phoenix ..................................... SUCCESS [  7.927 s]
[INFO] Phoenix Core ....................................... FAILURE [  01:52 h]
[INFO] Phoenix - Flume .................................... SKIPPED
[INFO] Phoenix - Pig ...................................... SKIPPED
[INFO] Phoenix Query Server Client ........................ SKIPPED
[INFO] Phoenix Query Server ............................... SKIPPED
[INFO] Phoenix - Pherf .................................... SKIPPED
[INFO] Phoenix - Spark .................................... SKIPPED
[INFO] Phoenix - Hive ..................................... SKIPPED
[INFO] Phoenix Client ..................................... SKIPPED
[INFO] Phoenix Server ..................................... SKIPPED
[INFO] Phoenix Assembly ................................... SKIPPED
[INFO] Phoenix - Tracing Web Application .................. SKIPPED
[INFO] ------------------------------------------------------------------------
[INFO] BUILD FAILURE
[INFO] ------------------------------------------------------------------------
[INFO] Total time: 01:53 h
[INFO] Finished at: 2016-09-20T04:12:39+00:00
[INFO] Final Memory: 60M/1144M
[INFO] ------------------------------------------------------------------------
[ERROR] Failed to execute goal org.apache.maven.plugins:maven-failsafe-plugin:2.19.1:verify
(ParallelStatsEnabledTest) on project phoenix-core: There was a timeout or other error in
the fork -> [Help 1]
[ERROR] 
[ERROR] To see the full stack trace of the errors, re-run Maven with the -e switch.
[ERROR] Re-run Maven using the -X switch to enable full debug logging.
[ERROR] 
[ERROR] For more information about the errors and possible solutions, please read the following
articles:
[ERROR] [Help 1] http://cwiki.apache.org/confluence/display/MAVEN/MojoExecutionException
[ERROR] 
[ERROR] After correcting the problems, you can resume the build with the command
[ERROR]   mvn <goals> -rf :phoenix-core
Build step 'Invoke top-level Maven targets' marked build as failure
Archiving artifacts
Compressed 926.08 MB of artifacts by 41.1% relative to #168
Recording test results

Mime
View raw message