phoenix-commits mailing list archives

Site index · List index
Message view « Date » · « Thread »
Top « Date » · « Thread »
From Apache Jenkins Server <jenk...@builds.apache.org>
Subject Build failed in Jenkins: Phoenix | 4.x-HBase-0.98 #1301
Date Fri, 09 Sep 2016 20:25:03 GMT
See <https://builds.apache.org/job/Phoenix-4.x-HBase-0.98/1301/changes>

Changes:

[samarth] PHOENIX-3260 MetadataRegionObserver.postOpen() can prevent region server

------------------------------------------
[...truncated 700 lines...]
Tests run: 12, Failures: 0, Errors: 0, Skipped: 0, Time elapsed: 1.845 sec - in org.apache.phoenix.end2end.RegexpSplitFunctionIT
Running org.apache.phoenix.end2end.RegexpSubstrFunctionIT
Tests run: 17, Failures: 0, Errors: 0, Skipped: 0, Time elapsed: 49.418 sec - in org.apache.phoenix.end2end.PercentileIT
Running org.apache.phoenix.end2end.ReverseFunctionIT
Tests run: 2, Failures: 0, Errors: 0, Skipped: 0, Time elapsed: 5.824 sec - in org.apache.phoenix.end2end.RegexpSubstrFunctionIT
Running org.apache.phoenix.end2end.ReverseScanIT
Tests run: 6, Failures: 0, Errors: 0, Skipped: 0, Time elapsed: 39.939 sec - in org.apache.phoenix.end2end.QueryMoreIT
Running org.apache.phoenix.end2end.RoundFloorCeilFunctionsEnd2EndIT
Tests run: 5, Failures: 0, Errors: 0, Skipped: 0, Time elapsed: 12.314 sec - in org.apache.phoenix.end2end.ReverseFunctionIT
Running org.apache.phoenix.end2end.SerialIteratorsIT
Tests run: 1, Failures: 0, Errors: 0, Skipped: 0, Time elapsed: 3.6 sec - in org.apache.phoenix.end2end.SerialIteratorsIT
Running org.apache.phoenix.end2end.ServerExceptionIT
Tests run: 4, Failures: 0, Errors: 0, Skipped: 0, Time elapsed: 14.386 sec - in org.apache.phoenix.end2end.ReverseScanIT
Tests run: 33, Failures: 0, Errors: 0, Skipped: 0, Time elapsed: 9.589 sec - in org.apache.phoenix.end2end.RoundFloorCeilFunctionsEnd2EndIT
Tests run: 1, Failures: 0, Errors: 0, Skipped: 0, Time elapsed: 2.262 sec - in org.apache.phoenix.end2end.ServerExceptionIT
Running org.apache.phoenix.end2end.SkipScanAfterManualSplitIT
Running org.apache.phoenix.end2end.SkipScanQueryIT
Running org.apache.phoenix.end2end.SignFunctionEnd2EndIT
Tests run: 2, Failures: 0, Errors: 0, Skipped: 0, Time elapsed: 0.653 sec - in org.apache.phoenix.end2end.SignFunctionEnd2EndIT
Running org.apache.phoenix.end2end.SortMergeJoinMoreIT
Tests run: 2, Failures: 0, Errors: 0, Skipped: 0, Time elapsed: 97.427 sec - in org.apache.phoenix.end2end.PhoenixRuntimeIT
Running org.apache.phoenix.end2end.SortOrderIT
Tests run: 4, Failures: 0, Errors: 0, Skipped: 0, Time elapsed: 28.273 sec - in org.apache.phoenix.end2end.SortMergeJoinMoreIT
Running org.apache.phoenix.end2end.SpooledOrderByIT
Tests run: 12, Failures: 0, Errors: 0, Skipped: 0, Time elapsed: 36.308 sec - in org.apache.phoenix.end2end.SkipScanQueryIT
Running org.apache.phoenix.end2end.SpooledTmpFileDeleteIT
Tests run: 1, Failures: 0, Errors: 0, Skipped: 0, Time elapsed: 3.654 sec - in org.apache.phoenix.end2end.SpooledTmpFileDeleteIT
Running org.apache.phoenix.end2end.SqrtFunctionEnd2EndIT
Tests run: 3, Failures: 0, Errors: 0, Skipped: 0, Time elapsed: 42.553 sec - in org.apache.phoenix.end2end.SkipScanAfterManualSplitIT
Running org.apache.phoenix.end2end.StatementHintsIT
Tests run: 2, Failures: 0, Errors: 0, Skipped: 0, Time elapsed: 3.264 sec - in org.apache.phoenix.end2end.StatementHintsIT
Running org.apache.phoenix.end2end.StddevIT
Tests run: 2, Failures: 0, Errors: 0, Skipped: 0, Time elapsed: 11.278 sec - in org.apache.phoenix.end2end.SqrtFunctionEnd2EndIT
Tests run: 4, Failures: 0, Errors: 0, Skipped: 0, Time elapsed: 12.735 sec - in org.apache.phoenix.end2end.StddevIT
Running org.apache.phoenix.end2end.StringIT
Running org.apache.phoenix.end2end.StoreNullsIT
Tests run: 8, Failures: 0, Errors: 0, Skipped: 0, Time elapsed: 31.606 sec - in org.apache.phoenix.end2end.SpooledOrderByIT
Running org.apache.phoenix.end2end.StringToArrayFunctionIT
Tests run: 4, Failures: 0, Errors: 0, Skipped: 0, Time elapsed: 14.881 sec - in org.apache.phoenix.end2end.StoreNullsIT
Running org.apache.phoenix.end2end.TenantIdTypeIT
Tests run: 22, Failures: 0, Errors: 0, Skipped: 0, Time elapsed: 14.94 sec - in org.apache.phoenix.end2end.StringToArrayFunctionIT
Running org.apache.phoenix.end2end.TenantSpecificViewIndexIT
Tests run: 13, Failures: 0, Errors: 0, Skipped: 0, Time elapsed: 57.167 sec - in org.apache.phoenix.end2end.StringIT
Running org.apache.phoenix.end2end.TenantSpecificViewIndexSaltedIT
Tests run: 15, Failures: 0, Errors: 0, Skipped: 0, Time elapsed: 73.574 sec - in org.apache.phoenix.end2end.TenantIdTypeIT
Running org.apache.phoenix.end2end.TimezoneOffsetFunctionIT
Tests run: 4, Failures: 0, Errors: 0, Skipped: 0, Time elapsed: 36.124 sec - in org.apache.phoenix.end2end.TenantSpecificViewIndexSaltedIT
Tests run: 9, Failures: 0, Errors: 0, Skipped: 0, Time elapsed: 71.158 sec - in org.apache.phoenix.end2end.TenantSpecificViewIndexIT
Running org.apache.phoenix.end2end.ToCharFunctionIT
Running org.apache.phoenix.end2end.ToDateFunctionIT
Tests run: 12, Failures: 0, Errors: 0, Skipped: 0, Time elapsed: 8.87 sec - in org.apache.phoenix.end2end.ToDateFunctionIT
Running org.apache.phoenix.end2end.UpsertBigValuesIT
Tests run: 45, Failures: 0, Errors: 0, Skipped: 0, Time elapsed: 136.195 sec - in org.apache.phoenix.end2end.SortOrderIT
Running org.apache.phoenix.end2end.UpsertSelectAutoCommitIT
Tests run: 7, Failures: 0, Errors: 0, Skipped: 0, Time elapsed: 18.17 sec - in org.apache.phoenix.end2end.TimezoneOffsetFunctionIT
Running org.apache.phoenix.end2end.UseSchemaIT
Tests run: 4, Failures: 0, Errors: 0, Skipped: 0, Time elapsed: 9.945 sec - in org.apache.phoenix.end2end.UpsertBigValuesIT
Running org.apache.phoenix.end2end.index.AsyncIndexDisabledIT
Tests run: 1, Failures: 0, Errors: 0, Skipped: 0, Time elapsed: 3.807 sec - in org.apache.phoenix.end2end.index.AsyncIndexDisabledIT
Running org.apache.phoenix.end2end.index.DropMetadataIT
Tests run: 3, Failures: 0, Errors: 0, Skipped: 0, Time elapsed: 12.747 sec - in org.apache.phoenix.end2end.UpsertSelectAutoCommitIT
Running org.apache.phoenix.end2end.index.GlobalIndexOptimizationIT
Tests run: 4, Failures: 0, Errors: 0, Skipped: 0, Time elapsed: 23.254 sec - in org.apache.phoenix.end2end.UseSchemaIT
Tests run: 12, Failures: 0, Errors: 0, Skipped: 0, Time elapsed: 41.769 sec - in org.apache.phoenix.end2end.ToCharFunctionIT
Running org.apache.phoenix.end2end.index.ImmutableIndexIT
Running org.apache.phoenix.end2end.index.IndexExpressionIT
Tests run: 4, Failures: 0, Errors: 0, Skipped: 0, Time elapsed: 31.396 sec - in org.apache.phoenix.end2end.index.DropMetadataIT
Running org.apache.phoenix.end2end.index.IndexMetadataIT
Tests run: 6, Failures: 0, Errors: 0, Skipped: 0, Time elapsed: 41.364 sec - in org.apache.phoenix.end2end.index.GlobalIndexOptimizationIT
Running org.apache.phoenix.end2end.index.LocalIndexIT
Tests run: 9, Failures: 0, Errors: 0, Skipped: 0, Time elapsed: 43.018 sec - in org.apache.phoenix.end2end.index.IndexMetadataIT
Running org.apache.phoenix.end2end.index.MutableIndexIT
Tests run: 12, Failures: 0, Errors: 0, Skipped: 4, Time elapsed: 72.944 sec - in org.apache.phoenix.end2end.index.ImmutableIndexIT
Running org.apache.phoenix.end2end.index.SaltedIndexIT
Tests run: 3, Failures: 0, Errors: 0, Skipped: 0, Time elapsed: 16.333 sec - in org.apache.phoenix.end2end.index.SaltedIndexIT
Running org.apache.phoenix.end2end.index.ViewIndexIT
Tests run: 6, Failures: 0, Errors: 0, Skipped: 0, Time elapsed: 50.336 sec - in org.apache.phoenix.end2end.index.ViewIndexIT
Running org.apache.phoenix.end2end.index.txn.MutableRollbackIT
Tests run: 6, Failures: 0, Errors: 0, Skipped: 0, Time elapsed: 74.42 sec - in org.apache.phoenix.end2end.index.txn.MutableRollbackIT
Running org.apache.phoenix.end2end.index.txn.RollbackIT
Tests run: 8, Failures: 0, Errors: 0, Skipped: 0, Time elapsed: 53.266 sec - in org.apache.phoenix.end2end.index.txn.RollbackIT
Running org.apache.phoenix.end2end.salted.SaltedTableUpsertSelectIT
Tests run: 6, Failures: 0, Errors: 0, Skipped: 0, Time elapsed: 31.62 sec - in org.apache.phoenix.end2end.salted.SaltedTableUpsertSelectIT
Running org.apache.phoenix.end2end.salted.SaltedTableVarLengthRowKeyIT
Tests run: 1, Failures: 0, Errors: 0, Skipped: 0, Time elapsed: 2.891 sec - in org.apache.phoenix.end2end.salted.SaltedTableVarLengthRowKeyIT
Running org.apache.phoenix.iterate.PhoenixQueryTimeoutIT
Tests run: 2, Failures: 0, Errors: 0, Skipped: 0, Time elapsed: 0.18 sec - in org.apache.phoenix.iterate.PhoenixQueryTimeoutIT
Running org.apache.phoenix.iterate.RoundRobinResultIteratorIT
Tests run: 28, Failures: 0, Errors: 0, Skipped: 0, Time elapsed: 698.372 sec - in org.apache.phoenix.end2end.InListIT
Running org.apache.phoenix.rpc.UpdateCacheIT
Tests run: 7, Failures: 0, Errors: 0, Skipped: 0, Time elapsed: 26.376 sec - in org.apache.phoenix.rpc.UpdateCacheIT
Running org.apache.phoenix.trace.PhoenixTableMetricsWriterIT
Tests run: 2, Failures: 0, Errors: 0, Skipped: 0, Time elapsed: 3.108 sec - in org.apache.phoenix.trace.PhoenixTableMetricsWriterIT
Running org.apache.phoenix.trace.PhoenixTraceReaderIT
Tests run: 2, Failures: 0, Errors: 0, Skipped: 0, Time elapsed: 0.488 sec - in org.apache.phoenix.trace.PhoenixTraceReaderIT
Running org.apache.phoenix.trace.PhoenixTracingEndToEndIT
Tests run: 9, Failures: 0, Errors: 0, Skipped: 0, Time elapsed: 54.432 sec - in org.apache.phoenix.iterate.RoundRobinResultIteratorIT
Running org.apache.phoenix.tx.TransactionIT
Tests run: 40, Failures: 0, Errors: 0, Skipped: 0, Time elapsed: 356.126 sec - in org.apache.phoenix.end2end.index.LocalIndexIT
Running org.apache.phoenix.tx.TxCheckpointIT
Tests run: 6, Failures: 0, Errors: 0, Skipped: 0, Time elapsed: 90.314 sec - in org.apache.phoenix.trace.PhoenixTracingEndToEndIT
Tests run: 66, Failures: 0, Errors: 0, Skipped: 0, Time elapsed: 453.612 sec - in org.apache.phoenix.end2end.index.IndexExpressionIT

Results :

Tests run: 1021, Failures: 0, Errors: 0, Skipped: 4

[INFO] 
[INFO] --- maven-failsafe-plugin:2.19.1:integration-test (NeedTheirOwnClusterTests) @ phoenix-core
---

-------------------------------------------------------
 T E S T S
-------------------------------------------------------
Running org.apache.hadoop.hbase.regionserver.wal.WALReplayWithIndexWritesAndCompressedWALIT
Running org.apache.hadoop.hbase.regionserver.wal.WALReplayWithIndexWritesAndUncompressedWALInHBase_094_9_IT
Tests run: 1, Failures: 0, Errors: 0, Skipped: 0, Time elapsed: 28.877 sec - in org.apache.hadoop.hbase.regionserver.wal.WALReplayWithIndexWritesAndCompressedWALIT
Tests run: 1, Failures: 0, Errors: 0, Skipped: 0, Time elapsed: 38.7 sec - in org.apache.hadoop.hbase.regionserver.wal.WALReplayWithIndexWritesAndUncompressedWALInHBase_094_9_IT
Running org.apache.phoenix.coprocessor.StatisticsCollectionRunTrackerIT
Running org.apache.phoenix.end2end.AlterTableIT
Running org.apache.phoenix.end2end.ConnectionUtilIT
Tests run: 4, Failures: 0, Errors: 0, Skipped: 0, Time elapsed: 30.072 sec - in org.apache.phoenix.coprocessor.StatisticsCollectionRunTrackerIT
Running org.apache.phoenix.end2end.ContextClassloaderIT
Tests run: 1, Failures: 0, Errors: 0, Skipped: 0, Time elapsed: 26.476 sec - in org.apache.phoenix.end2end.ConnectionUtilIT
Tests run: 3, Failures: 0, Errors: 0, Skipped: 0, Time elapsed: 5.439 sec - in org.apache.phoenix.end2end.ContextClassloaderIT
Running org.apache.phoenix.end2end.CountDistinctCompressionIT
Tests run: 1, Failures: 0, Errors: 0, Skipped: 0, Time elapsed: 9.093 sec - in org.apache.phoenix.end2end.CountDistinctCompressionIT
Running org.apache.phoenix.end2end.CsvBulkLoadToolIT
Running org.apache.phoenix.end2end.KeyOnlyIT
Running org.apache.phoenix.end2end.IndexToolIT
Running org.apache.phoenix.end2end.MultiCfQueryExecIT
Tests run: 3, Failures: 0, Errors: 0, Skipped: 0, Time elapsed: 18.804 sec - in org.apache.phoenix.end2end.KeyOnlyIT
Tests run: 9, Failures: 0, Errors: 0, Skipped: 0, Time elapsed: 31.965 sec - in org.apache.phoenix.end2end.MultiCfQueryExecIT
Running org.apache.phoenix.end2end.MutableIndexToolIT
Running org.apache.phoenix.end2end.ParallelIteratorsIT
Tests run: 3, Failures: 0, Errors: 0, Skipped: 0, Time elapsed: 37.583 sec - in org.apache.phoenix.end2end.ParallelIteratorsIT
Tests run: 1, Failures: 0, Errors: 0, Skipped: 0, Time elapsed: 109.128 sec - in org.apache.phoenix.end2end.MutableIndexToolIT
Running org.apache.phoenix.end2end.QueryTimeoutIT
Tests run: 2, Failures: 0, Errors: 0, Skipped: 0, Time elapsed: 18.362 sec - in org.apache.phoenix.end2end.QueryTimeoutIT
Running org.apache.phoenix.end2end.QueryWithLimitIT
Tests run: 2, Failures: 0, Errors: 0, Skipped: 0, Time elapsed: 18.31 sec - in org.apache.phoenix.end2end.QueryWithLimitIT
Running org.apache.phoenix.end2end.RenewLeaseIT
Tests run: 1, Failures: 0, Errors: 0, Skipped: 1, Time elapsed: 0.002 sec - in org.apache.phoenix.end2end.RenewLeaseIT
Running org.apache.phoenix.end2end.QueryWithOffsetIT
Tests run: 8, Failures: 0, Errors: 0, Skipped: 0, Time elapsed: 27.707 sec - in org.apache.phoenix.end2end.QueryWithOffsetIT
Running org.apache.phoenix.end2end.SaltedViewIT
Tests run: 56, Failures: 0, Errors: 0, Skipped: 0, Time elapsed: 390.401 sec - in org.apache.phoenix.end2end.AlterTableIT
Tests run: 4, Failures: 0, Errors: 0, Skipped: 0, Time elapsed: 49.209 sec - in org.apache.phoenix.end2end.SaltedViewIT
Running org.apache.phoenix.end2end.SpillableGroupByIT
Running org.apache.phoenix.end2end.StatsCollectionDisabledIT
Tests run: 1, Failures: 0, Errors: 0, Skipped: 0, Time elapsed: 8.423 sec - in org.apache.phoenix.end2end.StatsCollectionDisabledIT
Tests run: 1, Failures: 0, Errors: 0, Skipped: 0, Time elapsed: 18.475 sec - in org.apache.phoenix.end2end.SpillableGroupByIT
Running org.apache.phoenix.end2end.StatsCollectorIT
Running org.apache.phoenix.end2end.StatsCollectorWithSplitsAndMultiCFIT
Running org.apache.phoenix.end2end.TenantSpecificTablesDDLIT
Tests run: 2, Failures: 0, Errors: 0, Skipped: 0, Time elapsed: 18.086 sec - in org.apache.phoenix.end2end.StatsCollectorWithSplitsAndMultiCFIT
Running org.apache.phoenix.end2end.TenantSpecificTablesDMLIT
Tests run: 17, Failures: 0, Errors: 0, Skipped: 0, Time elapsed: 68.402 sec - in org.apache.phoenix.end2end.TenantSpecificTablesDDLIT
Tests run: 16, Failures: 0, Errors: 0, Skipped: 0, Time elapsed: 42.52 sec - in org.apache.phoenix.end2end.TenantSpecificTablesDMLIT
Tests run: 10, Failures: 0, Errors: 0, Skipped: 0, Time elapsed: 517.819 sec - in org.apache.phoenix.end2end.CsvBulkLoadToolIT
Running org.apache.phoenix.end2end.TransactionalViewIT
Tests run: 16, Failures: 0, Errors: 0, Skipped: 0, Time elapsed: 149.566 sec - in org.apache.phoenix.end2end.StatsCollectorIT
Running org.apache.phoenix.end2end.UnionAllIT
Running org.apache.phoenix.end2end.ViewIT
Running org.apache.phoenix.end2end.UserDefinedFunctionsIT
Tests run: 2, Failures: 0, Errors: 0, Skipped: 0, Time elapsed: 68.607 sec - in org.apache.phoenix.end2end.TransactionalViewIT
Tests run: 17, Failures: 0, Errors: 0, Skipped: 0, Time elapsed: 52.549 sec - in org.apache.phoenix.end2end.UnionAllIT
Running org.apache.phoenix.end2end.index.AsyncImmutableIndexIT
Tests run: 14, Failures: 0, Errors: 0, Skipped: 0, Time elapsed: 56.748 sec - in org.apache.phoenix.end2end.UserDefinedFunctionsIT
Running org.apache.phoenix.end2end.index.ImmutableIndexWithStatsIT
Tests run: 1, Failures: 0, Errors: 0, Skipped: 0, Time elapsed: 9.359 sec - in org.apache.phoenix.end2end.index.ImmutableIndexWithStatsIT
Running org.apache.phoenix.end2end.index.IndexIT
Running org.apache.phoenix.end2end.index.MutableIndexFailureIT
Tests run: 1, Failures: 0, Errors: 0, Skipped: 0, Time elapsed: 117.752 sec - in org.apache.phoenix.end2end.index.AsyncImmutableIndexIT
Tests run: 48, Failures: 0, Errors: 0, Skipped: 0, Time elapsed: 206.899 sec - in org.apache.phoenix.end2end.ViewIT
Running org.apache.phoenix.end2end.index.MutableIndexReplicationIT
Running org.apache.phoenix.end2end.index.ReadOnlyIndexFailureIT
Tests run: 8, Failures: 0, Errors: 0, Skipped: 0, Time elapsed: 131.241 sec - in org.apache.phoenix.end2end.index.MutableIndexFailureIT
Tests run: 1, Failures: 0, Errors: 0, Skipped: 0, Time elapsed: 27.858 sec - in org.apache.phoenix.end2end.index.MutableIndexReplicationIT
Tests run: 2, Failures: 0, Errors: 0, Skipped: 0, Time elapsed: 33.447 sec - in org.apache.phoenix.end2end.index.ReadOnlyIndexFailureIT
Running org.apache.phoenix.hbase.index.FailForUnsupportedHBaseVersionsIT
Running org.apache.phoenix.end2end.index.txn.TxWriteFailureIT
Tests run: 2, Failures: 0, Errors: 0, Skipped: 0, Time elapsed: 28.156 sec - in org.apache.phoenix.hbase.index.FailForUnsupportedHBaseVersionsIT
Running org.apache.phoenix.execute.PartialCommitIT
Tests run: 12, Failures: 0, Errors: 0, Skipped: 0, Time elapsed: 12.476 sec - in org.apache.phoenix.execute.PartialCommitIT
Running org.apache.phoenix.hbase.index.covered.EndToEndCoveredColumnsIndexBuilderIT
Tests run: 8, Failures: 0, Errors: 0, Skipped: 0, Time elapsed: 39.57 sec - in org.apache.phoenix.end2end.index.txn.TxWriteFailureIT
Tests run: 2, Failures: 0, Errors: 0, Skipped: 0, Time elapsed: 15.674 sec - in org.apache.phoenix.hbase.index.covered.EndToEndCoveredColumnsIndexBuilderIT
Running org.apache.phoenix.hbase.index.covered.example.FailWithoutRetriesIT
Running org.apache.phoenix.hbase.index.covered.example.EndToEndCoveredIndexingIT
Running org.apache.phoenix.hbase.index.covered.example.EndtoEndIndexingWithCompressionIT
Tests run: 1, Failures: 0, Errors: 0, Skipped: 0, Time elapsed: 6.416 sec - in org.apache.phoenix.hbase.index.covered.example.FailWithoutRetriesIT
Tests run: 16, Failures: 0, Errors: 0, Skipped: 0, Time elapsed: 987.164 sec - in org.apache.phoenix.end2end.IndexToolIT
Running org.apache.phoenix.iterate.RoundRobinResultIteratorWithStatsIT
Tests run: 1, Failures: 0, Errors: 0, Skipped: 0, Time elapsed: 17.693 sec - in org.apache.phoenix.iterate.RoundRobinResultIteratorWithStatsIT
Running org.apache.phoenix.iterate.ScannerLeaseRenewalIT
Tests run: 11, Failures: 0, Errors: 0, Skipped: 0, Time elapsed: 95.349 sec - in org.apache.phoenix.hbase.index.covered.example.EndToEndCoveredIndexingIT
Tests run: 11, Failures: 0, Errors: 0, Skipped: 0, Time elapsed: 96.586 sec - in org.apache.phoenix.hbase.index.covered.example.EndtoEndIndexingWithCompressionIT
Running org.apache.phoenix.monitoring.PhoenixMetricsIT
Running org.apache.phoenix.rpc.PhoenixClientRpcIT
Running org.apache.phoenix.rpc.PhoenixServerRpcIT
Tests run: 2, Failures: 0, Errors: 0, Skipped: 0, Time elapsed: 11.701 sec - in org.apache.phoenix.rpc.PhoenixClientRpcIT
Tests run: 1, Failures: 0, Errors: 0, Skipped: 0, Time elapsed: 22.162 sec - in org.apache.phoenix.rpc.PhoenixServerRpcIT
Tests run: 18, Failures: 0, Errors: 0, Skipped: 0, Time elapsed: 84.632 sec - in org.apache.phoenix.monitoring.PhoenixMetricsIT
Tests run: 2, Failures: 0, Errors: 0, Skipped: 0, Time elapsed: 169.403 sec - in org.apache.phoenix.iterate.ScannerLeaseRenewalIT
Tests run: 128, Failures: 0, Errors: 0, Skipped: 0, Time elapsed: 834.245 sec - in org.apache.phoenix.end2end.index.IndexIT

Results :

Tests run: 472, Failures: 0, Errors: 0, Skipped: 1

[INFO] 
[INFO] --- maven-failsafe-plugin:2.19.1:verify (ClientManagedTimeTests) @ phoenix-core ---
[INFO] ------------------------------------------------------------------------
[INFO] Reactor Summary:
[INFO] 
[INFO] Apache Phoenix ..................................... SUCCESS [  6.807 s]
[INFO] Phoenix Core ....................................... FAILURE [  01:15 h]
[INFO] Phoenix - Flume .................................... SKIPPED
[INFO] Phoenix - Pig ...................................... SKIPPED
[INFO] Phoenix Query Server Client ........................ SKIPPED
[INFO] Phoenix Query Server ............................... SKIPPED
[INFO] Phoenix - Pherf .................................... SKIPPED
[INFO] Phoenix - Spark .................................... SKIPPED
[INFO] Phoenix - Hive ..................................... SKIPPED
[INFO] Phoenix Client ..................................... SKIPPED
[INFO] Phoenix Server ..................................... SKIPPED
[INFO] Phoenix Assembly ................................... SKIPPED
[INFO] Phoenix - Tracing Web Application .................. SKIPPED
[INFO] ------------------------------------------------------------------------
[INFO] BUILD FAILURE
[INFO] ------------------------------------------------------------------------
[INFO] Total time: 01:15 h
[INFO] Finished at: 2016-09-09T20:13:32+00:00
[INFO] Final Memory: 58M/894M
[INFO] ------------------------------------------------------------------------
[ERROR] Failed to execute goal org.apache.maven.plugins:maven-failsafe-plugin:2.19.1:verify
(ClientManagedTimeTests) on project phoenix-core: There was a timeout or other error in the
fork -> [Help 1]
[ERROR] 
[ERROR] To see the full stack trace of the errors, re-run Maven with the -e switch.
[ERROR] Re-run Maven using the -X switch to enable full debug logging.
[ERROR] 
[ERROR] For more information about the errors and possible solutions, please read the following
articles:
[ERROR] [Help 1] http://cwiki.apache.org/confluence/display/MAVEN/MojoExecutionException
[ERROR] 
[ERROR] After correcting the problems, you can resume the build with the command
[ERROR]   mvn <goals> -rf :phoenix-core
Build step 'Invoke top-level Maven targets' marked build as failure
Archiving artifacts
Compressed 2.02 GB of artifacts by 57.8% relative to #1272
Recording test results

Mime
View raw message