phoenix-commits mailing list archives

Site index · List index
Message view « Date » · « Thread »
Top « Date » · « Thread »
From Apache Jenkins Server <jenk...@builds.apache.org>
Subject Build failed in Jenkins: Phoenix-4.8-HBase-0.98 #3
Date Thu, 01 Sep 2016 01:08:38 GMT
See <https://builds.apache.org/job/Phoenix-4.8-HBase-0.98/3/changes>

Changes:

[elserj] PHOENIX-3189 Perform Kerberos login before ConnectionInfo is constructed

------------------------------------------
[...truncated 331 lines...]
Running org.apache.phoenix.expression.ArithmeticOperationTest
Tests run: 6, Failures: 0, Errors: 0, Skipped: 0, Time elapsed: 0.019 sec - in org.apache.phoenix.expression.ArithmeticOperationTest
Running org.apache.phoenix.expression.AbsFunctionTest
Tests run: 1, Failures: 0, Errors: 0, Skipped: 0, Time elapsed: 0.019 sec - in org.apache.phoenix.expression.AbsFunctionTest
Running org.apache.phoenix.expression.GetSetByteBitFunctionTest
Tests run: 3, Failures: 0, Errors: 0, Skipped: 0, Time elapsed: 0.191 sec - in org.apache.phoenix.expression.NullValueTest
Running org.apache.phoenix.expression.DeterminismTest
Tests run: 1, Failures: 0, Errors: 0, Skipped: 0, Time elapsed: 0.001 sec - in org.apache.phoenix.expression.DeterminismTest
Running org.apache.phoenix.expression.SignFunctionTest
Tests run: 1, Failures: 0, Errors: 0, Skipped: 0, Time elapsed: 0.015 sec - in org.apache.phoenix.expression.SignFunctionTest
Running org.apache.phoenix.expression.RoundFloorCeilExpressionsTest
Tests run: 2, Failures: 0, Errors: 0, Skipped: 0, Time elapsed: 0.678 sec - in org.apache.phoenix.expression.GetSetByteBitFunctionTest
Running org.apache.phoenix.expression.LikeExpressionTest
Tests run: 35, Failures: 0, Errors: 0, Skipped: 0, Time elapsed: 1.038 sec - in org.apache.phoenix.expression.ArrayConcatFunctionTest
Running org.apache.phoenix.expression.ArrayPrependFunctionTest
Tests run: 37, Failures: 0, Errors: 0, Skipped: 0, Time elapsed: 0.079 sec - in org.apache.phoenix.expression.ArrayPrependFunctionTest
Running org.apache.phoenix.expression.RegexpSplitFunctionTest
Tests run: 5, Failures: 0, Errors: 0, Skipped: 0, Time elapsed: 0.128 sec - in org.apache.phoenix.expression.LikeExpressionTest
Running org.apache.phoenix.expression.CbrtFunctionTest
Tests run: 1, Failures: 0, Errors: 0, Skipped: 0, Time elapsed: 0.005 sec - in org.apache.phoenix.expression.CbrtFunctionTest
Running org.apache.phoenix.expression.StringToArrayFunctionTest
Tests run: 20, Failures: 0, Errors: 0, Skipped: 0, Time elapsed: 0.023 sec - in org.apache.phoenix.expression.StringToArrayFunctionTest
Running org.apache.phoenix.expression.CoerceExpressionTest
Tests run: 5, Failures: 0, Errors: 0, Skipped: 0, Time elapsed: 0.004 sec - in org.apache.phoenix.expression.CoerceExpressionTest
Running org.apache.phoenix.expression.ILikeExpressionTest
Tests run: 3, Failures: 0, Errors: 0, Skipped: 0, Time elapsed: 0.01 sec - in org.apache.phoenix.expression.ILikeExpressionTest
Running org.apache.phoenix.expression.SqrtFunctionTest
Tests run: 1, Failures: 0, Errors: 0, Skipped: 0, Time elapsed: 0.007 sec - in org.apache.phoenix.expression.SqrtFunctionTest
Running org.apache.phoenix.expression.OctetLengthFunctionTest
Tests run: 1, Failures: 0, Errors: 0, Skipped: 0, Time elapsed: 0.007 sec - in org.apache.phoenix.expression.OctetLengthFunctionTest
Running org.apache.phoenix.expression.ColumnExpressionTest
Tests run: 4, Failures: 0, Errors: 0, Skipped: 0, Time elapsed: 0.003 sec - in org.apache.phoenix.expression.ColumnExpressionTest
Running org.apache.phoenix.expression.ArrayFillFunctionTest
Tests run: 14, Failures: 0, Errors: 0, Skipped: 0, Time elapsed: 0.018 sec - in org.apache.phoenix.expression.ArrayFillFunctionTest
Running org.apache.phoenix.expression.ArrayToStringFunctionTest
Tests run: 1, Failures: 0, Errors: 0, Skipped: 0, Time elapsed: 0.145 sec - in org.apache.phoenix.expression.RegexpSplitFunctionTest
Tests run: 24, Failures: 0, Errors: 0, Skipped: 0, Time elapsed: 0.024 sec - in org.apache.phoenix.expression.ArrayToStringFunctionTest
Running org.apache.phoenix.expression.RegexpReplaceFunctionTest
Running org.apache.phoenix.expression.RegexpSubstrFunctionTest
Tests run: 1, Failures: 0, Errors: 0, Skipped: 0, Time elapsed: 0.006 sec - in org.apache.phoenix.expression.RegexpReplaceFunctionTest
Running org.apache.phoenix.expression.function.ExternalSqlTypeIdFunctionTest
Tests run: 3, Failures: 0, Errors: 0, Skipped: 0, Time elapsed: 0.003 sec - in org.apache.phoenix.expression.function.ExternalSqlTypeIdFunctionTest
Running org.apache.phoenix.expression.function.InstrFunctionTest
Tests run: 1, Failures: 0, Errors: 0, Skipped: 0, Time elapsed: 0.01 sec - in org.apache.phoenix.expression.RegexpSubstrFunctionTest
Running org.apache.phoenix.expression.function.BuiltinFunctionConstructorTest
Tests run: 1, Failures: 0, Errors: 0, Skipped: 0, Time elapsed: 0.002 sec - in org.apache.phoenix.expression.function.InstrFunctionTest
Running org.apache.phoenix.expression.LnLogFunctionTest
Tests run: 1, Failures: 0, Errors: 0, Skipped: 0, Time elapsed: 0.023 sec - in org.apache.phoenix.expression.LnLogFunctionTest
Running org.apache.phoenix.expression.SortOrderExpressionTest
Tests run: 2, Failures: 0, Errors: 0, Skipped: 0, Time elapsed: 0.03 sec - in org.apache.phoenix.expression.function.BuiltinFunctionConstructorTest
Running org.apache.phoenix.memory.MemoryManagerTest
Tests run: 22, Failures: 0, Errors: 0, Skipped: 0, Time elapsed: 0.881 sec - in org.apache.phoenix.expression.RoundFloorCeilExpressionsTest
Running org.apache.phoenix.jdbc.PhoenixDriverTest
Tests run: 24, Failures: 0, Errors: 0, Skipped: 0, Time elapsed: 0.026 sec - in org.apache.phoenix.expression.SortOrderExpressionTest
Running org.apache.phoenix.jdbc.ReadOnlyPropertiesTest
Tests run: 4, Failures: 0, Errors: 0, Skipped: 0, Time elapsed: 0.003 sec - in org.apache.phoenix.jdbc.ReadOnlyPropertiesTest
Running org.apache.phoenix.jdbc.SecureUserConnectionsTest
Tests run: 6, Failures: 0, Errors: 0, Skipped: 3, Time elapsed: 0.038 sec - in org.apache.phoenix.memory.MemoryManagerTest
Running org.apache.phoenix.jdbc.PhoenixEmbeddedDriverTest
Tests run: 3, Failures: 0, Errors: 0, Skipped: 0, Time elapsed: 0.056 sec - in org.apache.phoenix.jdbc.PhoenixEmbeddedDriverTest
Running org.apache.phoenix.jdbc.PhoenixResultSetMetadataTest
Tests run: 1, Failures: 0, Errors: 0, Skipped: 0, Time elapsed: 0.165 sec - in org.apache.phoenix.jdbc.PhoenixResultSetMetadataTest
Running org.apache.phoenix.jdbc.PhoenixPreparedStatementTest
Tests run: 6, Failures: 0, Errors: 0, Skipped: 0, Time elapsed: 0.364 sec - in org.apache.phoenix.jdbc.PhoenixDriverTest
Running org.apache.phoenix.iterate.RowKeyOrderedAggregateResultIteratorTest
Tests run: 11, Failures: 0, Errors: 0, Skipped: 0, Time elapsed: 0.153 sec - in org.apache.phoenix.jdbc.PhoenixPreparedStatementTest
Running org.apache.phoenix.iterate.AggregateResultScannerTest
Tests run: 4, Failures: 0, Errors: 0, Skipped: 0, Time elapsed: 0.165 sec - in org.apache.phoenix.iterate.RowKeyOrderedAggregateResultIteratorTest
Running org.apache.phoenix.iterate.MergeSortResultIteratorTest
Tests run: 2, Failures: 0, Errors: 0, Skipped: 0, Time elapsed: 0.003 sec - in org.apache.phoenix.iterate.MergeSortResultIteratorTest
Running org.apache.phoenix.iterate.ConcatResultIteratorTest
Tests run: 2, Failures: 0, Errors: 0, Skipped: 0, Time elapsed: 0.002 sec - in org.apache.phoenix.iterate.ConcatResultIteratorTest
Running org.apache.phoenix.iterate.SpoolingResultIteratorTest
Tests run: 1, Failures: 0, Errors: 0, Skipped: 0, Time elapsed: 0.144 sec - in org.apache.phoenix.iterate.AggregateResultScannerTest
Running org.apache.phoenix.query.KeyRangeCoalesceTest
Tests run: 3, Failures: 0, Errors: 0, Skipped: 0, Time elapsed: 0.011 sec - in org.apache.phoenix.iterate.SpoolingResultIteratorTest
Running org.apache.phoenix.query.KeyRangeUnionTest
Tests run: 8, Failures: 0, Errors: 0, Skipped: 0, Time elapsed: 0.022 sec - in org.apache.phoenix.query.KeyRangeUnionTest
Running org.apache.phoenix.query.PhoenixStatsCacheRemovalListenerTest
Tests run: 1, Failures: 0, Errors: 0, Skipped: 0, Time elapsed: 0.003 sec - in org.apache.phoenix.query.PhoenixStatsCacheRemovalListenerTest
Running org.apache.phoenix.query.ConnectionlessTest
Tests run: 13, Failures: 0, Errors: 0, Skipped: 0, Time elapsed: 0.036 sec - in org.apache.phoenix.query.KeyRangeCoalesceTest
Running org.apache.phoenix.query.KeyRangeIntersectTest
Tests run: 8, Failures: 0, Errors: 0, Skipped: 0, Time elapsed: 0.024 sec - in org.apache.phoenix.query.KeyRangeIntersectTest
Running org.apache.phoenix.query.QueryPlanTest
Tests run: 3, Failures: 0, Errors: 0, Skipped: 0, Time elapsed: 0.226 sec - in org.apache.phoenix.query.ConnectionlessTest
Running org.apache.phoenix.query.ParallelIteratorsSplitTest
Tests run: 5, Failures: 0, Errors: 0, Skipped: 0, Time elapsed: 0.399 sec - in org.apache.phoenix.query.QueryPlanTest
Running org.apache.phoenix.query.ScannerLeaseRenewalTest
Tests run: 8, Failures: 0, Errors: 0, Skipped: 0, Time elapsed: 0.211 sec - in org.apache.phoenix.query.ParallelIteratorsSplitTest
Running org.apache.phoenix.query.OrderByTest
Tests run: 4, Failures: 0, Errors: 0, Skipped: 0, Time elapsed: 0.14 sec - in org.apache.phoenix.query.OrderByTest
Running org.apache.phoenix.query.HBaseFactoryProviderTest
Tests run: 3, Failures: 0, Errors: 0, Skipped: 0, Time elapsed: 0.003 sec - in org.apache.phoenix.query.HBaseFactoryProviderTest
Running org.apache.phoenix.mapreduce.util.PhoenixConfigurationUtilTest
Tests run: 9, Failures: 0, Errors: 0, Skipped: 0, Time elapsed: 0.385 sec - in org.apache.phoenix.mapreduce.util.PhoenixConfigurationUtilTest
Running org.apache.phoenix.mapreduce.util.ColumnInfoToStringEncoderDecoderTest
Tests run: 2, Failures: 0, Errors: 0, Skipped: 0, Time elapsed: 0.032 sec - in org.apache.phoenix.mapreduce.util.ColumnInfoToStringEncoderDecoderTest
Running org.apache.phoenix.mapreduce.FormatToBytesWritableMapperTest
Tests run: 5, Failures: 0, Errors: 0, Skipped: 0, Time elapsed: 0.075 sec - in org.apache.phoenix.mapreduce.FormatToBytesWritableMapperTest
Running org.apache.phoenix.mapreduce.bulkload.TestTableRowkeyPair
Tests run: 1, Failures: 0, Errors: 0, Skipped: 0, Time elapsed: 0.002 sec - in org.apache.phoenix.mapreduce.bulkload.TestTableRowkeyPair
Running org.apache.phoenix.mapreduce.CsvBulkImportUtilTest
Tests run: 5, Failures: 0, Errors: 0, Skipped: 0, Time elapsed: 0.307 sec - in org.apache.phoenix.mapreduce.CsvBulkImportUtilTest
Running org.apache.phoenix.mapreduce.BulkLoadToolTest
Tests run: 12, Failures: 0, Errors: 0, Skipped: 0, Time elapsed: 0.018 sec - in org.apache.phoenix.mapreduce.BulkLoadToolTest
Running org.apache.phoenix.mapreduce.CsvToKeyValueMapperTest
Tests run: 2, Failures: 0, Errors: 0, Skipped: 0, Time elapsed: 0.001 sec - in org.apache.phoenix.mapreduce.CsvToKeyValueMapperTest
Running org.apache.phoenix.filter.SkipScanBigFilterTest
Tests run: 2, Failures: 0, Errors: 0, Skipped: 0, Time elapsed: 0.288 sec - in org.apache.phoenix.filter.SkipScanBigFilterTest
Running org.apache.phoenix.filter.SkipScanFilterIntersectTest
Tests run: 19, Failures: 0, Errors: 0, Skipped: 0, Time elapsed: 0.021 sec - in org.apache.phoenix.filter.SkipScanFilterIntersectTest
Running org.apache.phoenix.filter.SkipScanFilterTest
Tests run: 15, Failures: 0, Errors: 0, Skipped: 0, Time elapsed: 0.028 sec - in org.apache.phoenix.filter.SkipScanFilterTest
Running org.apache.phoenix.filter.DistinctPrefixFilterTest
Tests run: 8, Failures: 0, Errors: 0, Skipped: 0, Time elapsed: 0.009 sec - in org.apache.phoenix.filter.DistinctPrefixFilterTest
Running org.apache.hadoop.hbase.regionserver.PhoenixRpcSchedulerFactoryTest
Tests run: 2, Failures: 0, Errors: 0, Skipped: 0, Time elapsed: 0.012 sec - in org.apache.hadoop.hbase.regionserver.PhoenixRpcSchedulerFactoryTest
Running org.apache.hadoop.hbase.ipc.PhoenixIndexRpcSchedulerTest
Tests run: 2, Failures: 0, Errors: 0, Skipped: 0, Time elapsed: 0.213 sec - in org.apache.hadoop.hbase.ipc.PhoenixIndexRpcSchedulerTest
Tests run: 7, Failures: 0, Errors: 7, Skipped: 0, Time elapsed: 5.665 sec <<< FAILURE!
- in org.apache.phoenix.jdbc.SecureUserConnectionsTest
testMultipleConnectionsAsSameUserWithoutLogin(org.apache.phoenix.jdbc.SecureUserConnectionsTest)
 Time elapsed: 0.257 sec  <<< ERROR!
java.sql.SQLException: ERROR 103 (08004): Unable to establish connection.
	at org.apache.phoenix.jdbc.SecureUserConnectionsTest.testMultipleConnectionsAsSameUserWithoutLogin(SecureUserConnectionsTest.java:326)
Caused by: java.io.IOException: Login failure for user1@EXAMPLE.COM from keytab <https://builds.apache.org/job/Phoenix-4.8-HBase-0.98/ws/phoenix-core/target/SecureUserConnectionsTest/keytabs/user1.keytab>:
javax.security.auth.login.LoginException: java.lang.IllegalArgumentException: Illegal principal
name user1@EXAMPLE.COM: org.apache.hadoop.security.authentication.util.KerberosName$NoMatchingRule:
No rules applied to user1@EXAMPLE.COM
	at org.apache.phoenix.jdbc.SecureUserConnectionsTest.testMultipleConnectionsAsSameUserWithoutLogin(SecureUserConnectionsTest.java:326)
Caused by: javax.security.auth.login.LoginException: java.lang.IllegalArgumentException: Illegal
principal name user1@EXAMPLE.COM: org.apache.hadoop.security.authentication.util.KerberosName$NoMatchingRule:
No rules applied to user1@EXAMPLE.COM
	at org.apache.phoenix.jdbc.SecureUserConnectionsTest.testMultipleConnectionsAsSameUserWithoutLogin(SecureUserConnectionsTest.java:326)
Caused by: java.lang.IllegalArgumentException: Illegal principal name user1@EXAMPLE.COM: org.apache.hadoop.security.authentication.util.KerberosName$NoMatchingRule:
No rules applied to user1@EXAMPLE.COM
	at org.apache.phoenix.jdbc.SecureUserConnectionsTest.testMultipleConnectionsAsSameUserWithoutLogin(SecureUserConnectionsTest.java:326)
Caused by: org.apache.hadoop.security.authentication.util.KerberosName$NoMatchingRule: No
rules applied to user1@EXAMPLE.COM
	at org.apache.phoenix.jdbc.SecureUserConnectionsTest.testMultipleConnectionsAsSameUserWithoutLogin(SecureUserConnectionsTest.java:326)

testAlternatingDestructiveLogins(org.apache.phoenix.jdbc.SecureUserConnectionsTest)  Time
elapsed: 0.019 sec  <<< ERROR!
java.io.IOException: Login failure for user1@EXAMPLE.COM from keytab <https://builds.apache.org/job/Phoenix-4.8-HBase-0.98/ws/phoenix-core/target/SecureUserConnectionsTest/keytabs/user1.keytab>:
javax.security.auth.login.LoginException: java.lang.IllegalArgumentException: Illegal principal
name user1@EXAMPLE.COM: org.apache.hadoop.security.authentication.util.KerberosName$NoMatchingRule:
No rules applied to user1@EXAMPLE.COM
	at org.apache.phoenix.jdbc.SecureUserConnectionsTest.testAlternatingDestructiveLogins(SecureUserConnectionsTest.java:280)
Caused by: javax.security.auth.login.LoginException: java.lang.IllegalArgumentException: Illegal
principal name user1@EXAMPLE.COM: org.apache.hadoop.security.authentication.util.KerberosName$NoMatchingRule:
No rules applied to user1@EXAMPLE.COM
	at org.apache.phoenix.jdbc.SecureUserConnectionsTest.testAlternatingDestructiveLogins(SecureUserConnectionsTest.java:280)
Caused by: java.lang.IllegalArgumentException: Illegal principal name user1@EXAMPLE.COM: org.apache.hadoop.security.authentication.util.KerberosName$NoMatchingRule:
No rules applied to user1@EXAMPLE.COM
	at org.apache.phoenix.jdbc.SecureUserConnectionsTest.testAlternatingDestructiveLogins(SecureUserConnectionsTest.java:280)
Caused by: org.apache.hadoop.security.authentication.util.KerberosName$NoMatchingRule: No
rules applied to user1@EXAMPLE.COM
	at org.apache.phoenix.jdbc.SecureUserConnectionsTest.testAlternatingDestructiveLogins(SecureUserConnectionsTest.java:280)

testAlternatingLogins(org.apache.phoenix.jdbc.SecureUserConnectionsTest)  Time elapsed: 0.016
sec  <<< ERROR!
java.io.IOException: Login failure for user1@EXAMPLE.COM from keytab <https://builds.apache.org/job/Phoenix-4.8-HBase-0.98/ws/phoenix-core/target/SecureUserConnectionsTest/keytabs/user1.keytab>
	at org.apache.phoenix.jdbc.SecureUserConnectionsTest.testAlternatingLogins(SecureUserConnectionsTest.java:234)
Caused by: javax.security.auth.login.LoginException: java.lang.IllegalArgumentException: Illegal
principal name user1@EXAMPLE.COM: org.apache.hadoop.security.authentication.util.KerberosName$NoMatchingRule:
No rules applied to user1@EXAMPLE.COM
	at org.apache.phoenix.jdbc.SecureUserConnectionsTest.testAlternatingLogins(SecureUserConnectionsTest.java:234)
Caused by: java.lang.IllegalArgumentException: Illegal principal name user1@EXAMPLE.COM: org.apache.hadoop.security.authentication.util.KerberosName$NoMatchingRule:
No rules applied to user1@EXAMPLE.COM
	at org.apache.phoenix.jdbc.SecureUserConnectionsTest.testAlternatingLogins(SecureUserConnectionsTest.java:234)
Caused by: org.apache.hadoop.security.authentication.util.KerberosName$NoMatchingRule: No
rules applied to user1@EXAMPLE.COM
	at org.apache.phoenix.jdbc.SecureUserConnectionsTest.testAlternatingLogins(SecureUserConnectionsTest.java:234)

testAlternatingConnectionsWithoutLogin(org.apache.phoenix.jdbc.SecureUserConnectionsTest)
 Time elapsed: 0.015 sec  <<< ERROR!
java.sql.SQLException: ERROR 103 (08004): Unable to establish connection.
	at org.apache.phoenix.jdbc.SecureUserConnectionsTest.testAlternatingConnectionsWithoutLogin(SecureUserConnectionsTest.java:347)
Caused by: java.io.IOException: Login failure for user1@EXAMPLE.COM from keytab <https://builds.apache.org/job/Phoenix-4.8-HBase-0.98/ws/phoenix-core/target/SecureUserConnectionsTest/keytabs/user1.keytab>:
javax.security.auth.login.LoginException: java.lang.IllegalArgumentException: Illegal principal
name user1@EXAMPLE.COM: org.apache.hadoop.security.authentication.util.KerberosName$NoMatchingRule:
No rules applied to user1@EXAMPLE.COM
	at org.apache.phoenix.jdbc.SecureUserConnectionsTest.testAlternatingConnectionsWithoutLogin(SecureUserConnectionsTest.java:347)
Caused by: javax.security.auth.login.LoginException: java.lang.IllegalArgumentException: Illegal
principal name user1@EXAMPLE.COM: org.apache.hadoop.security.authentication.util.KerberosName$NoMatchingRule:
No rules applied to user1@EXAMPLE.COM
	at org.apache.phoenix.jdbc.SecureUserConnectionsTest.testAlternatingConnectionsWithoutLogin(SecureUserConnectionsTest.java:347)
Caused by: java.lang.IllegalArgumentException: Illegal principal name user1@EXAMPLE.COM: org.apache.hadoop.security.authentication.util.KerberosName$NoMatchingRule:
No rules applied to user1@EXAMPLE.COM
	at org.apache.phoenix.jdbc.SecureUserConnectionsTest.testAlternatingConnectionsWithoutLogin(SecureUserConnectionsTest.java:347)
Caused by: org.apache.hadoop.security.authentication.util.KerberosName$NoMatchingRule: No
rules applied to user1@EXAMPLE.COM
	at org.apache.phoenix.jdbc.SecureUserConnectionsTest.testAlternatingConnectionsWithoutLogin(SecureUserConnectionsTest.java:347)

testMultipleUniqueUGIInstancesAreDisjoint(org.apache.phoenix.jdbc.SecureUserConnectionsTest)
 Time elapsed: 0.015 sec  <<< ERROR!
java.io.IOException: Login failure for user1@EXAMPLE.COM from keytab <https://builds.apache.org/job/Phoenix-4.8-HBase-0.98/ws/phoenix-core/target/SecureUserConnectionsTest/keytabs/user1.keytab>
	at org.apache.phoenix.jdbc.SecureUserConnectionsTest.testMultipleUniqueUGIInstancesAreDisjoint(SecureUserConnectionsTest.java:204)
Caused by: javax.security.auth.login.LoginException: java.lang.IllegalArgumentException: Illegal
principal name user1@EXAMPLE.COM: org.apache.hadoop.security.authentication.util.KerberosName$NoMatchingRule:
No rules applied to user1@EXAMPLE.COM
	at org.apache.phoenix.jdbc.SecureUserConnectionsTest.testMultipleUniqueUGIInstancesAreDisjoint(SecureUserConnectionsTest.java:204)
Caused by: java.lang.IllegalArgumentException: Illegal principal name user1@EXAMPLE.COM: org.apache.hadoop.security.authentication.util.KerberosName$NoMatchingRule:
No rules applied to user1@EXAMPLE.COM
	at org.apache.phoenix.jdbc.SecureUserConnectionsTest.testMultipleUniqueUGIInstancesAreDisjoint(SecureUserConnectionsTest.java:204)
Caused by: org.apache.hadoop.security.authentication.util.KerberosName$NoMatchingRule: No
rules applied to user1@EXAMPLE.COM
	at org.apache.phoenix.jdbc.SecureUserConnectionsTest.testMultipleUniqueUGIInstancesAreDisjoint(SecureUserConnectionsTest.java:204)

testMultipleInvocationsBySameUserAreEquivalent(org.apache.phoenix.jdbc.SecureUserConnectionsTest)
 Time elapsed: 0.015 sec  <<< ERROR!
java.io.IOException: Login failure for user1@EXAMPLE.COM from keytab <https://builds.apache.org/job/Phoenix-4.8-HBase-0.98/ws/phoenix-core/target/SecureUserConnectionsTest/keytabs/user1.keytab>
	at org.apache.phoenix.jdbc.SecureUserConnectionsTest.testMultipleInvocationsBySameUserAreEquivalent(SecureUserConnectionsTest.java:178)
Caused by: javax.security.auth.login.LoginException: java.lang.IllegalArgumentException: Illegal
principal name user1@EXAMPLE.COM: org.apache.hadoop.security.authentication.util.KerberosName$NoMatchingRule:
No rules applied to user1@EXAMPLE.COM
	at org.apache.phoenix.jdbc.SecureUserConnectionsTest.testMultipleInvocationsBySameUserAreEquivalent(SecureUserConnectionsTest.java:178)
Caused by: java.lang.IllegalArgumentException: Illegal principal name user1@EXAMPLE.COM: org.apache.hadoop.security.authentication.util.KerberosName$NoMatchingRule:
No rules applied to user1@EXAMPLE.COM
	at org.apache.phoenix.jdbc.SecureUserConnectionsTest.testMultipleInvocationsBySameUserAreEquivalent(SecureUserConnectionsTest.java:178)
Caused by: org.apache.hadoop.security.authentication.util.KerberosName$NoMatchingRule: No
rules applied to user1@EXAMPLE.COM
	at org.apache.phoenix.jdbc.SecureUserConnectionsTest.testMultipleInvocationsBySameUserAreEquivalent(SecureUserConnectionsTest.java:178)

testMultipleConnectionsAsSameUser(org.apache.phoenix.jdbc.SecureUserConnectionsTest)  Time
elapsed: 0.013 sec  <<< ERROR!
java.io.IOException: Login failure for user1@EXAMPLE.COM from keytab <https://builds.apache.org/job/Phoenix-4.8-HBase-0.98/ws/phoenix-core/target/SecureUserConnectionsTest/keytabs/user1.keytab>:
javax.security.auth.login.LoginException: java.lang.IllegalArgumentException: Illegal principal
name user1@EXAMPLE.COM: org.apache.hadoop.security.authentication.util.KerberosName$NoMatchingRule:
No rules applied to user1@EXAMPLE.COM
	at org.apache.phoenix.jdbc.SecureUserConnectionsTest.testMultipleConnectionsAsSameUser(SecureUserConnectionsTest.java:306)
Caused by: javax.security.auth.login.LoginException: java.lang.IllegalArgumentException: Illegal
principal name user1@EXAMPLE.COM: org.apache.hadoop.security.authentication.util.KerberosName$NoMatchingRule:
No rules applied to user1@EXAMPLE.COM
	at org.apache.phoenix.jdbc.SecureUserConnectionsTest.testMultipleConnectionsAsSameUser(SecureUserConnectionsTest.java:306)
Caused by: java.lang.IllegalArgumentException: Illegal principal name user1@EXAMPLE.COM: org.apache.hadoop.security.authentication.util.KerberosName$NoMatchingRule:
No rules applied to user1@EXAMPLE.COM
	at org.apache.phoenix.jdbc.SecureUserConnectionsTest.testMultipleConnectionsAsSameUser(SecureUserConnectionsTest.java:306)
Caused by: org.apache.hadoop.security.authentication.util.KerberosName$NoMatchingRule: No
rules applied to user1@EXAMPLE.COM
	at org.apache.phoenix.jdbc.SecureUserConnectionsTest.testMultipleConnectionsAsSameUser(SecureUserConnectionsTest.java:306)

Tests run: 2, Failures: 0, Errors: 0, Skipped: 0, Time elapsed: 5.083 sec - in org.apache.phoenix.query.ScannerLeaseRenewalTest

Results :

Tests in error: 
  SecureUserConnectionsTest.testAlternatingConnectionsWithoutLogin:347 » SQL ERR...
  SecureUserConnectionsTest.testAlternatingDestructiveLogins:280 » IO Login fail...
  SecureUserConnectionsTest.testAlternatingLogins:234 » IO Login failure for use...
  SecureUserConnectionsTest.testMultipleConnectionsAsSameUser:306 » IO Login fai...
  SecureUserConnectionsTest.testMultipleConnectionsAsSameUserWithoutLogin:326 » SQL
  SecureUserConnectionsTest.testMultipleInvocationsBySameUserAreEquivalent:178 » IO
  SecureUserConnectionsTest.testMultipleUniqueUGIInstancesAreDisjoint:204 » IO L...

Tests run: 1393, Failures: 0, Errors: 7, Skipped: 5

[INFO] ------------------------------------------------------------------------
[INFO] Reactor Summary:
[INFO] 
[INFO] Apache Phoenix ..................................... SUCCESS [  2.707 s]
[INFO] Phoenix Core ....................................... FAILURE [ 55.917 s]
[INFO] Phoenix - Flume .................................... SKIPPED
[INFO] Phoenix - Pig ...................................... SKIPPED
[INFO] Phoenix Query Server Client ........................ SKIPPED
[INFO] Phoenix Query Server ............................... SKIPPED
[INFO] Phoenix - Pherf .................................... SKIPPED
[INFO] Phoenix - Spark .................................... SKIPPED
[INFO] Phoenix - Hive ..................................... SKIPPED
[INFO] Phoenix Client ..................................... SKIPPED
[INFO] Phoenix Server ..................................... SKIPPED
[INFO] Phoenix Assembly ................................... SKIPPED
[INFO] Phoenix - Tracing Web Application .................. SKIPPED
[INFO] ------------------------------------------------------------------------
[INFO] BUILD FAILURE
[INFO] ------------------------------------------------------------------------
[INFO] Total time: 01:00 min
[INFO] Finished at: 2016-09-01T01:00:24+00:00
[INFO] Final Memory: 82M/1372M
[INFO] ------------------------------------------------------------------------
[ERROR] Failed to execute goal org.apache.maven.plugins:maven-surefire-plugin:2.19.1:test
(default-test) on project phoenix-core: There are test failures.
[ERROR] 
[ERROR] Please refer to <https://builds.apache.org/job/Phoenix-4.8-HBase-0.98/ws/phoenix-core/target/surefire-reports>
for the individual test results.
[ERROR] -> [Help 1]
[ERROR] 
[ERROR] To see the full stack trace of the errors, re-run Maven with the -e switch.
[ERROR] Re-run Maven using the -X switch to enable full debug logging.
[ERROR] 
[ERROR] For more information about the errors and possible solutions, please read the following
articles:
[ERROR] [Help 1] http://cwiki.apache.org/confluence/display/MAVEN/MojoFailureException
[ERROR] 
[ERROR] After correcting the problems, you can resume the build with the command
[ERROR]   mvn <goals> -rf :phoenix-core
Build step 'Invoke top-level Maven targets' marked build as failure
Archiving artifacts
Recording test results

Mime
View raw message