phoenix-commits mailing list archives

Site index · List index
Message view « Date » · « Thread »
Top « Date » · « Thread »
From Apache Jenkins Server <jenk...@builds.apache.org>
Subject Build failed in Jenkins: Phoenix-4.x-HBase-1.1 #201
Date Mon, 19 Sep 2016 17:42:38 GMT
See <https://builds.apache.org/job/Phoenix-4.x-HBase-1.1/201/changes>

Changes:

[jamestaylor] PHOENIX-3293 Create separate test categories for stats enabled and

[jamestaylor] PHOENIX-3268 Upgrade to Tephra 0.9.0

------------------------------------------
[...truncated 1105 lines...]

Results :

Failed tests: 
  PhoenixTracingEndToEndIT.testClientServerIndexingTracing:233 Never found indexing updates
  PhoenixTracingEndToEndIT.testCustomAnnotationTracing:393 Get expected updates to trace table
  PhoenixTracingEndToEndIT.testScanTracing:290 Get expected updates to trace table
  PhoenixTracingEndToEndIT.testScanTracingOnServer:341 Get expected updates to trace table
Tests in error: 
  GlobalIndexOptimizationIT.testGlobalIndexOptimizationOnSharedIndex:338 ยป TableAlreadyExists

Tests run: 1315, Failures: 4, Errors: 1, Skipped: 5

[INFO] 
[INFO] --- maven-failsafe-plugin:2.19.1:integration-test (ClientManagedTimeTests) @ phoenix-core
---

-------------------------------------------------------
 T E S T S
-------------------------------------------------------
Running org.apache.phoenix.end2end.ColumnProjectionOptimizationIT
Running org.apache.phoenix.end2end.ArrayIT
Running org.apache.phoenix.end2end.CastAndCoerceIT
Running org.apache.phoenix.end2end.CaseStatementIT
Running org.apache.phoenix.end2end.CreateSchemaIT
Tests run: 1, Failures: 0, Errors: 0, Skipped: 0, Time elapsed: 0.673 sec - in org.apache.phoenix.end2end.CreateSchemaIT
Running org.apache.phoenix.end2end.AggregateQueryIT
Running org.apache.phoenix.end2end.ClientTimeArithmeticQueryIT
Running org.apache.phoenix.end2end.CreateTableIT
Tests run: 3, Failures: 0, Errors: 0, Skipped: 0, Time elapsed: 26.109 sec - in org.apache.phoenix.end2end.ColumnProjectionOptimizationIT
Running org.apache.phoenix.end2end.CustomEntityDataIT
Tests run: 3, Failures: 0, Errors: 0, Skipped: 0, Time elapsed: 6.443 sec - in org.apache.phoenix.end2end.CustomEntityDataIT
Running org.apache.phoenix.end2end.DerivedTableIT
Tests run: 49, Failures: 0, Errors: 0, Skipped: 0, Time elapsed: 54.464 sec - in org.apache.phoenix.end2end.CastAndCoerceIT
Running org.apache.phoenix.end2end.DistinctCountIT
Tests run: 18, Failures: 0, Errors: 0, Skipped: 0, Time elapsed: 24.482 sec - in org.apache.phoenix.end2end.DerivedTableIT
Running org.apache.phoenix.end2end.DropSchemaIT
Tests run: 63, Failures: 0, Errors: 0, Skipped: 0, Time elapsed: 56.628 sec - in org.apache.phoenix.end2end.CaseStatementIT
Running org.apache.phoenix.end2end.ExtendedQueryExecIT
Tests run: 4, Failures: 0, Errors: 0, Skipped: 0, Time elapsed: 7.179 sec - in org.apache.phoenix.end2end.ExtendedQueryExecIT
Running org.apache.phoenix.end2end.FunkyNamesIT
Tests run: 2, Failures: 0, Errors: 0, Skipped: 0, Time elapsed: 11.132 sec - in org.apache.phoenix.end2end.DropSchemaIT
Running org.apache.phoenix.end2end.GroupByIT
Tests run: 3, Failures: 0, Errors: 0, Skipped: 0, Time elapsed: 5.65 sec - in org.apache.phoenix.end2end.FunkyNamesIT
Tests run: 49, Failures: 0, Errors: 0, Skipped: 0, Time elapsed: 70.365 sec - in org.apache.phoenix.end2end.AggregateQueryIT
Running org.apache.phoenix.end2end.NotQueryIT
Tests run: 10, Failures: 0, Errors: 0, Skipped: 0, Time elapsed: 20.128 sec - in org.apache.phoenix.end2end.DistinctCountIT
Running org.apache.phoenix.end2end.PointInTimeQueryIT
Running org.apache.phoenix.end2end.NativeHBaseTypesIT
Tests run: 7, Failures: 0, Errors: 0, Skipped: 0, Time elapsed: 5.713 sec - in org.apache.phoenix.end2end.NativeHBaseTypesIT
Running org.apache.phoenix.end2end.ProductMetricsIT
Tests run: 79, Failures: 0, Errors: 0, Skipped: 0, Time elapsed: 96.652 sec - in org.apache.phoenix.end2end.ArrayIT
Running org.apache.phoenix.end2end.QueryDatabaseMetaDataIT
Tests run: 15, Failures: 0, Errors: 0, Skipped: 0, Time elapsed: 95.392 sec - in org.apache.phoenix.end2end.CreateTableIT
Running org.apache.phoenix.end2end.QueryIT
Tests run: 14, Failures: 0, Errors: 0, Skipped: 0, Time elapsed: 26.234 sec - in org.apache.phoenix.end2end.PointInTimeQueryIT
Running org.apache.phoenix.end2end.ReadIsolationLevelIT
Tests run: 2, Failures: 0, Errors: 0, Skipped: 0, Time elapsed: 5.528 sec - in org.apache.phoenix.end2end.ReadIsolationLevelIT
Running org.apache.phoenix.end2end.RowValueConstructorIT
Tests run: 61, Failures: 0, Errors: 0, Skipped: 0, Time elapsed: 32.433 sec - in org.apache.phoenix.end2end.ProductMetricsIT
Running org.apache.phoenix.end2end.ScanQueryIT
Tests run: 77, Failures: 0, Errors: 0, Skipped: 0, Time elapsed: 53.857 sec - in org.apache.phoenix.end2end.NotQueryIT
Running org.apache.phoenix.end2end.SequenceBulkAllocationIT
Tests run: 105, Failures: 0, Errors: 0, Skipped: 0, Time elapsed: 76.116 sec - in org.apache.phoenix.end2end.GroupByIT
Running org.apache.phoenix.end2end.SequenceIT
Tests run: 245, Failures: 0, Errors: 0, Skipped: 0, Time elapsed: 168.834 sec - in org.apache.phoenix.end2end.ClientTimeArithmeticQueryIT
Running org.apache.phoenix.end2end.ToNumberFunctionIT
Tests run: 56, Failures: 0, Errors: 0, Skipped: 0, Time elapsed: 44.645 sec - in org.apache.phoenix.end2end.SequenceBulkAllocationIT
Running org.apache.phoenix.end2end.TopNIT
Tests run: 126, Failures: 0, Errors: 0, Skipped: 0, Time elapsed: 78.05 sec - in org.apache.phoenix.end2end.QueryIT
Running org.apache.phoenix.end2end.TruncateFunctionIT
Tests run: 4, Failures: 0, Errors: 0, Skipped: 0, Time elapsed: 7.276 sec - in org.apache.phoenix.end2end.TopNIT
Running org.apache.phoenix.end2end.UpsertSelectIT
Tests run: 18, Failures: 0, Errors: 0, Skipped: 0, Time elapsed: 10.792 sec - in org.apache.phoenix.end2end.ToNumberFunctionIT
Running org.apache.phoenix.end2end.UpsertValuesIT
Tests run: 1, Failures: 0, Errors: 0, Skipped: 0, Time elapsed: 6.013 sec - in org.apache.phoenix.end2end.TruncateFunctionIT
Running org.apache.phoenix.end2end.VariableLengthPKIT
Tests run: 119, Failures: 0, Errors: 0, Skipped: 0, Time elapsed: 70.658 sec - in org.apache.phoenix.end2end.ScanQueryIT
Running org.apache.phoenix.end2end.salted.SaltedTableIT
Tests run: 8, Failures: 0, Errors: 0, Skipped: 0, Time elapsed: 8.023 sec - in org.apache.phoenix.end2end.salted.SaltedTableIT
Running org.apache.phoenix.rpc.UpdateCacheWithScnIT
Tests run: 54, Failures: 0, Errors: 0, Skipped: 0, Time elapsed: 58.07 sec - in org.apache.phoenix.end2end.SequenceIT
Tests run: 1, Failures: 0, Errors: 0, Skipped: 0, Time elapsed: 6.556 sec - in org.apache.phoenix.rpc.UpdateCacheWithScnIT
Tests run: 19, Failures: 0, Errors: 0, Skipped: 0, Time elapsed: 130.561 sec - in org.apache.phoenix.end2end.QueryDatabaseMetaDataIT
Tests run: 50, Failures: 0, Errors: 0, Skipped: 0, Time elapsed: 50.436 sec - in org.apache.phoenix.end2end.VariableLengthPKIT
Tests run: 46, Failures: 0, Errors: 0, Skipped: 0, Time elapsed: 126.77 sec - in org.apache.phoenix.end2end.RowValueConstructorIT
Tests run: 24, Failures: 0, Errors: 0, Skipped: 0, Time elapsed: 120.342 sec - in org.apache.phoenix.end2end.UpsertValuesIT
Tests run: 20, Failures: 0, Errors: 0, Skipped: 0, Time elapsed: 136.343 sec - in org.apache.phoenix.end2end.UpsertSelectIT

Results :

Tests run: 1356, Failures: 0, Errors: 0, Skipped: 0

[INFO] 
[INFO] --- maven-failsafe-plugin:2.19.1:integration-test (HBaseManagedTimeTests) @ phoenix-core
---

-------------------------------------------------------
 T E S T S
-------------------------------------------------------
Running org.apache.phoenix.end2end.HashJoinIT
Running org.apache.phoenix.end2end.HashJoinLocalIndexIT
Running org.apache.phoenix.end2end.SortMergeJoinIT
Running org.apache.phoenix.end2end.SubqueryUsingSortMergeJoinIT
Running org.apache.phoenix.end2end.SpooledSortMergeJoinIT
Running org.apache.phoenix.end2end.UpgradeIT
Running org.apache.phoenix.end2end.SubqueryIT
Tests run: 1, Failures: 0, Errors: 0, Skipped: 0, Time elapsed: 43.1 sec - in org.apache.phoenix.end2end.HashJoinLocalIndexIT
Tests run: 15, Failures: 0, Errors: 0, Skipped: 0, Time elapsed: 88.512 sec - in org.apache.phoenix.end2end.SubqueryUsingSortMergeJoinIT
Tests run: 21, Failures: 0, Errors: 0, Skipped: 0, Time elapsed: 95.82 sec - in org.apache.phoenix.end2end.SubqueryIT
Tests run: 99, Failures: 0, Errors: 0, Skipped: 0, Time elapsed: 145.121 sec - in org.apache.phoenix.end2end.HashJoinIT
Tests run: 102, Failures: 0, Errors: 0, Skipped: 0, Time elapsed: 149.064 sec - in org.apache.phoenix.end2end.SortMergeJoinIT
Tests run: 102, Failures: 0, Errors: 0, Skipped: 0, Time elapsed: 148.963 sec - in org.apache.phoenix.end2end.SpooledSortMergeJoinIT
Tests run: 8, Failures: 0, Errors: 0, Skipped: 0, Time elapsed: 385.91 sec - in org.apache.phoenix.end2end.UpgradeIT

Results :

Tests run: 348, Failures: 0, Errors: 0, Skipped: 0

[INFO] 
[INFO] --- maven-failsafe-plugin:2.19.1:integration-test (NeedTheirOwnClusterTests) @ phoenix-core
---

-------------------------------------------------------
 T E S T S
-------------------------------------------------------
Running org.apache.hadoop.hbase.regionserver.wal.WALReplayWithIndexWritesAndUncompressedWALInHBase_094_9_IT
Running org.apache.hadoop.hbase.regionserver.wal.WALReplayWithIndexWritesAndCompressedWALIT
Running org.apache.phoenix.end2end.ConnectionUtilIT
Running org.apache.phoenix.coprocessor.StatisticsCollectionRunTrackerIT
Tests run: 1, Failures: 0, Errors: 0, Skipped: 0, Time elapsed: 30.246 sec - in org.apache.hadoop.hbase.regionserver.wal.WALReplayWithIndexWritesAndUncompressedWALInHBase_094_9_IT
Tests run: 1, Failures: 0, Errors: 0, Skipped: 0, Time elapsed: 30.47 sec - in org.apache.hadoop.hbase.regionserver.wal.WALReplayWithIndexWritesAndCompressedWALIT
Running org.apache.phoenix.end2end.CountDistinctCompressionIT
Running org.apache.phoenix.end2end.ContextClassloaderIT
Running org.apache.phoenix.end2end.CsvBulkLoadToolIT
Tests run: 1, Failures: 0, Errors: 0, Skipped: 0, Time elapsed: 10.386 sec - in org.apache.phoenix.end2end.CountDistinctCompressionIT
Tests run: 1, Failures: 0, Errors: 0, Skipped: 0, Time elapsed: 28.104 sec - in org.apache.phoenix.end2end.ConnectionUtilIT
Tests run: 3, Failures: 0, Errors: 0, Skipped: 0, Time elapsed: 9.196 sec - in org.apache.phoenix.end2end.ContextClassloaderIT
Tests run: 4, Failures: 0, Errors: 0, Skipped: 0, Time elapsed: 24.312 sec - in org.apache.phoenix.coprocessor.StatisticsCollectionRunTrackerIT
Running org.apache.phoenix.end2end.KeyOnlyIT
Running org.apache.phoenix.end2end.IndexExtendedIT
Running org.apache.phoenix.end2end.MultiCfQueryExecIT
Running org.apache.phoenix.end2end.ParallelIteratorsIT
Tests run: 3, Failures: 0, Errors: 0, Skipped: 0, Time elapsed: 14.038 sec - in org.apache.phoenix.end2end.KeyOnlyIT
Running org.apache.phoenix.end2end.QueryWithLimitIT
Running org.apache.phoenix.end2end.QueryTimeoutIT
Tests run: 9, Failures: 0, Errors: 0, Skipped: 0, Time elapsed: 23.211 sec - in org.apache.phoenix.end2end.MultiCfQueryExecIT
Tests run: 10, Failures: 0, Errors: 0, Skipped: 0, Time elapsed: 71.185 sec - in org.apache.phoenix.end2end.CsvBulkLoadToolIT
Tests run: 2, Failures: 0, Errors: 0, Skipped: 0, Time elapsed: 22.071 sec - in org.apache.phoenix.end2end.QueryWithLimitIT
Tests run: 2, Failures: 0, Errors: 0, Skipped: 0, Time elapsed: 22.211 sec - in org.apache.phoenix.end2end.QueryTimeoutIT
Tests run: 3, Failures: 0, Errors: 0, Skipped: 0, Time elapsed: 31.702 sec - in org.apache.phoenix.end2end.ParallelIteratorsIT
Running org.apache.phoenix.end2end.QueryWithOffsetIT
Tests run: 8, Failures: 0, Errors: 0, Skipped: 0, Time elapsed: 14.35 sec - in org.apache.phoenix.end2end.QueryWithOffsetIT
Running org.apache.phoenix.end2end.RenewLeaseIT
Running org.apache.phoenix.end2end.SaltedViewIT
Running org.apache.phoenix.end2end.SpillableGroupByIT
Tests run: 1, Failures: 0, Errors: 0, Skipped: 0, Time elapsed: 12.773 sec - in org.apache.phoenix.end2end.RenewLeaseIT
Running org.apache.phoenix.end2end.StatsCollectionDisabledIT
Running org.apache.phoenix.end2end.StatsCollectorIT
Running org.apache.phoenix.end2end.StatsCollectorWithSplitsAndMultiCFIT
Tests run: 1, Failures: 0, Errors: 0, Skipped: 0, Time elapsed: 11.271 sec - in org.apache.phoenix.end2end.SpillableGroupByIT
Tests run: 1, Failures: 0, Errors: 0, Skipped: 0, Time elapsed: 11.122 sec - in org.apache.phoenix.end2end.StatsCollectionDisabledIT
Tests run: 2, Failures: 0, Errors: 0, Skipped: 0, Time elapsed: 12.487 sec - in org.apache.phoenix.end2end.StatsCollectorWithSplitsAndMultiCFIT
Tests run: 4, Failures: 0, Errors: 0, Skipped: 0, Time elapsed: 40.426 sec - in org.apache.phoenix.end2end.SaltedViewIT
Running org.apache.phoenix.end2end.TenantSpecificTablesDDLIT
Running org.apache.phoenix.end2end.TenantSpecificTablesDMLIT
Running org.apache.phoenix.end2end.TransactionalViewIT
Tests run: 2, Failures: 0, Errors: 0, Skipped: 0, Time elapsed: 11.914 sec - in org.apache.phoenix.end2end.TransactionalViewIT
Tests run: 16, Failures: 0, Errors: 0, Skipped: 0, Time elapsed: 21.055 sec - in org.apache.phoenix.end2end.TenantSpecificTablesDMLIT
Running org.apache.phoenix.end2end.UserDefinedFunctionsIT
Running org.apache.phoenix.end2end.ViewIT
Tests run: 17, Failures: 0, Errors: 0, Skipped: 0, Time elapsed: 43.223 sec - in org.apache.phoenix.end2end.TenantSpecificTablesDDLIT
Running org.apache.phoenix.end2end.index.ImmutableIndexWithStatsIT
Running org.apache.phoenix.end2end.index.MutableIndexFailureIT
Tests run: 1, Failures: 0, Errors: 0, Skipped: 0, Time elapsed: 12.957 sec - in org.apache.phoenix.end2end.index.ImmutableIndexWithStatsIT
Running org.apache.phoenix.end2end.index.MutableIndexReplicationIT
Tests run: 14, Failures: 0, Errors: 0, Skipped: 0, Time elapsed: 58.255 sec - in org.apache.phoenix.end2end.UserDefinedFunctionsIT
Running org.apache.phoenix.end2end.index.ReadOnlyIndexFailureIT
Tests run: 16, Failures: 0, Errors: 0, Skipped: 0, Time elapsed: 134.629 sec - in org.apache.phoenix.end2end.StatsCollectorIT
Tests run: 1, Failures: 0, Errors: 0, Skipped: 0, Time elapsed: 25.946 sec - in org.apache.phoenix.end2end.index.MutableIndexReplicationIT
Running org.apache.phoenix.hbase.index.FailForUnsupportedHBaseVersionsIT
Tests run: 2, Failures: 0, Errors: 0, Skipped: 0, Time elapsed: 23.86 sec - in org.apache.phoenix.end2end.index.ReadOnlyIndexFailureIT
Tests run: 2, Failures: 0, Errors: 0, Skipped: 0, Time elapsed: 20.96 sec - in org.apache.phoenix.hbase.index.FailForUnsupportedHBaseVersionsIT
Running org.apache.phoenix.end2end.index.txn.TxWriteFailureIT
Running org.apache.phoenix.hbase.index.covered.EndToEndCoveredColumnsIndexBuilderIT
Running org.apache.phoenix.execute.PartialCommitIT
Tests run: 2, Failures: 0, Errors: 0, Skipped: 0, Time elapsed: 18.35 sec - in org.apache.phoenix.hbase.index.covered.EndToEndCoveredColumnsIndexBuilderIT
Tests run: 12, Failures: 0, Errors: 0, Skipped: 0, Time elapsed: 6.674 sec - in org.apache.phoenix.execute.PartialCommitIT
Running org.apache.phoenix.hbase.index.covered.example.EndToEndCoveredIndexingIT
Tests run: 8, Failures: 0, Errors: 0, Skipped: 0, Time elapsed: 31.781 sec - in org.apache.phoenix.end2end.index.txn.TxWriteFailureIT
Running org.apache.phoenix.hbase.index.covered.example.FailWithoutRetriesIT
Tests run: 80, Failures: 0, Errors: 0, Skipped: 0, Time elapsed: 287.19 sec - in org.apache.phoenix.end2end.IndexExtendedIT
Tests run: 1, Failures: 0, Errors: 0, Skipped: 0, Time elapsed: 8.602 sec - in org.apache.phoenix.hbase.index.covered.example.FailWithoutRetriesIT
Running org.apache.phoenix.hbase.index.covered.example.EndtoEndIndexingWithCompressionIT
Running org.apache.phoenix.iterate.RoundRobinResultIteratorWithStatsIT
Running org.apache.phoenix.iterate.ScannerLeaseRenewalIT
Running org.apache.phoenix.monitoring.PhoenixMetricsIT
Tests run: 1, Failures: 0, Errors: 0, Skipped: 0, Time elapsed: 12.577 sec - in org.apache.phoenix.iterate.RoundRobinResultIteratorWithStatsIT
Tests run: 48, Failures: 0, Errors: 0, Skipped: 0, Time elapsed: 190.127 sec - in org.apache.phoenix.end2end.ViewIT
Running org.apache.phoenix.rpc.PhoenixClientRpcIT
Tests run: 2, Failures: 0, Errors: 0, Skipped: 0, Time elapsed: 13.644 sec - in org.apache.phoenix.rpc.PhoenixClientRpcIT
Running org.apache.phoenix.rpc.PhoenixServerRpcIT
Tests run: 1, Failures: 0, Errors: 0, Skipped: 0, Time elapsed: 13.619 sec - in org.apache.phoenix.rpc.PhoenixServerRpcIT
Tests run: 18, Failures: 0, Errors: 0, Skipped: 0, Time elapsed: 69.438 sec - in org.apache.phoenix.monitoring.PhoenixMetricsIT
Tests run: 11, Failures: 0, Errors: 0, Skipped: 0, Time elapsed: 130.24 sec - in org.apache.phoenix.hbase.index.covered.example.EndToEndCoveredIndexingIT
Tests run: 11, Failures: 0, Errors: 0, Skipped: 0, Time elapsed: 139.742 sec - in org.apache.phoenix.hbase.index.covered.example.EndtoEndIndexingWithCompressionIT
Tests run: 2, Failures: 0, Errors: 0, Skipped: 0, Time elapsed: 172.72 sec - in org.apache.phoenix.iterate.ScannerLeaseRenewalIT
Tests run: 8, Failures: 0, Errors: 0, Skipped: 0, Time elapsed: 4,093.362 sec - in org.apache.phoenix.end2end.index.MutableIndexFailureIT

Results :

Tests run: 333, Failures: 0, Errors: 0, Skipped: 0

[INFO] 
[INFO] --- maven-failsafe-plugin:2.19.1:verify (ParallelStatsEnabledTest) @ phoenix-core ---
[INFO] ------------------------------------------------------------------------
[INFO] Reactor Summary:
[INFO] 
[INFO] Apache Phoenix ..................................... SUCCESS [  3.806 s]
[INFO] Phoenix Core ....................................... FAILURE [  01:53 h]
[INFO] Phoenix - Flume .................................... SKIPPED
[INFO] Phoenix - Pig ...................................... SKIPPED
[INFO] Phoenix Query Server Client ........................ SKIPPED
[INFO] Phoenix Query Server ............................... SKIPPED
[INFO] Phoenix - Pherf .................................... SKIPPED
[INFO] Phoenix - Spark .................................... SKIPPED
[INFO] Phoenix - Hive ..................................... SKIPPED
[INFO] Phoenix Client ..................................... SKIPPED
[INFO] Phoenix Server ..................................... SKIPPED
[INFO] Phoenix Assembly ................................... SKIPPED
[INFO] Phoenix - Tracing Web Application .................. SKIPPED
[INFO] ------------------------------------------------------------------------
[INFO] BUILD FAILURE
[INFO] ------------------------------------------------------------------------
[INFO] Total time: 01:53 h
[INFO] Finished at: 2016-09-19T17:38:03+00:00
[INFO] Final Memory: 61M/1025M
[INFO] ------------------------------------------------------------------------
[ERROR] Failed to execute goal org.apache.maven.plugins:maven-failsafe-plugin:2.19.1:verify
(ParallelStatsEnabledTest) on project phoenix-core: There was a timeout or other error in
the fork -> [Help 1]
[ERROR] 
[ERROR] To see the full stack trace of the errors, re-run Maven with the -e switch.
[ERROR] Re-run Maven using the -X switch to enable full debug logging.
[ERROR] 
[ERROR] For more information about the errors and possible solutions, please read the following
articles:
[ERROR] [Help 1] http://cwiki.apache.org/confluence/display/MAVEN/MojoExecutionException
[ERROR] 
[ERROR] After correcting the problems, you can resume the build with the command
[ERROR]   mvn <goals> -rf :phoenix-core
Build step 'Invoke top-level Maven targets' marked build as failure
Archiving artifacts
Compressed 988.42 MB of artifacts by 57.3% relative to #168
Recording test results

Mime
View raw message