phoenix-commits mailing list archives

Site index · List index
Message view « Date » · « Thread »
Top « Date » · « Thread »
From Apache Jenkins Server <jenk...@builds.apache.org>
Subject Build failed in Jenkins: Phoenix-4.8-HBase-0.98 #16
Date Sun, 11 Sep 2016 19:53:21 GMT
See <https://builds.apache.org/job/Phoenix-4.8-HBase-0.98/16/changes>

Changes:

[tdsilva] PHOENIX-1367 VIEW derived from another VIEW doesn't use parent VIEW

------------------------------------------
[...truncated 701 lines...]
Tests run: 9, Failures: 0, Errors: 0, Skipped: 0, Time elapsed: 62.731 sec - in org.apache.phoenix.iterate.RoundRobinResultIteratorIT
Running org.apache.phoenix.tx.TransactionIT
Tests run: 128, Failures: 0, Errors: 0, Skipped: 0, Time elapsed: 252.692 sec - in org.apache.phoenix.end2end.index.IndexIT
Running org.apache.phoenix.tx.TxCheckpointIT
Tests run: 6, Failures: 0, Errors: 0, Skipped: 0, Time elapsed: 84.362 sec - in org.apache.phoenix.trace.PhoenixTracingEndToEndIT
Tests run: 20, Failures: 0, Errors: 0, Skipped: 0, Time elapsed: 78.629 sec - in org.apache.phoenix.tx.TxCheckpointIT
Tests run: 21, Failures: 0, Errors: 0, Skipped: 1, Time elapsed: 142.029 sec - in org.apache.phoenix.tx.TransactionIT
Tests run: 40, Failures: 0, Errors: 0, Skipped: 0, Time elapsed: 347.951 sec - in org.apache.phoenix.end2end.index.LocalIndexIT
Tests run: 40, Failures: 0, Errors: 0, Skipped: 0, Time elapsed: 547.004 sec - in org.apache.phoenix.end2end.index.MutableIndexIT

Results :

Tests run: 1223, Failures: 0, Errors: 0, Skipped: 5

[INFO] 
[INFO] --- maven-failsafe-plugin:2.19.1:integration-test (HBaseManagedTimeTableReuseTest)
@ phoenix-core ---

-------------------------------------------------------
 T E S T S
-------------------------------------------------------
Running org.apache.phoenix.end2end.ArithmeticQueryIT
Running org.apache.phoenix.end2end.AbsFunctionEnd2EndIT
Running org.apache.phoenix.end2end.ArraysWithNullsIT
Tests run: 1, Failures: 0, Errors: 0, Skipped: 0, Time elapsed: 1.314 sec - in org.apache.phoenix.end2end.AbsFunctionEnd2EndIT
Running org.apache.phoenix.end2end.AutoCommitIT
Running org.apache.phoenix.end2end.ArrayFillFunctionIT
Running org.apache.phoenix.end2end.ArrayToStringFunctionIT
Tests run: 1, Failures: 0, Errors: 0, Skipped: 0, Time elapsed: 1.541 sec - in org.apache.phoenix.end2end.AutoCommitIT
Running org.apache.phoenix.end2end.CbrtFunctionEnd2EndIT
Tests run: 2, Failures: 0, Errors: 0, Skipped: 0, Time elapsed: 0.409 sec - in org.apache.phoenix.end2end.CbrtFunctionEnd2EndIT
Running org.apache.phoenix.end2end.ConvertTimezoneFunctionIT
Tests run: 26, Failures: 0, Errors: 0, Skipped: 0, Time elapsed: 8.573 sec - in org.apache.phoenix.end2end.ArrayFillFunctionIT
Running org.apache.phoenix.end2end.DecodeFunctionIT
Tests run: 36, Failures: 0, Errors: 0, Skipped: 0, Time elapsed: 9.405 sec - in org.apache.phoenix.end2end.ArrayToStringFunctionIT
Tests run: 7, Failures: 0, Errors: 0, Skipped: 0, Time elapsed: 6.186 sec - in org.apache.phoenix.end2end.ConvertTimezoneFunctionIT
Running org.apache.phoenix.end2end.DynamicFamilyIT
Tests run: 4, Failures: 0, Errors: 0, Skipped: 0, Time elapsed: 1.701 sec - in org.apache.phoenix.end2end.DynamicFamilyIT
Tests run: 16, Failures: 0, Errors: 0, Skipped: 0, Time elapsed: 16.053 sec - in org.apache.phoenix.end2end.ArraysWithNullsIT
Running org.apache.phoenix.end2end.DynamicUpsertIT
Tests run: 7, Failures: 0, Errors: 0, Skipped: 0, Time elapsed: 0.219 sec - in org.apache.phoenix.end2end.DynamicUpsertIT
Running org.apache.phoenix.end2end.FirstValueFunctionIT
Tests run: 6, Failures: 0, Errors: 0, Skipped: 0, Time elapsed: 6.385 sec - in org.apache.phoenix.end2end.DecodeFunctionIT
Running org.apache.phoenix.end2end.GetSetByteBitFunctionEnd2EndIT
Tests run: 1, Failures: 0, Errors: 0, Skipped: 0, Time elapsed: 0.228 sec - in org.apache.phoenix.end2end.GetSetByteBitFunctionEnd2EndIT
Running org.apache.phoenix.end2end.MD5FunctionIT
Running org.apache.phoenix.end2end.LikeExpressionIT
Tests run: 3, Failures: 0, Errors: 0, Skipped: 0, Time elapsed: 3.05 sec - in org.apache.phoenix.end2end.MD5FunctionIT
Running org.apache.phoenix.end2end.MinMaxAggregateFunctionIT
Tests run: 7, Failures: 0, Errors: 0, Skipped: 0, Time elapsed: 6.861 sec - in org.apache.phoenix.end2end.FirstValueFunctionIT
Tests run: 1, Failures: 0, Errors: 0, Skipped: 0, Time elapsed: 1.529 sec - in org.apache.phoenix.end2end.MinMaxAggregateFunctionIT
Tests run: 5, Failures: 0, Errors: 0, Skipped: 0, Time elapsed: 4.516 sec - in org.apache.phoenix.end2end.LikeExpressionIT
Running org.apache.phoenix.end2end.NthValueFunctionIT
Running org.apache.phoenix.end2end.OctetLengthFunctionEnd2EndIT
Tests run: 1, Failures: 0, Errors: 0, Skipped: 0, Time elapsed: 0.84 sec - in org.apache.phoenix.end2end.OctetLengthFunctionEnd2EndIT
Running org.apache.phoenix.end2end.PowerFunctionEnd2EndIT
Running org.apache.phoenix.end2end.PrimitiveTypeIT
Tests run: 26, Failures: 0, Errors: 0, Skipped: 0, Time elapsed: 27.661 sec - in org.apache.phoenix.end2end.ArithmeticQueryIT
Tests run: 1, Failures: 0, Errors: 0, Skipped: 0, Time elapsed: 0.684 sec - in org.apache.phoenix.end2end.PowerFunctionEnd2EndIT
Tests run: 9, Failures: 0, Errors: 0, Skipped: 0, Time elapsed: 0.283 sec - in org.apache.phoenix.end2end.PrimitiveTypeIT
Running org.apache.phoenix.end2end.QueryMoreIT
Running org.apache.phoenix.end2end.ReadOnlyIT
Running org.apache.phoenix.end2end.RTrimFunctionIT
Tests run: 2, Failures: 0, Errors: 0, Skipped: 0, Time elapsed: 2.445 sec - in org.apache.phoenix.end2end.RTrimFunctionIT
Running org.apache.phoenix.end2end.RegexpSplitFunctionIT
Running org.apache.phoenix.end2end.DistinctPrefixFilterIT
Tests run: 1, Failures: 0, Errors: 0, Skipped: 0, Time elapsed: 6.18 sec - in org.apache.phoenix.end2end.ReadOnlyIT
Tests run: 12, Failures: 0, Errors: 0, Skipped: 0, Time elapsed: 2.338 sec - in org.apache.phoenix.end2end.RegexpSplitFunctionIT
Running org.apache.phoenix.end2end.ReverseFunctionIT
Running org.apache.phoenix.end2end.RoundFloorCeilFunctionsEnd2EndIT
Tests run: 11, Failures: 0, Errors: 0, Skipped: 0, Time elapsed: 10.715 sec - in org.apache.phoenix.end2end.NthValueFunctionIT
Running org.apache.phoenix.end2end.SerialIteratorsIT
Tests run: 1, Failures: 0, Errors: 0, Skipped: 0, Time elapsed: 1.543 sec - in org.apache.phoenix.end2end.SerialIteratorsIT
Running org.apache.phoenix.end2end.ServerExceptionIT
Tests run: 33, Failures: 0, Errors: 0, Skipped: 0, Time elapsed: 5.038 sec - in org.apache.phoenix.end2end.RoundFloorCeilFunctionsEnd2EndIT
Tests run: 1, Failures: 0, Errors: 0, Skipped: 0, Time elapsed: 1.395 sec - in org.apache.phoenix.end2end.ServerExceptionIT
Tests run: 5, Failures: 0, Errors: 0, Skipped: 0, Time elapsed: 5.71 sec - in org.apache.phoenix.end2end.ReverseFunctionIT
Running org.apache.phoenix.end2end.SortOrderIT
Running org.apache.phoenix.end2end.StatementHintsIT
Tests run: 2, Failures: 0, Errors: 0, Skipped: 0, Time elapsed: 0.512 sec - in org.apache.phoenix.end2end.StatementHintsIT
Running org.apache.phoenix.end2end.SignFunctionEnd2EndIT
Tests run: 2, Failures: 0, Errors: 0, Skipped: 0, Time elapsed: 0.409 sec - in org.apache.phoenix.end2end.SignFunctionEnd2EndIT
Running org.apache.phoenix.end2end.StringToArrayFunctionIT
Running org.apache.phoenix.end2end.StoreNullsIT
Tests run: 6, Failures: 0, Errors: 0, Skipped: 0, Time elapsed: 19.211 sec - in org.apache.phoenix.end2end.QueryMoreIT
Running org.apache.phoenix.end2end.TimezoneOffsetFunctionIT
Tests run: 22, Failures: 0, Errors: 0, Skipped: 0, Time elapsed: 5.808 sec - in org.apache.phoenix.end2end.StringToArrayFunctionIT
Running org.apache.phoenix.end2end.ToCharFunctionIT
Tests run: 7, Failures: 0, Errors: 0, Skipped: 0, Time elapsed: 5.817 sec - in org.apache.phoenix.end2end.TimezoneOffsetFunctionIT
Running org.apache.phoenix.end2end.UpsertSelectAutoCommitIT
Tests run: 4, Failures: 0, Errors: 0, Skipped: 0, Time elapsed: 10.101 sec - in org.apache.phoenix.end2end.StoreNullsIT
Running org.apache.phoenix.end2end.index.AsyncIndexDisabledIT
Tests run: 5, Failures: 0, Errors: 0, Skipped: 0, Time elapsed: 21.59 sec - in org.apache.phoenix.end2end.DistinctPrefixFilterIT
Running org.apache.phoenix.end2end.index.ChildViewsUseParentViewIndexIT
Tests run: 1, Failures: 0, Errors: 0, Skipped: 0, Time elapsed: 1.555 sec - in org.apache.phoenix.end2end.index.AsyncIndexDisabledIT
Running org.apache.phoenix.end2end.salted.SaltedTableUpsertSelectIT
Tests run: 3, Failures: 0, Errors: 0, Skipped: 0, Time elapsed: 4.178 sec - in org.apache.phoenix.end2end.UpsertSelectAutoCommitIT
Running org.apache.phoenix.end2end.salted.SaltedTableVarLengthRowKeyIT
Tests run: 1, Failures: 0, Errors: 0, Skipped: 0, Time elapsed: 0.95 sec - in org.apache.phoenix.end2end.salted.SaltedTableVarLengthRowKeyIT
Tests run: 2, Failures: 0, Errors: 0, Skipped: 0, Time elapsed: 4.789 sec - in org.apache.phoenix.end2end.index.ChildViewsUseParentViewIndexIT
Running org.apache.phoenix.iterate.PhoenixQueryTimeoutIT
Tests run: 2, Failures: 0, Errors: 0, Skipped: 0, Time elapsed: 0.091 sec - in org.apache.phoenix.iterate.PhoenixQueryTimeoutIT
Tests run: 12, Failures: 0, Errors: 0, Skipped: 0, Time elapsed: 16.784 sec - in org.apache.phoenix.end2end.ToCharFunctionIT
Tests run: 6, Failures: 0, Errors: 0, Skipped: 0, Time elapsed: 15.124 sec - in org.apache.phoenix.end2end.salted.SaltedTableUpsertSelectIT
Tests run: 45, Failures: 0, Errors: 0, Skipped: 0, Time elapsed: 57.828 sec - in org.apache.phoenix.end2end.SortOrderIT

Results :

Tests run: 346, Failures: 0, Errors: 0, Skipped: 0

[INFO] 
[INFO] --- maven-failsafe-plugin:2.19.1:integration-test (NeedTheirOwnClusterTests) @ phoenix-core
---

-------------------------------------------------------
 T E S T S
-------------------------------------------------------
Running org.apache.hadoop.hbase.regionserver.wal.WALReplayWithIndexWritesAndUncompressedWALInHBase_094_9_IT
Running org.apache.hadoop.hbase.regionserver.wal.WALReplayWithIndexWritesAndCompressedWALIT
Tests run: 1, Failures: 0, Errors: 0, Skipped: 0, Time elapsed: 21.031 sec - in org.apache.hadoop.hbase.regionserver.wal.WALReplayWithIndexWritesAndUncompressedWALInHBase_094_9_IT
Tests run: 1, Failures: 0, Errors: 0, Skipped: 0, Time elapsed: 21.294 sec - in org.apache.hadoop.hbase.regionserver.wal.WALReplayWithIndexWritesAndCompressedWALIT
Running org.apache.phoenix.coprocessor.StatisticsCollectionRunTrackerIT
Running org.apache.phoenix.end2end.AlterTableIT
Running org.apache.phoenix.end2end.ConnectionUtilIT
Tests run: 4, Failures: 0, Errors: 0, Skipped: 0, Time elapsed: 23.083 sec - in org.apache.phoenix.coprocessor.StatisticsCollectionRunTrackerIT
Running org.apache.phoenix.end2end.ContextClassloaderIT
Running org.apache.phoenix.end2end.CountDistinctCompressionIT
Tests run: 1, Failures: 0, Errors: 0, Skipped: 0, Time elapsed: 17.883 sec - in org.apache.phoenix.end2end.ConnectionUtilIT
Tests run: 3, Failures: 0, Errors: 0, Skipped: 0, Time elapsed: 4.9 sec - in org.apache.phoenix.end2end.ContextClassloaderIT
Tests run: 1, Failures: 0, Errors: 0, Skipped: 0, Time elapsed: 4.395 sec - in org.apache.phoenix.end2end.CountDistinctCompressionIT
Running org.apache.phoenix.end2end.CsvBulkLoadToolIT
Running org.apache.phoenix.end2end.KeyOnlyIT
Running org.apache.phoenix.end2end.IndexToolIT
Running org.apache.phoenix.end2end.MultiCfQueryExecIT
Tests run: 3, Failures: 0, Errors: 0, Skipped: 0, Time elapsed: 13.63 sec - in org.apache.phoenix.end2end.KeyOnlyIT
Tests run: 9, Failures: 0, Errors: 0, Skipped: 0, Time elapsed: 25.462 sec - in org.apache.phoenix.end2end.MultiCfQueryExecIT
Running org.apache.phoenix.end2end.MutableIndexToolIT
Running org.apache.phoenix.end2end.ParallelIteratorsIT
Tests run: 3, Failures: 0, Errors: 0, Skipped: 0, Time elapsed: 15.748 sec - in org.apache.phoenix.end2end.ParallelIteratorsIT
Running org.apache.phoenix.end2end.QueryTimeoutIT
Tests run: 1, Failures: 0, Errors: 0, Skipped: 0, Time elapsed: 101.04 sec - in org.apache.phoenix.end2end.MutableIndexToolIT
Tests run: 2, Failures: 0, Errors: 0, Skipped: 0, Time elapsed: 23.382 sec - in org.apache.phoenix.end2end.QueryTimeoutIT
Running org.apache.phoenix.end2end.QueryWithLimitIT
Running org.apache.phoenix.end2end.QueryWithOffsetIT
Tests run: 2, Failures: 0, Errors: 0, Skipped: 0, Time elapsed: 13.979 sec - in org.apache.phoenix.end2end.QueryWithLimitIT
Tests run: 8, Failures: 0, Errors: 0, Skipped: 0, Time elapsed: 13.519 sec - in org.apache.phoenix.end2end.QueryWithOffsetIT
Running org.apache.phoenix.end2end.RenewLeaseIT
Tests run: 1, Failures: 0, Errors: 0, Skipped: 1, Time elapsed: 0.003 sec - in org.apache.phoenix.end2end.RenewLeaseIT
Tests run: 56, Failures: 0, Errors: 0, Skipped: 0, Time elapsed: 286.22 sec - in org.apache.phoenix.end2end.AlterTableIT
Running org.apache.phoenix.end2end.SaltedViewIT
Running org.apache.phoenix.end2end.SpillableGroupByIT
Running org.apache.phoenix.end2end.StatsCollectionDisabledIT
Tests run: 1, Failures: 0, Errors: 0, Skipped: 0, Time elapsed: 3.762 sec - in org.apache.phoenix.end2end.StatsCollectionDisabledIT
Tests run: 1, Failures: 0, Errors: 0, Skipped: 0, Time elapsed: 15.08 sec - in org.apache.phoenix.end2end.SpillableGroupByIT
Tests run: 4, Failures: 0, Errors: 0, Skipped: 0, Time elapsed: 33.656 sec - in org.apache.phoenix.end2end.SaltedViewIT
Running org.apache.phoenix.end2end.StatsCollectorIT
Running org.apache.phoenix.end2end.StatsCollectorWithSplitsAndMultiCFIT
Tests run: 2, Failures: 0, Errors: 0, Skipped: 0, Time elapsed: 14.929 sec - in org.apache.phoenix.end2end.StatsCollectorWithSplitsAndMultiCFIT
Running org.apache.phoenix.end2end.TenantSpecificTablesDDLIT
Running org.apache.phoenix.end2end.TenantSpecificTablesDMLIT
Tests run: 17, Failures: 0, Errors: 0, Skipped: 0, Time elapsed: 33.642 sec - in org.apache.phoenix.end2end.TenantSpecificTablesDDLIT
Tests run: 16, Failures: 0, Errors: 0, Skipped: 0, Time elapsed: 25.762 sec - in org.apache.phoenix.end2end.TenantSpecificTablesDMLIT
Running org.apache.phoenix.end2end.TransactionalViewIT
Running org.apache.phoenix.end2end.UnionAllIT
Tests run: 16, Failures: 0, Errors: 0, Skipped: 0, Time elapsed: 124.1 sec - in org.apache.phoenix.end2end.StatsCollectorIT
Tests run: 17, Failures: 0, Errors: 0, Skipped: 0, Time elapsed: 33.942 sec - in org.apache.phoenix.end2end.UnionAllIT
Tests run: 2, Failures: 0, Errors: 0, Skipped: 0, Time elapsed: 61.684 sec - in org.apache.phoenix.end2end.TransactionalViewIT
Running org.apache.phoenix.end2end.ViewIT
Running org.apache.phoenix.end2end.UserDefinedFunctionsIT
Tests run: 10, Failures: 0, Errors: 0, Skipped: 0, Time elapsed: 447.103 sec - in org.apache.phoenix.end2end.CsvBulkLoadToolIT
Running org.apache.phoenix.end2end.index.AsyncImmutableIndexIT
Tests run: 14, Failures: 0, Errors: 0, Skipped: 0, Time elapsed: 31.465 sec - in org.apache.phoenix.end2end.UserDefinedFunctionsIT
Running org.apache.phoenix.end2end.index.ImmutableIndexWithStatsIT
Tests run: 1, Failures: 0, Errors: 0, Skipped: 0, Time elapsed: 5.601 sec - in org.apache.phoenix.end2end.index.ImmutableIndexWithStatsIT
Running org.apache.phoenix.end2end.index.MutableIndexFailureIT
Running org.apache.phoenix.end2end.index.MutableIndexReplicationIT
Tests run: 1, Failures: 0, Errors: 0, Skipped: 0, Time elapsed: 16.749 sec - in org.apache.phoenix.end2end.index.MutableIndexReplicationIT
Tests run: 1, Failures: 0, Errors: 0, Skipped: 0, Time elapsed: 80.773 sec - in org.apache.phoenix.end2end.index.AsyncImmutableIndexIT
Running org.apache.phoenix.end2end.index.ReadOnlyIndexFailureIT
Running org.apache.phoenix.end2end.index.txn.TxWriteFailureIT
Tests run: 2, Failures: 0, Errors: 0, Skipped: 0, Time elapsed: 27.393 sec - in org.apache.phoenix.end2end.index.ReadOnlyIndexFailureIT
Tests run: 48, Failures: 0, Errors: 0, Skipped: 0, Time elapsed: 148.341 sec - in org.apache.phoenix.end2end.ViewIT
Running org.apache.phoenix.hbase.index.FailForUnsupportedHBaseVersionsIT
Tests run: 8, Failures: 0, Errors: 0, Skipped: 0, Time elapsed: 25.39 sec - in org.apache.phoenix.end2end.index.txn.TxWriteFailureIT
Tests run: 2, Failures: 0, Errors: 0, Skipped: 0, Time elapsed: 19.032 sec - in org.apache.phoenix.hbase.index.FailForUnsupportedHBaseVersionsIT
Running org.apache.phoenix.hbase.index.covered.EndToEndCoveredColumnsIndexBuilderIT
Tests run: 8, Failures: 0, Errors: 0, Skipped: 0, Time elapsed: 106.62 sec - in org.apache.phoenix.end2end.index.MutableIndexFailureIT
Running org.apache.phoenix.execute.PartialCommitIT
Tests run: 2, Failures: 0, Errors: 0, Skipped: 0, Time elapsed: 7.627 sec - in org.apache.phoenix.hbase.index.covered.EndToEndCoveredColumnsIndexBuilderIT
Tests run: 12, Failures: 0, Errors: 0, Skipped: 0, Time elapsed: 7.932 sec - in org.apache.phoenix.execute.PartialCommitIT
Running org.apache.phoenix.hbase.index.covered.example.EndToEndCoveredIndexingIT
Running org.apache.phoenix.hbase.index.covered.example.FailWithoutRetriesIT
Tests run: 1, Failures: 0, Errors: 0, Skipped: 0, Time elapsed: 8.151 sec - in org.apache.phoenix.hbase.index.covered.example.FailWithoutRetriesIT
Running org.apache.phoenix.hbase.index.covered.example.EndtoEndIndexingWithCompressionIT
Running org.apache.phoenix.iterate.RoundRobinResultIteratorWithStatsIT
Running org.apache.phoenix.iterate.ScannerLeaseRenewalIT
Tests run: 1, Failures: 0, Errors: 0, Skipped: 0, Time elapsed: 14.393 sec - in org.apache.phoenix.iterate.RoundRobinResultIteratorWithStatsIT
Tests run: 11, Failures: 0, Errors: 0, Skipped: 0, Time elapsed: 54.172 sec - in org.apache.phoenix.hbase.index.covered.example.EndToEndCoveredIndexingIT
Tests run: 11, Failures: 0, Errors: 0, Skipped: 0, Time elapsed: 52.712 sec - in org.apache.phoenix.hbase.index.covered.example.EndtoEndIndexingWithCompressionIT
Running org.apache.phoenix.monitoring.PhoenixMetricsIT
Running org.apache.phoenix.rpc.PhoenixClientRpcIT
Tests run: 2, Failures: 0, Errors: 0, Skipped: 0, Time elapsed: 6.59 sec - in org.apache.phoenix.rpc.PhoenixClientRpcIT
Running org.apache.phoenix.rpc.PhoenixServerRpcIT
Tests run: 1, Failures: 0, Errors: 0, Skipped: 0, Time elapsed: 16.053 sec - in org.apache.phoenix.rpc.PhoenixServerRpcIT
Tests run: 18, Failures: 0, Errors: 0, Skipped: 0, Time elapsed: 43.995 sec - in org.apache.phoenix.monitoring.PhoenixMetricsIT
Tests run: 16, Failures: 0, Errors: 0, Skipped: 0, Time elapsed: 820.01 sec - in org.apache.phoenix.end2end.IndexToolIT
Tests run: 2, Failures: 0, Errors: 0, Skipped: 0, Time elapsed: 164.573 sec - in org.apache.phoenix.iterate.ScannerLeaseRenewalIT

Results :

Tests run: 344, Failures: 0, Errors: 0, Skipped: 1

[INFO] 
[INFO] --- maven-failsafe-plugin:2.19.1:verify (ClientManagedTimeTests) @ phoenix-core ---
[INFO] ------------------------------------------------------------------------
[INFO] Reactor Summary:
[INFO] 
[INFO] Apache Phoenix ..................................... SUCCESS [  3.046 s]
[INFO] Phoenix Core ....................................... FAILURE [41:10 min]
[INFO] Phoenix - Flume .................................... SKIPPED
[INFO] Phoenix - Pig ...................................... SKIPPED
[INFO] Phoenix Query Server Client ........................ SKIPPED
[INFO] Phoenix Query Server ............................... SKIPPED
[INFO] Phoenix - Pherf .................................... SKIPPED
[INFO] Phoenix - Spark .................................... SKIPPED
[INFO] Phoenix - Hive ..................................... SKIPPED
[INFO] Phoenix Client ..................................... SKIPPED
[INFO] Phoenix Server ..................................... SKIPPED
[INFO] Phoenix Assembly ................................... SKIPPED
[INFO] Phoenix - Tracing Web Application .................. SKIPPED
[INFO] ------------------------------------------------------------------------
[INFO] BUILD FAILURE
[INFO] ------------------------------------------------------------------------
[INFO] Total time: 41:15 min
[INFO] Finished at: 2016-09-11T19:45:35+00:00
[INFO] Final Memory: 74M/898M
[INFO] ------------------------------------------------------------------------
[ERROR] Failed to execute goal org.apache.maven.plugins:maven-failsafe-plugin:2.19.1:verify
(ClientManagedTimeTests) on project phoenix-core: There was a timeout or other error in the
fork -> [Help 1]
[ERROR] 
[ERROR] To see the full stack trace of the errors, re-run Maven with the -e switch.
[ERROR] Re-run Maven using the -X switch to enable full debug logging.
[ERROR] 
[ERROR] For more information about the errors and possible solutions, please read the following
articles:
[ERROR] [Help 1] http://cwiki.apache.org/confluence/display/MAVEN/MojoExecutionException
[ERROR] 
[ERROR] After correcting the problems, you can resume the build with the command
[ERROR]   mvn <goals> -rf :phoenix-core
Build step 'Invoke top-level Maven targets' marked build as failure
Archiving artifacts
Compressed 1.86 GB of artifacts by 55.7% relative to #14
Recording test results

Mime
View raw message