phoenix-commits mailing list archives

Site index · List index
Message view « Date » · « Thread »
Top « Date » · « Thread »
From Apache Jenkins Server <jenk...@builds.apache.org>
Subject Build failed in Jenkins: Phoenix | 4.x-HBase-0.98 #1296
Date Wed, 07 Sep 2016 21:33:13 GMT
See <https://builds.apache.org/job/Phoenix-4.x-HBase-0.98/1296/changes>

Changes:

[larsh] PHOENIX-2785 Do not store NULLs for immutable tables.

------------------------------------------
[...truncated 252 lines...]
Running org.apache.phoenix.expression.CoerceExpressionTest
Tests run: 5, Failures: 0, Errors: 0, Skipped: 0, Time elapsed: 0.005 sec - in org.apache.phoenix.expression.CoerceExpressionTest
Running org.apache.phoenix.expression.DeterminismTest
Tests run: 1, Failures: 0, Errors: 0, Skipped: 0, Time elapsed: 0.001 sec - in org.apache.phoenix.expression.DeterminismTest
Running org.apache.phoenix.expression.RegexpSplitFunctionTest
Tests run: 2, Failures: 0, Errors: 0, Skipped: 0, Time elapsed: 0.516 sec - in org.apache.phoenix.expression.GetSetByteBitFunctionTest
Running org.apache.phoenix.util.DateUtilTest
Tests run: 22, Failures: 0, Errors: 0, Skipped: 0, Time elapsed: 0.032 sec - in org.apache.phoenix.util.DateUtilTest
Running org.apache.phoenix.util.ColumnInfoTest
Tests run: 5, Failures: 0, Errors: 0, Skipped: 0, Time elapsed: 0.005 sec - in org.apache.phoenix.util.ColumnInfoTest
Running org.apache.phoenix.util.ByteUtilTest
Tests run: 3, Failures: 0, Errors: 0, Skipped: 0, Time elapsed: 0.031 sec - in org.apache.phoenix.util.ByteUtilTest
Tests run: 1, Failures: 0, Errors: 0, Skipped: 0, Time elapsed: 0.111 sec - in org.apache.phoenix.expression.RegexpSplitFunctionTest
Running org.apache.phoenix.util.csv.StringToArrayConverterTest
Running org.apache.phoenix.util.csv.CsvUpsertExecutorTest
Tests run: 35, Failures: 0, Errors: 0, Skipped: 0, Time elapsed: 0.521 sec - in org.apache.phoenix.expression.ArrayConcatFunctionTest
Running org.apache.phoenix.util.StringUtilTest
Tests run: 5, Failures: 0, Errors: 0, Skipped: 0, Time elapsed: 0.004 sec - in org.apache.phoenix.util.StringUtilTest
Tests run: 4, Failures: 0, Errors: 0, Skipped: 0, Time elapsed: 0.262 sec - in org.apache.phoenix.util.csv.StringToArrayConverterTest
Running org.apache.phoenix.util.IndexUtilTest
Running org.apache.phoenix.util.LogUtilTest
Tests run: 2, Failures: 0, Errors: 0, Skipped: 0, Time elapsed: 0.002 sec - in org.apache.phoenix.util.IndexUtilTest
Running org.apache.phoenix.util.TenantIdByteConversionTest
Tests run: 18, Failures: 0, Errors: 0, Skipped: 0, Time elapsed: 0.036 sec - in org.apache.phoenix.util.TenantIdByteConversionTest
Running org.apache.phoenix.util.LikeExpressionTest
Tests run: 1, Failures: 0, Errors: 0, Skipped: 0, Time elapsed: 0.001 sec - in org.apache.phoenix.util.LikeExpressionTest
Running org.apache.phoenix.util.ScanUtilTest
Tests run: 6, Failures: 0, Errors: 0, Skipped: 0, Time elapsed: 0.381 sec - in org.apache.phoenix.util.csv.CsvUpsertExecutorTest
Tests run: 20, Failures: 0, Errors: 0, Skipped: 0, Time elapsed: 0.062 sec - in org.apache.phoenix.util.ScanUtilTest
Running org.apache.phoenix.util.JDBCUtilTest
Running org.apache.phoenix.util.MetaDataUtilTest
Tests run: 4, Failures: 0, Errors: 0, Skipped: 0, Time elapsed: 0.044 sec - in org.apache.phoenix.util.MetaDataUtilTest
Tests run: 10, Failures: 0, Errors: 0, Skipped: 0, Time elapsed: 0.004 sec - in org.apache.phoenix.util.JDBCUtilTest
Running org.apache.phoenix.util.json.JsonUpsertExecutorTest
Running org.apache.phoenix.util.PropertiesUtilTest
Tests run: 3, Failures: 0, Errors: 0, Skipped: 0, Time elapsed: 0.022 sec - in org.apache.phoenix.util.PropertiesUtilTest
Tests run: 3, Failures: 0, Errors: 0, Skipped: 0, Time elapsed: 0.205 sec - in org.apache.phoenix.util.LogUtilTest
Running org.apache.phoenix.util.SequenceUtilTest
Running org.apache.phoenix.util.QueryUtilTest
Tests run: 18, Failures: 0, Errors: 0, Skipped: 0, Time elapsed: 0.007 sec - in org.apache.phoenix.util.SequenceUtilTest
Running org.apache.phoenix.util.PhoenixEncodeDecodeTest
Tests run: 9, Failures: 0, Errors: 0, Skipped: 0, Time elapsed: 0.057 sec - in org.apache.phoenix.util.QueryUtilTest
Running org.apache.phoenix.util.PhoenixRuntimeTest
Tests run: 4, Failures: 0, Errors: 0, Skipped: 0, Time elapsed: 0.258 sec - in org.apache.phoenix.util.PhoenixEncodeDecodeTest
Running org.apache.phoenix.util.PrefixByteEncoderDecoderTest
Tests run: 3, Failures: 0, Errors: 0, Skipped: 0, Time elapsed: 0.005 sec - in org.apache.phoenix.util.PrefixByteEncoderDecoderTest
Running org.apache.phoenix.util.PhoenixContextExecutorTest
Tests run: 1, Failures: 0, Errors: 0, Skipped: 0, Time elapsed: 0.001 sec - in org.apache.phoenix.util.PhoenixContextExecutorTest
Running org.apache.phoenix.util.Base62EncoderTest
Tests run: 1, Failures: 0, Errors: 0, Skipped: 0, Time elapsed: 0.016 sec - in org.apache.phoenix.util.Base62EncoderTest
Running org.apache.phoenix.cache.TenantCacheTest
Tests run: 5, Failures: 0, Errors: 0, Skipped: 0, Time elapsed: 0.437 sec - in org.apache.phoenix.util.json.JsonUpsertExecutorTest
Tests run: 2, Failures: 0, Errors: 0, Skipped: 0, Time elapsed: 0.012 sec - in org.apache.phoenix.cache.TenantCacheTest
Running org.apache.phoenix.cache.JodaTimezoneCacheTest
Running org.apache.phoenix.trace.TraceMetricsSourceTest
Tests run: 4, Failures: 0, Errors: 0, Skipped: 0, Time elapsed: 0.011 sec - in org.apache.phoenix.cache.JodaTimezoneCacheTest
Tests run: 3, Failures: 0, Errors: 0, Skipped: 0, Time elapsed: 0.026 sec - in org.apache.phoenix.trace.TraceMetricsSourceTest
Running org.apache.phoenix.hbase.index.covered.filter.TestNewerTimestampFilter
Running org.apache.phoenix.hbase.index.covered.filter.TestApplyAndFilterDeletesFilter
Tests run: 1, Failures: 0, Errors: 0, Skipped: 0, Time elapsed: 0.002 sec - in org.apache.phoenix.hbase.index.covered.filter.TestNewerTimestampFilter
Running org.apache.phoenix.hbase.index.covered.data.TestIndexMemStore
Tests run: 6, Failures: 0, Errors: 0, Skipped: 0, Time elapsed: 0.006 sec - in org.apache.phoenix.hbase.index.covered.filter.TestApplyAndFilterDeletesFilter
Running org.apache.phoenix.hbase.index.covered.TestLocalTableState
Tests run: 2, Failures: 0, Errors: 0, Skipped: 0, Time elapsed: 0.01 sec - in org.apache.phoenix.hbase.index.covered.data.TestIndexMemStore
Running org.apache.phoenix.hbase.index.covered.update.TestIndexUpdateManager
Tests run: 2, Failures: 0, Errors: 0, Skipped: 0, Time elapsed: 0.007 sec - in org.apache.phoenix.hbase.index.covered.update.TestIndexUpdateManager
Running org.apache.phoenix.hbase.index.covered.example.TestCoveredColumnIndexCodec
Tests run: 3, Failures: 0, Errors: 0, Skipped: 0, Time elapsed: 0.052 sec - in org.apache.phoenix.hbase.index.covered.example.TestCoveredColumnIndexCodec
Running org.apache.phoenix.hbase.index.covered.example.TestColumnTracker
Tests run: 3, Failures: 0, Errors: 0, Skipped: 0, Time elapsed: 0.002 sec - in org.apache.phoenix.hbase.index.covered.example.TestColumnTracker
Running org.apache.phoenix.hbase.index.covered.example.TestCoveredIndexSpecifierBuilder
Tests run: 1, Failures: 0, Errors: 0, Skipped: 0, Time elapsed: 0.003 sec - in org.apache.phoenix.hbase.index.covered.example.TestCoveredIndexSpecifierBuilder
Running org.apache.phoenix.hbase.index.covered.TestCoveredColumns
Tests run: 1, Failures: 0, Errors: 0, Skipped: 0, Time elapsed: 0.001 sec - in org.apache.phoenix.hbase.index.covered.TestCoveredColumns
Running org.apache.phoenix.hbase.index.util.TestIndexManagementUtil
Tests run: 3, Failures: 0, Errors: 0, Skipped: 0, Time elapsed: 0.06 sec - in org.apache.phoenix.hbase.index.util.TestIndexManagementUtil
Running org.apache.phoenix.hbase.index.write.TestIndexWriter
Tests run: 11, Failures: 0, Errors: 0, Skipped: 0, Time elapsed: 0.732 sec - in org.apache.phoenix.util.PhoenixRuntimeTest
Running org.apache.phoenix.hbase.index.write.recovery.TestPerRegionIndexWriteCache
Tests run: 5, Failures: 0, Errors: 0, Skipped: 0, Time elapsed: 0.104 sec - in org.apache.phoenix.hbase.index.write.TestIndexWriter
Running org.apache.phoenix.hbase.index.write.TestWALRecoveryCaching
Tests run: 1, Failures: 0, Errors: 0, Skipped: 1, Time elapsed: 0.004 sec - in org.apache.phoenix.hbase.index.write.TestWALRecoveryCaching
Running org.apache.phoenix.hbase.index.write.TestParalleIndexWriter
Tests run: 2, Failures: 0, Errors: 0, Skipped: 0, Time elapsed: 0.069 sec - in org.apache.phoenix.hbase.index.write.TestParalleIndexWriter
Running org.apache.phoenix.hbase.index.write.TestParalleWriterIndexCommitter
Tests run: 2, Failures: 0, Errors: 0, Skipped: 0, Time elapsed: 0.054 sec - in org.apache.phoenix.hbase.index.write.TestParalleWriterIndexCommitter
Running org.apache.phoenix.hbase.index.write.TestCachingHTableFactory
Tests run: 3, Failures: 0, Errors: 0, Skipped: 0, Time elapsed: 0.531 sec - in org.apache.phoenix.hbase.index.covered.TestLocalTableState
Running org.apache.phoenix.hbase.index.parallel.TestThreadPoolManager
Tests run: 1, Failures: 0, Errors: 0, Skipped: 0, Time elapsed: 0.059 sec - in org.apache.phoenix.hbase.index.write.TestCachingHTableFactory
Tests run: 3, Failures: 0, Errors: 0, Skipped: 0, Time elapsed: 0.056 sec - in org.apache.phoenix.hbase.index.parallel.TestThreadPoolManager
Running org.apache.phoenix.hbase.index.parallel.TestThreadPoolBuilder
Running org.apache.phoenix.compile.ScanRangesIntersectTest
Tests run: 1, Failures: 0, Errors: 0, Skipped: 0, Time elapsed: 0.002 sec - in org.apache.phoenix.compile.ScanRangesIntersectTest
Tests run: 2, Failures: 0, Errors: 0, Skipped: 0, Time elapsed: 0.002 sec - in org.apache.phoenix.hbase.index.parallel.TestThreadPoolBuilder
Running org.apache.phoenix.compile.JoinQueryCompilerTest
Running org.apache.phoenix.compile.HavingCompilerTest
Tests run: 11, Failures: 0, Errors: 0, Skipped: 0, Time elapsed: 0.319 sec - in org.apache.phoenix.compile.HavingCompilerTest
Running org.apache.phoenix.compile.SaltedScanRangesTest
Tests run: 9, Failures: 0, Errors: 0, Skipped: 0, Time elapsed: 0.012 sec - in org.apache.phoenix.compile.SaltedScanRangesTest
Running org.apache.phoenix.compile.QueryCompilerTest
Tests run: 2, Failures: 0, Errors: 0, Skipped: 0, Time elapsed: 0.481 sec - in org.apache.phoenix.compile.JoinQueryCompilerTest
Running org.apache.phoenix.compile.ScanRangesTest
Tests run: 34, Failures: 0, Errors: 0, Skipped: 0, Time elapsed: 0.041 sec - in org.apache.phoenix.compile.ScanRangesTest
Running org.apache.phoenix.compile.WhereCompilerTest
Tests run: 45, Failures: 0, Errors: 0, Skipped: 1, Time elapsed: 0.601 sec - in org.apache.phoenix.compile.WhereCompilerTest
Running org.apache.phoenix.compile.CreateTableCompilerTest
Tests run: 3, Failures: 0, Errors: 0, Skipped: 0, Time elapsed: 1.52 sec - in org.apache.phoenix.hbase.index.write.recovery.TestPerRegionIndexWriteCache
Running org.apache.phoenix.compile.SelectStatementRewriterTest
Tests run: 1, Failures: 0, Errors: 0, Skipped: 0, Time elapsed: 0.298 sec - in org.apache.phoenix.compile.CreateTableCompilerTest
Running org.apache.phoenix.compile.WhereOptimizerTest
Tests run: 5, Failures: 0, Errors: 0, Skipped: 0, Time elapsed: 0.294 sec - in org.apache.phoenix.compile.SelectStatementRewriterTest
Running org.apache.phoenix.compile.QueryOptimizerTest
Tests run: 124, Failures: 0, Errors: 0, Skipped: 0, Time elapsed: 1.302 sec - in org.apache.phoenix.compile.QueryCompilerTest
Running org.apache.phoenix.compile.StatementHintsCompilationTest
Tests run: 4, Failures: 0, Errors: 0, Skipped: 0, Time elapsed: 0.269 sec - in org.apache.phoenix.compile.StatementHintsCompilationTest
Running org.apache.phoenix.compile.ViewCompilerTest
Tests run: 3, Failures: 0, Errors: 0, Skipped: 0, Time elapsed: 0.28 sec - in org.apache.phoenix.compile.ViewCompilerTest
Running org.apache.phoenix.compile.QueryMetaDataTest
Tests run: 105, Failures: 0, Errors: 0, Skipped: 0, Time elapsed: 0.78 sec - in org.apache.phoenix.compile.WhereOptimizerTest
Running org.apache.phoenix.compile.TenantSpecificViewIndexCompileTest
Tests run: 33, Failures: 0, Errors: 0, Skipped: 0, Time elapsed: 0.405 sec - in org.apache.phoenix.compile.QueryMetaDataTest
Running org.apache.phoenix.compile.LimitCompilerTest
Tests run: 42, Failures: 0, Errors: 0, Skipped: 0, Time elapsed: 1.359 sec - in org.apache.phoenix.compile.QueryOptimizerTest
Running org.apache.phoenix.jdbc.PhoenixResultSetMetadataTest
Tests run: 6, Failures: 0, Errors: 0, Skipped: 0, Time elapsed: 0.259 sec - in org.apache.phoenix.compile.LimitCompilerTest
Running org.apache.phoenix.jdbc.PhoenixDriverTest
Tests run: 1, Failures: 0, Errors: 0, Skipped: 0, Time elapsed: 0.25 sec - in org.apache.phoenix.jdbc.PhoenixResultSetMetadataTest
Running org.apache.phoenix.jdbc.ReadOnlyPropertiesTest
Tests run: 4, Failures: 0, Errors: 0, Skipped: 0, Time elapsed: 0.004 sec - in org.apache.phoenix.jdbc.ReadOnlyPropertiesTest
Running org.apache.phoenix.jdbc.SecureUserConnectionsTest
Tests run: 6, Failures: 0, Errors: 0, Skipped: 0, Time elapsed: 0.924 sec - in org.apache.phoenix.compile.TenantSpecificViewIndexCompileTest
Running org.apache.phoenix.jdbc.PhoenixEmbeddedDriverTest
Tests run: 3, Failures: 0, Errors: 0, Skipped: 0, Time elapsed: 0.057 sec - in org.apache.phoenix.jdbc.PhoenixEmbeddedDriverTest
Running org.apache.phoenix.jdbc.PhoenixPreparedStatementTest
Tests run: 6, Failures: 0, Errors: 0, Skipped: 0, Time elapsed: 0.497 sec - in org.apache.phoenix.jdbc.PhoenixDriverTest
Running org.apache.phoenix.query.ParallelIteratorsSplitTest
Tests run: 11, Failures: 0, Errors: 0, Skipped: 0, Time elapsed: 0.307 sec - in org.apache.phoenix.jdbc.PhoenixPreparedStatementTest
Running org.apache.phoenix.query.PhoenixStatsCacheRemovalListenerTest
Tests run: 1, Failures: 0, Errors: 0, Skipped: 0, Time elapsed: 0.001 sec - in org.apache.phoenix.query.PhoenixStatsCacheRemovalListenerTest
Running org.apache.phoenix.query.KeyRangeUnionTest
Tests run: 8, Failures: 0, Errors: 0, Skipped: 0, Time elapsed: 0.01 sec - in org.apache.phoenix.query.KeyRangeUnionTest
Running org.apache.phoenix.query.ConnectionlessTest
Tests run: 8, Failures: 0, Errors: 0, Skipped: 0, Time elapsed: 0.262 sec - in org.apache.phoenix.query.ParallelIteratorsSplitTest
Running org.apache.phoenix.query.ScannerLeaseRenewalTest
Tests run: 3, Failures: 0, Errors: 0, Skipped: 0, Time elapsed: 0.223 sec - in org.apache.phoenix.query.ConnectionlessTest
Running org.apache.phoenix.query.HBaseFactoryProviderTest
Tests run: 3, Failures: 0, Errors: 0, Skipped: 0, Time elapsed: 0.004 sec - in org.apache.phoenix.query.HBaseFactoryProviderTest
Running org.apache.phoenix.query.OrderByTest
Tests run: 4, Failures: 0, Errors: 0, Skipped: 0, Time elapsed: 0.211 sec - in org.apache.phoenix.query.OrderByTest
Running org.apache.phoenix.query.KeyRangeIntersectTest
Tests run: 8, Failures: 0, Errors: 0, Skipped: 0, Time elapsed: 0.01 sec - in org.apache.phoenix.query.KeyRangeIntersectTest
Running org.apache.phoenix.query.KeyRangeCoalesceTest
Tests run: 13, Failures: 0, Errors: 0, Skipped: 0, Time elapsed: 0.016 sec - in org.apache.phoenix.query.KeyRangeCoalesceTest
Running org.apache.phoenix.query.QueryPlanTest
Tests run: 5, Failures: 0, Errors: 0, Skipped: 0, Time elapsed: 0.284 sec - in org.apache.phoenix.query.QueryPlanTest
Running org.apache.phoenix.mapreduce.util.PhoenixConfigurationUtilTest
Tests run: 9, Failures: 0, Errors: 0, Skipped: 0, Time elapsed: 0.524 sec - in org.apache.phoenix.mapreduce.util.PhoenixConfigurationUtilTest
Running org.apache.phoenix.mapreduce.util.ColumnInfoToStringEncoderDecoderTest
Tests run: 2, Failures: 0, Errors: 0, Skipped: 0, Time elapsed: 0.03 sec - in org.apache.phoenix.mapreduce.util.ColumnInfoToStringEncoderDecoderTest
Running org.apache.phoenix.mapreduce.BulkLoadToolTest
Tests run: 12, Failures: 0, Errors: 0, Skipped: 0, Time elapsed: 0.025 sec - in org.apache.phoenix.mapreduce.BulkLoadToolTest
Running org.apache.phoenix.mapreduce.CsvBulkImportUtilTest
Tests run: 5, Failures: 0, Errors: 0, Skipped: 0, Time elapsed: 0.51 sec - in org.apache.phoenix.mapreduce.CsvBulkImportUtilTest
Running org.apache.phoenix.mapreduce.FormatToBytesWritableMapperTest
Tests run: 5, Failures: 0, Errors: 0, Skipped: 0, Time elapsed: 0.066 sec - in org.apache.phoenix.mapreduce.FormatToBytesWritableMapperTest
Running org.apache.phoenix.mapreduce.CsvToKeyValueMapperTest
Tests run: 2, Failures: 0, Errors: 0, Skipped: 0, Time elapsed: 0.002 sec - in org.apache.phoenix.mapreduce.CsvToKeyValueMapperTest
Running org.apache.phoenix.mapreduce.bulkload.TestTableRowkeyPair
Tests run: 1, Failures: 0, Errors: 0, Skipped: 0, Time elapsed: 0.001 sec - in org.apache.phoenix.mapreduce.bulkload.TestTableRowkeyPair
Running org.apache.phoenix.parse.QueryParserTest
Tests run: 60, Failures: 0, Errors: 0, Skipped: 0, Time elapsed: 0.053 sec - in org.apache.phoenix.parse.QueryParserTest
Running org.apache.phoenix.parse.BuiltInFunctionInfoTest
Tests run: 3, Failures: 0, Errors: 0, Skipped: 0, Time elapsed: 0.005 sec - in org.apache.phoenix.parse.BuiltInFunctionInfoTest
Running org.apache.phoenix.parse.CastParseNodeTest
Tests run: 3, Failures: 0, Errors: 0, Skipped: 0, Time elapsed: 0.001 sec - in org.apache.phoenix.parse.CastParseNodeTest
Running org.apache.phoenix.execute.MutationStateTest
Tests run: 1, Failures: 0, Errors: 0, Skipped: 0, Time elapsed: 0 sec - in org.apache.phoenix.execute.MutationStateTest
Running org.apache.phoenix.execute.DescVarLengthFastByteComparisonsTest
Tests run: 2, Failures: 0, Errors: 0, Skipped: 0, Time elapsed: 0.001 sec - in org.apache.phoenix.execute.DescVarLengthFastByteComparisonsTest
Running org.apache.phoenix.execute.CorrelatePlanTest
Tests run: 6, Failures: 0, Errors: 0, Skipped: 0, Time elapsed: 0.02 sec - in org.apache.phoenix.execute.CorrelatePlanTest
Running org.apache.phoenix.execute.UnnestArrayPlanTest
Tests run: 6, Failures: 0, Errors: 0, Skipped: 0, Time elapsed: 0.006 sec - in org.apache.phoenix.execute.UnnestArrayPlanTest
Running org.apache.phoenix.execute.LiteralResultIteratorPlanTest
Tests run: 3, Failures: 0, Errors: 0, Skipped: 0, Time elapsed: 0.004 sec - in org.apache.phoenix.execute.LiteralResultIteratorPlanTest
Running org.apache.phoenix.iterate.AggregateResultScannerTest
Tests run: 1, Failures: 0, Errors: 0, Skipped: 0, Time elapsed: 0.165 sec - in org.apache.phoenix.iterate.AggregateResultScannerTest
Running org.apache.phoenix.iterate.MergeSortResultIteratorTest
Tests run: 2, Failures: 0, Errors: 0, Skipped: 0, Time elapsed: 0.003 sec - in org.apache.phoenix.iterate.MergeSortResultIteratorTest
Running org.apache.phoenix.iterate.RowKeyOrderedAggregateResultIteratorTest
Tests run: 4, Failures: 0, Errors: 0, Skipped: 0, Time elapsed: 0.16 sec - in org.apache.phoenix.iterate.RowKeyOrderedAggregateResultIteratorTest
Running org.apache.phoenix.iterate.ConcatResultIteratorTest
Tests run: 2, Failures: 0, Errors: 0, Skipped: 0, Time elapsed: 0.003 sec - in org.apache.phoenix.iterate.ConcatResultIteratorTest
Running org.apache.phoenix.iterate.SpoolingResultIteratorTest
Tests run: 3, Failures: 0, Errors: 0, Skipped: 0, Time elapsed: 0.212 sec - in org.apache.phoenix.iterate.SpoolingResultIteratorTest
Tests run: 2, Failures: 0, Errors: 0, Skipped: 0, Time elapsed: 6.441 sec - in org.apache.phoenix.query.ScannerLeaseRenewalTest
Tests run: 1, Failures: 0, Errors: 1, Skipped: 0, Time elapsed: 71.46 sec <<< FAILURE!
- in org.apache.phoenix.jdbc.SecureUserConnectionsTest
org.apache.phoenix.jdbc.SecureUserConnectionsTest  Time elapsed: 71.46 sec  <<< ERROR!
java.net.BindException: Address already in use


Results :

Tests in error: 
  SecureUserConnectionsTest.org.apache.phoenix.jdbc.SecureUserConnectionsTest ยป Bind

Tests run: 1390, Failures: 0, Errors: 1, Skipped: 5

[INFO] ------------------------------------------------------------------------
[INFO] Reactor Summary:
[INFO] 
[INFO] Apache Phoenix ..................................... SUCCESS [  5.821 s]
[INFO] Phoenix Core ....................................... FAILURE [04:06 min]
[INFO] Phoenix - Flume .................................... SKIPPED
[INFO] Phoenix - Pig ...................................... SKIPPED
[INFO] Phoenix Query Server Client ........................ SKIPPED
[INFO] Phoenix Query Server ............................... SKIPPED
[INFO] Phoenix - Pherf .................................... SKIPPED
[INFO] Phoenix - Spark .................................... SKIPPED
[INFO] Phoenix - Hive ..................................... SKIPPED
[INFO] Phoenix Client ..................................... SKIPPED
[INFO] Phoenix Server ..................................... SKIPPED
[INFO] Phoenix Assembly ................................... SKIPPED
[INFO] Phoenix - Tracing Web Application .................. SKIPPED
[INFO] ------------------------------------------------------------------------
[INFO] BUILD FAILURE
[INFO] ------------------------------------------------------------------------
[INFO] Total time: 04:15 min
[INFO] Finished at: 2016-09-07T21:29:20+00:00
[INFO] Final Memory: 81M/1352M
[INFO] ------------------------------------------------------------------------
[ERROR] Failed to execute goal org.apache.maven.plugins:maven-surefire-plugin:2.19.1:test
(default-test) on project phoenix-core: There are test failures.
[ERROR] 
[ERROR] Please refer to <https://builds.apache.org/job/Phoenix-4.x-HBase-0.98/ws/phoenix-core/target/surefire-reports>
for the individual test results.
[ERROR] -> [Help 1]
[ERROR] 
[ERROR] To see the full stack trace of the errors, re-run Maven with the -e switch.
[ERROR] Re-run Maven using the -X switch to enable full debug logging.
[ERROR] 
[ERROR] For more information about the errors and possible solutions, please read the following
articles:
[ERROR] [Help 1] http://cwiki.apache.org/confluence/display/MAVEN/MojoFailureException
[ERROR] 
[ERROR] After correcting the problems, you can resume the build with the command
[ERROR]   mvn <goals> -rf :phoenix-core
Build step 'Invoke top-level Maven targets' marked build as failure
Archiving artifacts
Compressed 622.50 MB of artifacts by 68.2% relative to #1272
Recording test results

Mime
View raw message