phoenix-commits mailing list archives

Site index · List index
Message view « Date » · « Thread »
Top « Date » · « Thread »
From Apache Jenkins Server <jenk...@builds.apache.org>
Subject Build failed in Jenkins: Phoenix-Calcite #10
Date Wed, 14 Sep 2016 21:46:06 GMT
See <https://builds.apache.org/job/Phoenix-calcite/10/changes>

Changes:

[samarth] PHOENIX-2822 Tests that extend BaseHBaseManagedTimeIT are very

[tdsilva] PHOENIX-2156 Support drop of column from table with views

[samarth] PHOENIX-2830 Upgrade code fails when upgrading from a version before 4.3

[samarth] PHOENIX-2822 Addendum to fix failing tests (Rahul Gidwani)

[ankitsinghal59] PHOENIX-1311 HBase namespaces surfaced in phoenix

[rajeshbabu] PHOENIX-2628 Ensure split when iterating through results handled

[ankitsinghal59] PHOENIX-2838 Support case sensitive identifier for drop schema and use

[ankitsinghal59] PHOENIX-2841 UDF not working with sort merge join

[elserj] PHOENIX-2743 HivePhoenixHandler for big-big join with predicate push

[jamestaylor] Revert "PHOENIX-2628 Ensure split when iterating through results handled

[jamestaylor] PHOENIX-2833 Upgrade HBase dependency to version 1.2.0 (Rob Leidle)

[jamestaylor] PHOENIX-2840 Ignore flapping

[jamestaylor] PHOENIX-2846 Fix CreateTableIT.testCreateTableWithoutSchema()

[jamestaylor] PHOENIX-2855 Workaround Increment TimeRange not being serialized for

[jamestaylor] PHOENIX-2855 Workaround Increment TimeRange not being serialized for

[samarth] PHOENIX-2724 Query with large number of guideposts is slower compared to

[samarth] PHOENIX-2856 HBaseManagedTimeTableReuseTest category isn't getting run

[jamestaylor] PHOENIX-2840 Fix flapping MemoryManagerTest.testWaitForMemoryAvailable

[elserj] PHOENIX-2857 Remove test scope from dependency management

[jamestaylor] PHOENIX-2858 Add 'Transactional' as a column in the JDBC table metadata

[tdsilva] PHOENIX-2852 Dropping columns could trigger upgrade code on server side

[samarth] PHOENIX-2724 Addendum: Prevent queries from executing serially inspite

[samarth] PHOENIX-2866 Fix UpsertValuesIT to get builds green again

[samarth] PHOENIX-2867 IT tests for phoenix-flume fails with ClassNotFound

[tdsilva] PHOENIX-2795 Support auto partition for views

[jamestaylor] PHOENIX-2840 Fix flapping MemoryManagerTest.testWaitForMemoryAvailable

[jtaylor] PHOENIX-2871 Workaround sqlline issue

[jamestaylor] PHOENIX-2872 Find usages of server time in BaseClientManagedTimeIT

[jamestaylor] PHOENIX-2868 QueryServerBasicsIT.testSchemas is failing (Ankit Singhal)

[rajeshbabu] PHOENIX-2628 Ensure split when iterating through results handled

[ankitsinghal59] PHOENIX-2874 Delete schemas also during clean up after test

[ankitsinghal59] PHOENIX-2863 Let's roll up minor version to 8 (4.8.0) because of

[ankitsinghal59] PHOENIX-2845 Timestamp ignores nanos in literal expressions(Sergey

[maryannxue] PHOENIX-2878 CURRENT_TIME fails to provide correct time when projected

[jamestaylor] PHOENIX-2824 PhoenixTransactionalIndexer rollback doesn't work correctly

[jamestaylor] PHOENIX-2879 HivePhoenixStoreIT fails with timeout if JDK 1.7 used

[jamestaylor] PHOENIX-2875 Fix isolation level returned by PhoenixDatabaseMetaData for

[twdsilva] PHOENIX-2791 Support append only schema declaration

[elserj] Add environment variables to control the location of the queryserver

[tdsilva] PHOENIX-2791 Support append only schema declaration (addendum)

[jamestaylor] PHOENIX-2818 Optimize ORDERED group by

[jamestaylor] PHOENIX-2876 Using aggregation function in ORDER BY (Sergey Soldatov)

[jamestaylor] PHOENIX-2888 Aggregations for similar IN list expressions doesn't work

[jmahonin] PHOENIX-2784 phoenix-spark: Allow coercion of DATE to TIMESTAMP for

[ankitsinghal59] PHOENIX-2884 Fix EXPLAIN plan for offset on salted table

[ankitsinghal59] PHOENIX-2862 Do client server compatibility checks before upgrading

[ankitsinghal59] PHOENIX-2887 Uberjar application fail with 'IllegalAccessError: class

[enis] PHOENIX-2905 hadoop-2.5.1 artifacts are in the dependency tree

[jamestaylor] PHOENIX-2911 Don't use parent table schema name for auto partitioned

[jamestaylor] PHOENIX-2918 Fix backward compat for APPEND_ONLY_SCHEMA and

[ssa] Make sqlline refer to bin/hbase-site.xml by default (Junegunn Choi)

[jamestaylor] PHOENIX-2906 Use org.apache.tephra instead of co.cask.tephra

[ssa] PHOENIX-2908 phoenix-core depends on both antlr 3.5 and antlr 2.7.7

[maryannxue] PHOENIX-2894 Sort-merge join works incorrectly with DESC columns

[ankitsinghal59] Some phoenix-spark IT tests are broken after PHOENIX-2862

[ssa] PHOENIX-2912 Broken IT tests after PHOENIX-2905

[sergey.soldatov] PHOENIX-2925 CsvBulkloadTool not working properly if there are multiple

[rajeshbabu] PHOENIX-1734 Local index improvements(Rajeshbabu)

[rajeshbabu] PHOENIX-1734 Local index improvements(Rajeshbabu)-addendum

[rajeshbabu] PHOENIC-1734 Local index improvements(Rajeshbabu)-addendum2

[ssa] PHOENIX-2936 Missing antlr runtime on server side after PHOENIX-2908

[elserj] [PHOENIX-2955] replace xpath to xmllint at make_rc.sh fix problem:

[samarth] PHOENIX-2919 PreparedStatement Returns Incorrect Number of Deleted

[samarth] Ignore serial hint for queries doing an ORDER BY not along the PK axis

[larsh] PHOENIX-258 Use skip scan when SELECT DISTINCT on leading row key

[larsh] PHOENIX-258 minor test fixes.

[elserj] PHOENIX-2960 Bump avatica to 1.8.0

[rajeshbabu] PHOENIX-2596 Asynchronous Local Index is not available(Rajeshbabu)

[ssa] PHOENIX-2967 CSV BulkLoad should properly handle empty family for

[enis] PHOENIX-2892 Scan for pre-warming the block cache for 2ndary index

[jamestaylor] PHOENIX-2899 Add test for inflight transactions over partially

[jamestaylor] PHOENIX-2924 Remove staging repository once Apache Tephra 0.8.0 is

[jamestaylor] PHOENIX-2898 HTable not closed in ConnectionQueryServicesImpl (Alex

[jamestaylor] PHOENIX-2942 Order by incorrect for RVC

[jamestaylor] PHOENIX-2980 DistinctPrefixFilterIT.testRVC() is failing

[larsh] PHOENIX-2965 Use DistinctPrefixFilter logic for COUNT(DISTINCT ...) and

[ssa] PHOENIX-2975 CSVBulkLoad for local index only fails.

[ankitsinghal59] PHOENIX-2901 If namespaces are enabled, check for existence of schema

[ankitsinghal59] PHOENIX-2915 Dropping of Index can still leave some non-replayed writes

[jamestaylor] PHOENIX-2489 Support sequence metadata access through DatabaseMetaData

[larsh] Revert "PHOENIX-2965 Use DistinctPrefixFilter logic for COUNT(DISTINCT

[larsh] PHOENIX-2986 Some queries are misoptimized by PHOENIX-258.

[larsh] PHOENIX-2987 DISTINCT/GROUP BY optimization not correct for null values

[larsh] PHOENIX-2965 Use DistinctPrefixFilter logic for COUNT(DISTINCT ...) and

[jamestaylor] PHOENIX-2886 Union ALL with Char column not present in the table in

[jamestaylor] PHOENIX-2934 Checking a coerce expression at top level should not be

[jmahonin] PHOENIX-2985 Phoenix-Spark IT for non-existent column fails on Spark 1.6

[jamestaylor] PHOENIX-2983 ClassCastException on auto coerce of BIGINT to DECIMAL

[jamestaylor] PHOENIX-2961 select on a composite primary key fails when DESC is set in

[jamestaylor] PHOENIX-2994 Coalesce function may return null

[jamestaylor] PHOENIX-2920 Incorrect Queries on Multi-tenant tables with WHERE clause

[larsh] PHOENIX-2992 Remove ORDER BY from aggregate-only SELECT statements.

[ssa] PHOENIX-2535 Create shaded clients (thin + thick)

[samarth] PHOENIX-2276 Creating index on a global view on a multi-tenant table

[samarth] PHOENIX-2276 addendum for fixing test failures

[samarth] PHOENIX-2276 Addednum2 to fix test failures

[larsh] PHOENIX-3000 Reduce memory consumption during DISTINCT aggregation.

[samarth] PHOENIX-2276 Fix test failure

[larsh] PHOENIX-3006 Fix all ScalarFunctions to implement clone(List) or

[larsh] PHOENIX-3005 Fixes for COUNT(DISTINCT...) with DistinctPrefixFilter and

[ramkrishna] PHOENIX-2952 array_length return negative value (Joseph Sun)

[ramkrishna] PHOENIX-2952 Addendum to fix test case failure (Ram)

[jamestaylor] PHOENIX-2998 Add test for setting RPC timeout for a connection

[jamestaylor] PHOENIX-2950 Implement CRON job to start async index builds and restart

[elserj] PHOENIX-2940 Query the stats table and cache stats in the client

[ankitsinghal59] PHOENIX-3008 Prevent upgrade of existing multi-tenant table to map to

[ankitsinghal59] PHOENIX-3011 Fix missing apache licenses

[ssa] PHOENIX-3001 Dropping local index and recreation it with following split

[elserj] PHOENIX-2792 Enable PQS to use the new SPNEGO support from Avatica

[samarth] PHOENIX-3016 NO_UPGRADE_ATTRIB on a PhoenixConnection shouldn't prevent

[rajeshbabu] PHOENIX-2209 Building Local Index Asynchronously via IndexTool fails to

[elserj] PHOENIX-3017 Catch TableNotFoundException and avoid logging at warn

[larsh] PHOENIX-3014 SELECT DISTINCT pk ORDER BY pk DESC gives the wrong results

[larsh] PHOENIX-3012 DistinctPrefixFilter logic fails with local indexes and

[larsh] PHOENIX-3012 Addendum, typo.

[samarth] PHOENIX-3016 Addendum to fix test failures

[elserj] PHOENIX-3013 TO_CHAR fails to handle indexed null value (Junegunn Choi)

[ssa] PHOENIX-3015 Any metadata changes may cause unpredictable result when

[ssa] PHOENIX-3020 Bulk load tool is not working with new jars

[rajeshbabu] PHOENIX-3002 Upgrading to 4.8 doesn't recreate local indexes(Rajeshbabu)

[ankitsinghal59] PHOENIX-2949 Fix estimated region size when checking for serial query

[samarth] PHOENIX-3023 Slow performance when limit queries are executed in

[samarth] PHOENIX-3031 Rename TestMRJobSubmitter so it is executed as a unit test

[ssa] PHOENIX-3025 CsvBulkloadTool is failing with

[samarth] PHOENIX-3028 StatisticsWriter should update the stats collection

[tdsilva] PHOENIX-3027 Upserting rows to a table with a mutable index using a

[rajeshbabu] PHOENIX-3002 Upgrading to 4.8 doesn't recreate local

[rajeshbabu] PHOENIX-3018 Write local updates to region than HTable in master

[elserj] PHOENIX-2931 Phoenix client asks users to provide configs in cli that

[tdsilva] PHOENIX-2968 Minimize RPCs for ALTER statement over APPEND_ONLY_SCHEMA

[apurtell] PHOENIX-3037 Setup proper security context in compaction/split

[samarth] PHOENIX-3040 Don't use guideposts for executing queries serially

[larsh] PHOENIX-3043 Tune table options for SYSTEM.STATS.

[larsh] PHOENIX-2724 Query with large number of guideposts is slower compared to

[elserj] PHOENIX-3025 Remove guava relocation in queryserver jar

[ankitsinghal59] PHOENIX-2902 Adjust PhoenixDatabaseMetadata#getSchemas query if

[rajeshbabu] PHOENIX-2926 Skip loading data for table having local indexes when there

[maryannxue] PHOENIX-3029 Child/parent optimization cannot work with DESC columns

[ankitsinghal59] PHOENIX-2999 Upgrading Multi-tenant table to map with namespace using

[tdsilva] PHOENIX-3056 Rows cannot be deleted from immutable table when in

[elserj] PHOENIX-3057 Set incremental=false for sqlline-thin

[jamestaylor] PHOENIX-3040 Don't use guideposts for executing queries serially

[rajeshbabu] PHOENIX-3002 Upgrading to 4.8 doesn't recreate local

[ankitsinghal59] PHOENIX-3060 pherf tool is not working (Sergey Soldatov)

[mujtaba] PHOENIX-3061 IndexTool marks index as ACTIVE and exit 0 even if bulkload

[tdsilva] Added ability to run async indexes when hbase cluster is in

[ankitsinghal59] PHOENIX-3063 MutableIndexFailureIT is getting hanged in 4.x-HBase-0.98

[ankitsinghal59] PHOENIX-3045 Data regions in transition forever if RS holding them down

[tdsilva] PHOENIX-3061 IndexTool marks index as ACTIVE and exit 0 even if bulkload

[jamestaylor] PHOENIX-3061 IndexTool marks index as ACTIVE and exit 0 even if bulkload

[jamestaylor] PHOENIX-3061 IndexTool marks index as ACTIVE and exit 0 even if bulkload

[rajeshbabu] PHOENIX-3021 Using local index during compaction is producing NPE(Sergey

[larsh] PHOENIX-3070 Unnecessary use of UUID.randomUUID().

[tdsilva] PHOENIX-3042 Using functional index expression in where statement for

[elserj] PHOENIX-3086 Release artifacts should be "apache-phoenix*"

[elserj] PHOENIX-3085 Remove Copyright ASF from license headers

[elserj] PHOENIX-3087 Add missing license headers to files

[elserj] PHOENIX-3088 Drastically reduce apache-rat-plugin excludes

[elserj] PHOENIX-3089 PHOENIX-3090 Fix L&N for source release

[elserj] PHOENIX-3092 PHOENIX-3093 Reconstruct L&N for binary artifacts from

[elserj] PHOENIX-3101 Remove findbugs' annotations dependency as it is lgpl

[elserj] PHOENIX-3102 Remove jfreechart because it is LPGL licensed (Mujtaba)

[elserj] PHOENIX-3103 Exclude xom from bundling

[ssa] PHOENIX-3078. Hive storage handler does not work if phoenix.table.name

[samarth] PHOENIX-3109 Improve and fix the way we are caching column family names

[samarth] PHOENIX-3019 Addendum - ImmutableBytesWritable as value of the map

[jamestaylor] PHOENIX-2900 Unable to find hash cache once a salted table 's first

[jamestaylor] PHOENIX-2900 Unable to find hash cache once a salted table 's first

[jamestaylor] PHOENIX-3075 Phoenix-hive module is writing under ./build instead of

[rajeshbabu] PHOENIX-3098 Possible NegativeArraySizeException while scanning local

[tdsilva] Fix working of async index building by adding the INDEX_TYPE column name

[tdsilva] PHOENIX-3113 Automatic build of async index will happen even if

[jamestaylor] PHOENIX-3113 Automatic build of async index will happen even if

[samarth] PHOENIX-3121 Queries with filter and reverse scan failing when limit is

[tdsilva] Automatic build of async index will happen even if

[rajeshbabu] PHOENIX-2926 Skip loading data for table having local indexes when there

[samarth] PHOENIX-3121 Mention dependency on HBASE-16296

[tdsilva] PHOENIX-3120 AsyncIndexRebuilderTask fails for transactional tables

[rajeshbabu] PHOENIX-3111 Possible Deadlock/delay while building index, upsert

[tdsilva] PHOENIX-3120 AsyncIndexRebuilderTask fails for transactional tables

[elserj] PHOENIX-3126 Tie a driver instance to a specific user (Prabhjyot Singh)

[elserj] PHOENIX-3136 Do not relocate org.apache.calcite in

[jamestaylor] PHOENIX-3128 Remove extraneous operations during upsert with local

[jamestaylor] PHOENIX-3138 Integration tests are timing out

[tdsilva] PHOENIX-3130 Ignore ASYNC and build indexes synchronously based on

[samarth] PHOENIX-3141 UnnestArrayIT causes builds to hang

[rajeshbabu] PHOENIX-3111 Possible Deadlock/delay while building index, upsert

[ankitsinghal59] PHOENIX-3143 Update KEYS file for 4.8 release

[ankitsinghal59] Set version to 4.8.0-HBase-1.2 for release

[ankitsinghal59] Set version to 4.9.0-HBase-1.2-SNAPSHOT after release

[larsh] PHOENIX-3156 DistinctPrefixFilter optimization produces incorrect

[larsh] PHOENIX-3158 COUNT(DISTINCT) may return null instead of 0 after

[ssa] PHOENIX-3152 Incorrect comparator in QueryOptimizer may cause

[ankitsinghal59] PHOENIX-3149 Local index got corrupted if intermediate compaction happen

[jmahonin] PHOENIX-2236 PHOENIX-2290 PHOENIX-2547 Various phoenix-spark fixes

[elserj] PHOENIX-3164 Cache UGI instances for remote users in PQS

[ankitsinghal59] PHOENIX-2944 DATE Comparison Broken(Saurabh Seth)

[tdsilva] PHOENIX-2995 Write performance severely degrades with large number of

[tdsilva] PHOENIX-2995 Write performance severely degrades with large number of

[samarth] PHOENIX-808 Create snapshot of SYSTEM.CATALOG prior to upgrade and

[larsh] PHOENIX-3195 Slight safety improvement for using DistinctPrefixFilter.

[larsh] PHOENIX-3195 Addendum. (James Taylor)

[jamestaylor] PHOENIX-930 duplicated columns cause query exception and drop table

[tdsilva] PHOENIX-3148 Reduce size of PTable so that more tables can be cached in

[jamestaylor] PHOENIX-1751 Perform aggregations, sorting, etc, in the preScannerNext

[tdsilva] PHOENIX-3203 Tenant cache lookup in Global Cache fails in certain

[samarth] Modify phoenix IT tests to extend BaseHBaseManagedTimeTableReuseIT

[mujtaba] PHOENIX-1647 Correctly return that Phoenix supports schema name

[twdsilva] PHOENIX-2645 Wildcard characters do not match newline characters

[elserj] PHOENIX-3223 Add `hadoop classpath` to PQS classpath when available

[elserj] PHOENIX-3189 Perform Kerberos login before ConnectionInfo is constructed

[elserj] PHOENIX-3189 Ensure that there is no invalid cached state in

------------------------------------------
[...truncated 9832 lines...]
  QueryCompilerTest.testOrderByOrderPreservingFwd:1775 » SQL Error while executi...
  QueryCompilerTest.testOrderByOrderPreservingRev:1800 » SQL Error while executi...
  QueryCompilerTest.testOrderByWithNoProjection:2313 » SQL Error while executing...
  QueryCompilerTest.testPlanForOrderByOrGroupByNotUseRoundRobin:1960->testOrderByOrGroupByDoesntUseRoundRobin:1966
» SQL
  QueryCompilerTest.testProjection:2272 » SQL Error while executing SQL "CREATE ...
  QueryCompilerTest.testRTrimSetScanKey:1033->compileQuery:450->getQueryPlan:464 »
SQL
  QueryCompilerTest.testRegex:1649 » SQL Error while executing SQL "CREATE TABLE...
  QueryCompilerTest.testRegexpSubstrSetScanKeys:908->compileQuery:450->getQueryPlan:464
» SQL
  QueryCompilerTest.testSaltTableJoin:2394 ClassCast org.apache.calcite.jdbc.Pho...
  QueryCompilerTest.testSelectColumnsInOneFamily:1994 » SQL Error while executin...
  QueryCompilerTest.testSelectColumnsInOneFamilyWithSchema:2014 » SQL Error whil...
  QueryCompilerTest.testServerArrayElementProjection1:2091 » SQL Error while exe...
  QueryCompilerTest.testServerArrayElementProjection2:2104 » SQL Error while exe...
  QueryCompilerTest.testServerArrayElementProjection3:2117 » SQL Error while exe...
  QueryCompilerTest.testServerArrayElementProjection4:2130 » SQL Error while exe...
  QueryCompilerTest.testServerArrayElementProjection5:2143 » SQL Error while exe...
  QueryCompilerTest.testServerArrayElementProjectionWithArrayPrimaryKey:2156 » SQL
  QueryCompilerTest.testSubstrSetScanKey:1023->compileQuery:450->getQueryPlan:464 »
SQL
  QueryCompilerTest.testTableAliasMatchesCFName:779 » SQL Error while preparing ...
  QueryCompilerTest.testUnknownColumnInPKConstraint:1180 » SQL Error while execu...
  QueryCompilerTest.testUseRoundRobinIterator:1916 » SQL Error while executing S...
  QueryCompilerTest.testVarBinaryNotLastInMultipartPK:186 » SQL
  QueryMetaDataTest.testBasicResultSetMetaData:306 » SQL Error while preparing s...
  QueryMetaDataTest.testCaseInsensitive:60 » SQL Error while preparing statement...
  QueryMetaDataTest.testCaseMetaData:171 » SQL Error while preparing statement [...
  QueryMetaDataTest.testCoerceToDecimalArithmeticMetaData:280 » SQL Error while ...
  QueryMetaDataTest.testDateAdditionExpressionMetaData1:258 » SQL Error while pr...
  QueryMetaDataTest.testDateAdditionExpressionMetaData2:268 » SQL Error while pr...
  QueryMetaDataTest.testDateSubstractExpressionMetaData1:211 » SQL Error while p...
  QueryMetaDataTest.testDateSubstractExpressionMetaData2:221 » SQL Error while p...
  QueryMetaDataTest.testDateSubstractExpressionMetaData3:234 » SQL Error while p...
  QueryMetaDataTest.testInListParameterMetaData1:128 » SQL Error while preparing...
  QueryMetaDataTest.testInListParameterMetaData2:139 » SQL Error while preparing...
  QueryMetaDataTest.testInListParameterMetaData3:149 » SQL Error while preparing...
  QueryMetaDataTest.testInListParameterMetaData4:159 » SQL Error while preparing...
  QueryMetaDataTest.testKeyPrefixParameterMetaData:201 » SQL Error while prepari...
  QueryMetaDataTest.testLimitParameterMetaData:106 » SQL Error while preparing s...
  QueryMetaDataTest.testLongArithmeticMetaData:294 » SQL Error while preparing s...
  QueryMetaDataTest.testNoParameterMetaData:51 » SQL Error while preparing state...
  QueryMetaDataTest.testNonEqualityRowValueConstructorBindParamMetaDataWithBindArgsOnRHSAndLiteralExprOnLHS:426
» SQL
  QueryMetaDataTest.testParameterMetaData:69 » SQL Error while preparing stateme...
  QueryMetaDataTest.testRoundParameterMetaData:117 » SQL Error while preparing s...
  QueryMetaDataTest.testRowValueConstructorBindParamMetaData:347 » SQL Error whi...
  QueryMetaDataTest.testRowValueConstructorBindParamMetaDataWithBindArgsAtDiffPlacesOnLHSRHS:393
» SQL
  QueryMetaDataTest.testRowValueConstructorBindParamMetaDataWithBindArgsAtSamePlacesOnLHSRHS:382
» SQL
  QueryMetaDataTest.testRowValueConstructorBindParamMetaDataWithBindArgsOnRHSAndLiteralExprOnLHS:415
» SQL
  QueryMetaDataTest.testRowValueConstructorBindParamMetaDataWithLessNumberOfBindArgs:371 »
SQL
  QueryMetaDataTest.testRowValueConstructorBindParamMetaDataWithMoreNumberOfBindArgs:359 »
SQL
  QueryMetaDataTest.testStringConcatMetaData:335 » SQL Error while preparing sta...
  QueryMetaDataTest.testSubstrParameterMetaData:189 » SQL Error while preparing ...
  QueryMetaDataTest.testToDateFunctionMetaData:96 » SQL Error while preparing st...
  QueryMetaDataTest.testTwoDateSubstractExpressionMetaData:247 » SQL Error while...
  QueryMetaDataTest.testUpsertParameterMetaData:82 » SQL Error while preparing s...
  QueryOptimizerTest.testAssertQueryAgainstTenantSpecificViewDoesNotGoThroughIndex:584 »
SQL
  QueryOptimizerTest.testAssertQueryAgainstTenantSpecificViewGoesThroughIndex:548 » SQL
  QueryOptimizerTest.testAssertQueryPlanDetails1:364->testAssertQueryPlanDetails:444 »
SQL
  QueryOptimizerTest.testAssertQueryPlanDetails2:370->testAssertQueryPlanDetails:444 »
SQL
  QueryOptimizerTest.testAssertQueryPlanDetails3:376->testAssertQueryPlanDetails:444 »
SQL
  QueryOptimizerTest.testAssertQueryPlanDetails4:382->testAssertQueryPlanDetails:444 »
SQL
  QueryOptimizerTest.testAssertQueryPlanDetails5:388->testAssertQueryPlanDetails:444 »
SQL
  QueryOptimizerTest.testAssertQueryPlanDetails6:394->testAssertQueryPlanDetails:444 »
SQL
  QueryOptimizerTest.testAssertQueryPlanDetails7:400->testAssertQueryPlanDetails:444 »
SQL
  QueryOptimizerTest.testAssertQueryPlanDetails8:406->testAssertQueryPlanDetails:444 »
SQL
  QueryOptimizerTest.testCharArrayLength:425 » SQL Error while executing SQL "CR...
  QueryOptimizerTest.testChooseIndexEvenWithSelectionStar:177 » SQL Error while ...
  QueryOptimizerTest.testChooseIndexFromCaseSensitiveHint:283 » SQL Error while ...
  QueryOptimizerTest.testChooseIndexFromCaseSensitiveHint2:296 » SQL Error while...
  QueryOptimizerTest.testChooseIndexFromDoubleQuotedHint:310 » SQL Error while e...
  QueryOptimizerTest.testChooseIndexFromHint:270 » SQL Error while executing SQL...
  QueryOptimizerTest.testChooseIndexFromOrderBy:187 » SQL Error while executing ...
  QueryOptimizerTest.testChooseIndexFromOrderByAsc:227 » SQL Error while executi...
  QueryOptimizerTest.testChooseIndexFromOrderByDesc:207 » SQL Error while execut...
  QueryOptimizerTest.testChooseIndexOverTable:125 » SQL Error while executing SQ...
  QueryOptimizerTest.testChooseIndexWithLongestRowKey:248 » SQL Error while exec...
  QueryOptimizerTest.testChoosePointLookupOverOrderByDesc:237 » SQL Error while ...
  QueryOptimizerTest.testChoosePointLookupOverOrderByRemoval:197 » SQL Error whi...
  QueryOptimizerTest.testChooseSmallerTable:332 » SQL Error while executing SQL ...
  QueryOptimizerTest.testChooseTableForDynCols:156 » SQL Error while executing S...
  QueryOptimizerTest.testChooseTableForSelection:145 » SQL Error while executing...
  QueryOptimizerTest.testChooseTableForSelectionStar:166 » SQL Error while execu...
  QueryOptimizerTest.testChooseTableFromOrderByAsc:217 » SQL Error while executi...
  QueryOptimizerTest.testChooseTableOverIndex:135 » SQL Error while executing SQ...
  QueryOptimizerTest.testDistinctPrefixOnIntIndex:633 » SQL does not implement '...
  QueryOptimizerTest.testDistinctPrefixOnVarcharIndex:621 » SQL does not impleme...
  QueryOptimizerTest.testIgnoreIndexesBasedOnHint:259 » SQL Error while executin...
  QueryOptimizerTest.testIndexHintParsing:321 » SQL Error while executing SQL "C...
  QueryOptimizerTest.testOrderByDropped:86 » SQL Error while executing SQL "CREA...
  QueryOptimizerTest.testOrderByDroppedCompositeKey:107 » SQL Error while execut...
  QueryOptimizerTest.testOrderByNotDropped:98 » SQL Error while executing SQL "C...
  QueryOptimizerTest.testOrderByNotDroppedCompositeKey:116 » SQL Error while exe...
  QueryOptimizerTest.testOrderByOptimizedOut:76 » SQL Error while executing SQL ...
  QueryOptimizerTest.testQueryOptimizerShouldSelectThePlanWithMoreNumberOfPKColumns:418 »
SQL
  QueryOptimizerTest.testRVCAllColsForTableWithSecondaryIndexBasic:355 » SQL doe...
  QueryOptimizerTest.testRVCForTableWithSecondaryIndexBasic:344 » SQL does not i...
  QueryOptimizerTest.testRVCUsingPkColsReturnedByPlanShouldUseIndex:67 » SQL doe...
  StatementHintsCompilationTest.testSelectForceRangeScanForEH:100 » SQL Error wh...
  TenantSpecificViewIndexCompileTest.testOrderByOptimizedOut:43 » SQL Error whil...
  TenantSpecificViewIndexCompileTest.testOrderByOptimizedOutWithMultiplePredicatesInView:151
» SQL
  TenantSpecificViewIndexCompileTest.testOrderByOptimizedOutWithPredicateInView:103 » SQL
  TenantSpecificViewIndexCompileTest.testOrderByOptimizedOutWithoutPredicateInView:61 » SQL
  TenantSpecificViewIndexCompileTest.testViewConstantsOptimizedOut:187 » SQL Err...
  TenantSpecificViewIndexCompileTest.testViewConstantsOptimizedOutOnReadOnlyView:218 » SQL
  WhereCompilerTest.testTenantConstraintsAddedToScan:932->BaseTest.createTestTable:852->BaseTest.createTestTable:856->BaseTest.createTestTable:898
» SQL
  WhereCompilerTest.testTenantConstraintsAddedToScanWithNullTenantTypeId:964->BaseTest.createTestTable:852->BaseTest.createTestTable:856->BaseTest.createTestTable:898
» SQL
  WhereOptimizerTest.testDescDecimalRange:157 » SQL Error while executing SQL "c...
  WhereOptimizerTest.testForceSkipScanOnSaltedTable:1223 » SQL Error while execu...
  WhereOptimizerTest.testFullyQualifiedRVCWithTenantSpecificViewAndConnection:1786 » SQL
  WhereOptimizerTest.testMathFunc:104 » SQL Error while executing SQL "create ta...
  WhereOptimizerTest.testNoAggregatorForOrderBy:2022 » SQL Error while executing...
  WhereOptimizerTest.testQueryMoreRVC:1645 » SQL Error while executing SQL "CREA...
  WhereOptimizerTest.testSingleBinaryPaddedKeyExpression:184 » SQL Error while e...
  WhereOptimizerTest.testTrailingIsNull:1943 » SQL Error while executing SQL "CR...
  WhereOptimizerTest.testTrailingIsNullWithOr:1963 » SQL Error while executing S...
  NullValueTest.testAndExpressionWithNullOperands:73 » SQL Error while executing...
  NullValueTest.testComparisonExpressionWithNullOperands:46 » SQL Error while ex...
  NullValueTest.testOrExpressionWithNullOperands:100 » SQL Error while executing...
  SkipScanBigFilterTest.testAllIntersect:615->testIntersect:643 » SQL Error whil...
  SkipScanBigFilterTest.testRangeIntersect:610->testIntersect:643 » SQL Error wh...
  IndexMaintainerTest.tesIndexWithAscBoolean:268->testIndexRowKeyBuilding:65->testIndexRowKeyBuilding:94->testIndexRowKeyBuilding:120
» SQL
  IndexMaintainerTest.tesIndexWithAscFalseBoolean:282->testIndexRowKeyBuilding:65->testIndexRowKeyBuilding:94->testIndexRowKeyBuilding:120
» SQL
  IndexMaintainerTest.tesIndexWithAscNullBoolean:275->testIndexRowKeyBuilding:65->testIndexRowKeyBuilding:94->testIndexRowKeyBuilding:120
» SQL
  IndexMaintainerTest.tesIndexWithBigInt:261->testIndexRowKeyBuilding:65->testIndexRowKeyBuilding:94->testIndexRowKeyBuilding:120
» SQL
  IndexMaintainerTest.tesIndexWithDescBoolean:289->testIndexRowKeyBuilding:65->testIndexRowKeyBuilding:94->testIndexRowKeyBuilding:120
» SQL
  IndexMaintainerTest.tesIndexWithDescFalseBoolean:296->testIndexRowKeyBuilding:65->testIndexRowKeyBuilding:94->testIndexRowKeyBuilding:120
» SQL
  IndexMaintainerTest.tesIndexedExpressionSerialization:307 » SQL Error while ex...
  IndexMaintainerTest.testCompositeDescRowKeyVarAscIndex:241->testIndexRowKeyBuilding:65->testIndexRowKeyBuilding:94->testIndexRowKeyBuilding:120
» SQL
  IndexMaintainerTest.testCompositeDescRowKeyVarDescIndex:236->testIndexRowKeyBuilding:65->testIndexRowKeyBuilding:94->testIndexRowKeyBuilding:120
» SQL
  IndexMaintainerTest.testCompositeDescRowKeyVarFixedDescIndex:231->testIndexRowKeyBuilding:65->testIndexRowKeyBuilding:94->testIndexRowKeyBuilding:120
» SQL
  IndexMaintainerTest.testCompositeDescRowKeyVarFixedDescSaltedIndex:246->testIndexRowKeyBuilding:73->testIndexRowKeyBuilding:94->testIndexRowKeyBuilding:105
» SQL
  IndexMaintainerTest.testCompositeDescRowKeyVarFixedDescSaltedIndexSaltedTable:251->testIndexRowKeyBuilding:73->testIndexRowKeyBuilding:94->testIndexRowKeyBuilding:103
» SQL
  IndexMaintainerTest.testCompositeRowKeyBytesIndex:226->testIndexRowKeyBuilding:65->testIndexRowKeyBuilding:94->testIndexRowKeyBuilding:120
» SQL
  IndexMaintainerTest.testCompositeRowKeyTimeIndex:217->testIndexRowKeyBuilding:65->testIndexRowKeyBuilding:94->testIndexRowKeyBuilding:120
» SQL
  IndexMaintainerTest.testCompositeRowKeyVarFixedAtEndIndex:182->testIndexRowKeyBuilding:65->testIndexRowKeyBuilding:94->testIndexRowKeyBuilding:120
» SQL
  IndexMaintainerTest.testCompositeRowKeyVarFixedDescIndex:208->testIndexRowKeyBuilding:65->testIndexRowKeyBuilding:94->testIndexRowKeyBuilding:120
» SQL
  IndexMaintainerTest.testCompositeRowKeyVarFixedIndex:175->testIndexRowKeyBuilding:65->testIndexRowKeyBuilding:94->testIndexRowKeyBuilding:120
» SQL
  IndexMaintainerTest.testMultiKeyValueCoveredIndex:198->testIndexRowKeyBuilding:69->testIndexRowKeyBuilding:94->testIndexRowKeyBuilding:120
» SQL
  IndexMaintainerTest.testMultiKeyValueCoveredSaltedIndex:256->testIndexRowKeyBuilding:73->testIndexRowKeyBuilding:94->testIndexRowKeyBuilding:105
» SQL
  IndexMaintainerTest.testMultiKeyValueIndex:193->testIndexRowKeyBuilding:65->testIndexRowKeyBuilding:94->testIndexRowKeyBuilding:120
» SQL
  IndexMaintainerTest.testRowKeyVarOnlyIndex:163->testIndexRowKeyBuilding:65->testIndexRowKeyBuilding:94->testIndexRowKeyBuilding:120
» SQL
  IndexMaintainerTest.testSingleKeyValueDescIndex:203->testIndexRowKeyBuilding:65->testIndexRowKeyBuilding:94->testIndexRowKeyBuilding:103
» SQL
  IndexMaintainerTest.testSingleKeyValueIndex:188->testIndexRowKeyBuilding:65->testIndexRowKeyBuilding:94->testIndexRowKeyBuilding:103
» SQL
  IndexMaintainerTest.testVarFixedndex:168->testIndexRowKeyBuilding:65->testIndexRowKeyBuilding:94->testIndexRowKeyBuilding:120
» SQL
  PhoenixDriverTest.testDisallowNegativeScn:85 » Runtime java.sql.SQLException: ...
  PhoenixDriverTest.testFirstConnectionWhenPropsHasTenantId:49 NullPointer
  PhoenixDriverTest.testMaxMutationSizeSetCorrectly:68 » SQL Error while prepari...
  PhoenixPreparedStatementTest.testCustomQueryTimeout:159 » SQL Error while prep...
  PhoenixPreparedStatementTest.testMutationUsingExecuteQueryShouldFail:67 » SQL ...
  PhoenixPreparedStatementTest.testPreparedStatementWithColumnIndexes:192 » SQLFeatureNotSupported
  PhoenixPreparedStatementTest.testPreparedStatementWithColumnNames:200 » SQLFeatureNotSupported
  PhoenixPreparedStatementTest.testPreparedStatementWithGeneratedKeys:184 » SQLFeatureNotSupported
  PhoenixPreparedStatementTest.testQueriesUsingExecuteUpdateShouldFail:80 » SQL ...
  PhoenixPreparedStatementTest.testSetParameter_InvalidIndex:40 » SQL Error whil...
  PhoenixPreparedStatementTest.testSettingNegativeQueryTimeoutViaJdbc:135 » SQL ...
  PhoenixPreparedStatementTest.testSettingQueryTimeoutViaJdbc:98 » SQL Error whi...
  PhoenixPreparedStatementTest.testSettingZeroQueryTimeoutViaJdbc:117 » SQL Erro...
  PhoenixPreparedStatementTest.testZeroCustomQueryTimeout:173 » SQL Error while ...
  PhoenixResultSetMetadataTest.testColumnDisplaySize:38 » SQL Error while execut...
  OrderByTest.testSortOrderForLeadingDescVarLengthColWithNonNullFollowing:73 » SQL
  OrderByTest.testSortOrderForLeadingDescVarLengthColWithNullFollowing:57 » SQL ...
  OrderByTest.testSortOrderForSingleDescTimestampCol:89 » SQL Error while execut...
  OrderByTest.testSortOrderForSingleDescVarLengthCol:41 » SQL Error while execut...
  ParallelIteratorsSplitTest.testGetSplitsWithSkipScanFilter:106->BaseTest.createTestTable:856->BaseTest.createTestTable:898
» SQL
  ParallelIteratorsSplitTest.testGetSplitsWithSkipScanFilter:106->BaseTest.createTestTable:856->BaseTest.createTestTable:898
» SQL
  ParallelIteratorsSplitTest.testGetSplitsWithSkipScanFilter:106->BaseTest.createTestTable:856->BaseTest.createTestTable:898
» SQL
  ParallelIteratorsSplitTest.testGetSplitsWithSkipScanFilter:106->BaseTest.createTestTable:856->BaseTest.createTestTable:898
» SQL
org.apache.phoenix.query.ParallelIteratorsSplitTest.testGetSplitsWithSkipScanFilter[ScanRanges[[[a],
[1], [[B - E)]]] [[a1B - a1E)]](org.apache.phoenix.query.ParallelIteratorsSplitTest)
  Run 1: ParallelIteratorsSplitTest.testGetSplitsWithSkipScanFilter:106->BaseTest.createTestTable:856->BaseTest.createTestTable:898
» SQL
  Run 2: ParallelIteratorsSplitTest.testGetSplitsWithSkipScanFilter:106->BaseTest.createTestTable:856->BaseTest.createTestTable:898
» SQL

  ParallelIteratorsSplitTest.testGetSplitsWithSkipScanFilter:106->BaseTest.createTestTable:856->BaseTest.createTestTable:898
» SQL
  ParallelIteratorsSplitTest.testGetSplitsWithSkipScanFilter:106->BaseTest.createTestTable:856->BaseTest.createTestTable:898
» SQL
  QueryPlanTest.testDescTimestampAtBoundary:237 » SQL Error while executing SQL ...
  QueryPlanTest.testExplainPlan:180 » SQL Error while executing SQL "EXPLAIN SEL...
  QueryPlanTest.testSerialHintIgnoredForNonRowkeyOrderBy:287 » SQL Error while e...
  QueryPlanTest.testTenantSpecificConnWithLimit:198 » SQL Error while executing ...
  QueryPlanTest.testUseOfRoundRobinIteratorSurfaced:263 » SQL Error while execut...
  MutationTest.testDurability:40->testDurability:49 » SQL Error while executing ...
  RowKeySchemaTest.testFixedFixedVar:133->assertExpectedRowKeyValue:49->assertIteration:66
» SQL
  RowKeySchemaTest.testFixedLengthValueAtEnd:123->assertExpectedRowKeyValue:49->assertIteration:66
» SQL
  RowKeySchemaTest.testFixedVarVar:128->assertExpectedRowKeyValue:49->assertIteration:66
» SQL
  RowKeySchemaTest.testVarFixedFixed:148->assertExpectedRowKeyValue:49->assertIteration:66
» SQL
  RowKeySchemaTest.testVarFixedVar:143->assertExpectedRowKeyValue:49->assertIteration:66
» SQL
  RowKeySchemaTest.testVarNullNull:138->assertExpectedRowKeyValue:49->assertIteration:66
» SQL
  RowKeyValueAccessorTest.testFixedLengthValueAtEnd:86->assertExpectedRowKeyValue:45->assertExpectedRowKeyValue:62
» SQL
  PhoenixRuntimeTest.testCaseSensitiveTableNameWithCaseSensitiveSchema:262->getTableTester:278
» SQL
  PhoenixRuntimeTest.testCaseSensitiveTableNameWithCaseSensitiveSchemaWithPeriod:272->getTableTester:278
» SQL
  PhoenixRuntimeTest.testCaseSensitiveTableNameWithSchema:252->getTableTester:278 » SQL
  PhoenixRuntimeTest.testCaseSensitiveTableNameWithoutSchema:242->getTableTester:278 »
SQL
  PhoenixRuntimeTest.testGetTenantIdExpression:178 » SQL Error while executing S...
  PhoenixRuntimeTest.testTableNameWithSchema:235->getTableTester:278 » SQL Error...
  PhoenixRuntimeTest.testTableNameWithoutSchema:225->getTableTester:278 » SQL Er...
  CsvUpsertExecutorTest.setUp:68 » Runtime java.sql.SQLFeatureNotSupportedExcept...
  CsvUpsertExecutorTest.setUp:68 » Runtime java.sql.SQLFeatureNotSupportedExcept...
  CsvUpsertExecutorTest.setUp:68 » Runtime java.sql.SQLFeatureNotSupportedExcept...
  CsvUpsertExecutorTest.setUp:68 » Runtime java.sql.SQLFeatureNotSupportedExcept...
  CsvUpsertExecutorTest.setUp:68 » Runtime java.sql.SQLFeatureNotSupportedExcept...
  CsvUpsertExecutorTest.setUp:68 » Runtime java.sql.SQLFeatureNotSupportedExcept...
  StringToArrayConverterTest.setUp:43 » Runtime java.sql.SQLFeatureNotSupportedE...
  StringToArrayConverterTest.setUp:43 » Runtime java.sql.SQLFeatureNotSupportedE...
  StringToArrayConverterTest.setUp:43 » Runtime java.sql.SQLFeatureNotSupportedE...
  StringToArrayConverterTest.setUp:43 » Runtime java.sql.SQLFeatureNotSupportedE...
  JsonUpsertExecutorTest.setUp:51 » Runtime java.sql.SQLFeatureNotSupportedExcep...
  JsonUpsertExecutorTest.setUp:51 » Runtime java.sql.SQLFeatureNotSupportedExcep...
  JsonUpsertExecutorTest.setUp:51 » Runtime java.sql.SQLFeatureNotSupportedExcep...
  JsonUpsertExecutorTest.setUp:51 » Runtime java.sql.SQLFeatureNotSupportedExcep...
  JsonUpsertExecutorTest.setUp:51 » Runtime java.sql.SQLFeatureNotSupportedExcep...

Tests run: 1556, Failures: 61, Errors: 288, Skipped: 6

[INFO] ------------------------------------------------------------------------
[INFO] Reactor Summary:
[INFO] 
[INFO] Apache Phoenix ..................................... SUCCESS [  2.103 s]
[INFO] Phoenix Core ....................................... FAILURE [01:34 min]
[INFO] Phoenix - Flume .................................... SKIPPED
[INFO] Phoenix - Pig ...................................... SKIPPED
[INFO] Phoenix Query Server Client ........................ SKIPPED
[INFO] Phoenix Query Server ............................... SKIPPED
[INFO] Phoenix - Pherf .................................... SKIPPED
[INFO] Phoenix - Spark .................................... SKIPPED
[INFO] Phoenix - Hive ..................................... SKIPPED
[INFO] Phoenix Client ..................................... SKIPPED
[INFO] Phoenix Server ..................................... SKIPPED
[INFO] Phoenix Assembly ................................... SKIPPED
[INFO] Phoenix - Tracing Web Application .................. SKIPPED
[INFO] ------------------------------------------------------------------------
[INFO] BUILD FAILURE
[INFO] ------------------------------------------------------------------------
[INFO] Total time: 01:38 min
[INFO] Finished at: 2016-09-14T21:45:53+00:00
[INFO] Final Memory: 91M/1323M
[INFO] ------------------------------------------------------------------------
[ERROR] Failed to execute goal org.apache.maven.plugins:maven-surefire-plugin:2.19.1:test
(default-test) on project phoenix-core: There are test failures.
[ERROR] 
[ERROR] Please refer to <https://builds.apache.org/job/Phoenix-calcite/ws/phoenix-core/target/surefire-reports>
for the individual test results.
[ERROR] -> [Help 1]
[ERROR] 
[ERROR] To see the full stack trace of the errors, re-run Maven with the -e switch.
[ERROR] Re-run Maven using the -X switch to enable full debug logging.
[ERROR] 
[ERROR] For more information about the errors and possible solutions, please read the following
articles:
[ERROR] [Help 1] http://cwiki.apache.org/confluence/display/MAVEN/MojoFailureException
[ERROR] 
[ERROR] After correcting the problems, you can resume the build with the command
[ERROR]   mvn <goals> -rf :phoenix-core
Build step 'Invoke top-level Maven targets' marked build as failure
Archiving artifacts
No prior successful build to compare, so performing full copy of artifacts
Recording test results


Mime
View raw message