phoenix-commits mailing list archives

Site index · List index
Message view « Date » · « Thread »
Top « Date » · « Thread »
From Apache Jenkins Server <jenk...@builds.apache.org>
Subject Build failed in Jenkins: Phoenix-4.8-HBase-0.98 #17
Date Sun, 11 Sep 2016 20:43:39 GMT
See <https://builds.apache.org/job/Phoenix-4.8-HBase-0.98/17/changes>

Changes:

[elserj] PHOENIX-3176 Remove unnecessary PQS proxy user authorization

------------------------------------------
[...truncated 712 lines...]
Results :

Tests run: 1223, Failures: 0, Errors: 0, Skipped: 5

[INFO] 
[INFO] --- maven-failsafe-plugin:2.19.1:integration-test (HBaseManagedTimeTableReuseTest)
@ phoenix-core ---

-------------------------------------------------------
 T E S T S
-------------------------------------------------------
Running org.apache.phoenix.end2end.ArrayToStringFunctionIT
Running org.apache.phoenix.end2end.AbsFunctionEnd2EndIT
Running org.apache.phoenix.end2end.ArithmeticQueryIT
Running org.apache.phoenix.end2end.ArraysWithNullsIT
Running org.apache.phoenix.end2end.ArrayFillFunctionIT
Tests run: 1, Failures: 0, Errors: 0, Skipped: 0, Time elapsed: 1.91 sec - in org.apache.phoenix.end2end.AbsFunctionEnd2EndIT
Running org.apache.phoenix.end2end.AutoCommitIT
Tests run: 1, Failures: 0, Errors: 0, Skipped: 0, Time elapsed: 1.031 sec - in org.apache.phoenix.end2end.AutoCommitIT
Running org.apache.phoenix.end2end.CbrtFunctionEnd2EndIT
Tests run: 2, Failures: 0, Errors: 0, Skipped: 0, Time elapsed: 0.438 sec - in org.apache.phoenix.end2end.CbrtFunctionEnd2EndIT
Running org.apache.phoenix.end2end.ConvertTimezoneFunctionIT
Tests run: 26, Failures: 0, Errors: 0, Skipped: 0, Time elapsed: 6.464 sec - in org.apache.phoenix.end2end.ArrayFillFunctionIT
Running org.apache.phoenix.end2end.DecodeFunctionIT
Tests run: 36, Failures: 0, Errors: 0, Skipped: 0, Time elapsed: 9.928 sec - in org.apache.phoenix.end2end.ArrayToStringFunctionIT
Tests run: 7, Failures: 0, Errors: 0, Skipped: 0, Time elapsed: 7.215 sec - in org.apache.phoenix.end2end.ConvertTimezoneFunctionIT
Running org.apache.phoenix.end2end.DynamicFamilyIT
Tests run: 6, Failures: 0, Errors: 0, Skipped: 0, Time elapsed: 6.951 sec - in org.apache.phoenix.end2end.DecodeFunctionIT
Tests run: 16, Failures: 0, Errors: 0, Skipped: 0, Time elapsed: 14.945 sec - in org.apache.phoenix.end2end.ArraysWithNullsIT
Running org.apache.phoenix.end2end.FirstValueFunctionIT
Running org.apache.phoenix.end2end.DynamicUpsertIT
Tests run: 7, Failures: 0, Errors: 0, Skipped: 0, Time elapsed: 0.181 sec - in org.apache.phoenix.end2end.DynamicUpsertIT
Tests run: 4, Failures: 0, Errors: 0, Skipped: 0, Time elapsed: 2.892 sec - in org.apache.phoenix.end2end.DynamicFamilyIT
Running org.apache.phoenix.end2end.GetSetByteBitFunctionEnd2EndIT
Tests run: 1, Failures: 0, Errors: 0, Skipped: 0, Time elapsed: 0.178 sec - in org.apache.phoenix.end2end.GetSetByteBitFunctionEnd2EndIT
Running org.apache.phoenix.end2end.MD5FunctionIT
Running org.apache.phoenix.end2end.LikeExpressionIT
Tests run: 3, Failures: 0, Errors: 0, Skipped: 0, Time elapsed: 3.643 sec - in org.apache.phoenix.end2end.MD5FunctionIT
Tests run: 7, Failures: 0, Errors: 0, Skipped: 0, Time elapsed: 6.895 sec - in org.apache.phoenix.end2end.FirstValueFunctionIT
Running org.apache.phoenix.end2end.MinMaxAggregateFunctionIT
Running org.apache.phoenix.end2end.NthValueFunctionIT
Tests run: 5, Failures: 0, Errors: 0, Skipped: 0, Time elapsed: 4.544 sec - in org.apache.phoenix.end2end.LikeExpressionIT
Running org.apache.phoenix.end2end.OctetLengthFunctionEnd2EndIT
Tests run: 1, Failures: 0, Errors: 0, Skipped: 0, Time elapsed: 1.53 sec - in org.apache.phoenix.end2end.MinMaxAggregateFunctionIT
Tests run: 1, Failures: 0, Errors: 0, Skipped: 0, Time elapsed: 1.49 sec - in org.apache.phoenix.end2end.OctetLengthFunctionEnd2EndIT
Running org.apache.phoenix.end2end.PowerFunctionEnd2EndIT
Running org.apache.phoenix.end2end.PrimitiveTypeIT
Tests run: 9, Failures: 0, Errors: 0, Skipped: 0, Time elapsed: 0.226 sec - in org.apache.phoenix.end2end.PrimitiveTypeIT
Tests run: 26, Failures: 0, Errors: 0, Skipped: 0, Time elapsed: 27.677 sec - in org.apache.phoenix.end2end.ArithmeticQueryIT
Tests run: 1, Failures: 0, Errors: 0, Skipped: 0, Time elapsed: 0.451 sec - in org.apache.phoenix.end2end.PowerFunctionEnd2EndIT
Running org.apache.phoenix.end2end.QueryMoreIT
Running org.apache.phoenix.end2end.RTrimFunctionIT
Running org.apache.phoenix.end2end.ReadOnlyIT
Running org.apache.phoenix.end2end.DistinctPrefixFilterIT
Tests run: 2, Failures: 0, Errors: 0, Skipped: 0, Time elapsed: 2.246 sec - in org.apache.phoenix.end2end.RTrimFunctionIT
Running org.apache.phoenix.end2end.RegexpSplitFunctionIT
Tests run: 11, Failures: 0, Errors: 0, Skipped: 0, Time elapsed: 9.36 sec - in org.apache.phoenix.end2end.NthValueFunctionIT
Running org.apache.phoenix.end2end.ReverseFunctionIT
Tests run: 12, Failures: 0, Errors: 0, Skipped: 0, Time elapsed: 1.976 sec - in org.apache.phoenix.end2end.RegexpSplitFunctionIT
Running org.apache.phoenix.end2end.RoundFloorCeilFunctionsEnd2EndIT
Tests run: 1, Failures: 0, Errors: 0, Skipped: 0, Time elapsed: 6.537 sec - in org.apache.phoenix.end2end.ReadOnlyIT
Running org.apache.phoenix.end2end.SerialIteratorsIT
Tests run: 1, Failures: 0, Errors: 0, Skipped: 0, Time elapsed: 1.545 sec - in org.apache.phoenix.end2end.SerialIteratorsIT
Running org.apache.phoenix.end2end.ServerExceptionIT
Tests run: 33, Failures: 0, Errors: 0, Skipped: 0, Time elapsed: 4.199 sec - in org.apache.phoenix.end2end.RoundFloorCeilFunctionsEnd2EndIT
Tests run: 5, Failures: 0, Errors: 0, Skipped: 0, Time elapsed: 5.411 sec - in org.apache.phoenix.end2end.ReverseFunctionIT
Running org.apache.phoenix.end2end.SortOrderIT
Tests run: 1, Failures: 0, Errors: 0, Skipped: 0, Time elapsed: 1.35 sec - in org.apache.phoenix.end2end.ServerExceptionIT
Running org.apache.phoenix.end2end.StatementHintsIT
Running org.apache.phoenix.end2end.SignFunctionEnd2EndIT
Tests run: 2, Failures: 0, Errors: 0, Skipped: 0, Time elapsed: 0.325 sec - in org.apache.phoenix.end2end.SignFunctionEnd2EndIT
Tests run: 2, Failures: 0, Errors: 0, Skipped: 0, Time elapsed: 1.49 sec - in org.apache.phoenix.end2end.StatementHintsIT
Running org.apache.phoenix.end2end.StringToArrayFunctionIT
Running org.apache.phoenix.end2end.StoreNullsIT
Tests run: 6, Failures: 0, Errors: 0, Skipped: 0, Time elapsed: 17.87 sec - in org.apache.phoenix.end2end.QueryMoreIT
Running org.apache.phoenix.end2end.TimezoneOffsetFunctionIT
Tests run: 5, Failures: 0, Errors: 0, Skipped: 0, Time elapsed: 20.664 sec - in org.apache.phoenix.end2end.DistinctPrefixFilterIT
Running org.apache.phoenix.end2end.ToCharFunctionIT
Tests run: 22, Failures: 0, Errors: 0, Skipped: 0, Time elapsed: 8.021 sec - in org.apache.phoenix.end2end.StringToArrayFunctionIT
Running org.apache.phoenix.end2end.UpsertSelectAutoCommitIT
Tests run: 7, Failures: 0, Errors: 0, Skipped: 0, Time elapsed: 7.829 sec - in org.apache.phoenix.end2end.TimezoneOffsetFunctionIT
Running org.apache.phoenix.end2end.index.AsyncIndexDisabledIT
Tests run: 4, Failures: 0, Errors: 0, Skipped: 0, Time elapsed: 11.846 sec - in org.apache.phoenix.end2end.StoreNullsIT
Running org.apache.phoenix.end2end.index.ChildViewsUseParentViewIndexIT
Tests run: 3, Failures: 0, Errors: 0, Skipped: 0, Time elapsed: 6.462 sec - in org.apache.phoenix.end2end.UpsertSelectAutoCommitIT
Tests run: 1, Failures: 0, Errors: 0, Skipped: 0, Time elapsed: 2.755 sec - in org.apache.phoenix.end2end.index.AsyncIndexDisabledIT
Running org.apache.phoenix.end2end.salted.SaltedTableUpsertSelectIT
Running org.apache.phoenix.end2end.salted.SaltedTableVarLengthRowKeyIT
Tests run: 1, Failures: 0, Errors: 0, Skipped: 0, Time elapsed: 1.446 sec - in org.apache.phoenix.end2end.salted.SaltedTableVarLengthRowKeyIT
Tests run: 2, Failures: 0, Errors: 0, Skipped: 0, Time elapsed: 4.639 sec - in org.apache.phoenix.end2end.index.ChildViewsUseParentViewIndexIT
Running org.apache.phoenix.iterate.PhoenixQueryTimeoutIT
Tests run: 2, Failures: 0, Errors: 0, Skipped: 0, Time elapsed: 0.178 sec - in org.apache.phoenix.iterate.PhoenixQueryTimeoutIT
Tests run: 12, Failures: 0, Errors: 0, Skipped: 0, Time elapsed: 15.315 sec - in org.apache.phoenix.end2end.ToCharFunctionIT
Tests run: 6, Failures: 0, Errors: 0, Skipped: 0, Time elapsed: 17.827 sec - in org.apache.phoenix.end2end.salted.SaltedTableUpsertSelectIT
Tests run: 45, Failures: 0, Errors: 0, Skipped: 0, Time elapsed: 65.567 sec - in org.apache.phoenix.end2end.SortOrderIT

Results :

Tests run: 346, Failures: 0, Errors: 0, Skipped: 0

[INFO] 
[INFO] --- maven-failsafe-plugin:2.19.1:integration-test (NeedTheirOwnClusterTests) @ phoenix-core
---

-------------------------------------------------------
 T E S T S
-------------------------------------------------------
Running org.apache.hadoop.hbase.regionserver.wal.WALReplayWithIndexWritesAndUncompressedWALInHBase_094_9_IT
Running org.apache.hadoop.hbase.regionserver.wal.WALReplayWithIndexWritesAndCompressedWALIT
Tests run: 1, Failures: 0, Errors: 0, Skipped: 0, Time elapsed: 18.873 sec - in org.apache.hadoop.hbase.regionserver.wal.WALReplayWithIndexWritesAndUncompressedWALInHBase_094_9_IT
Tests run: 1, Failures: 0, Errors: 0, Skipped: 0, Time elapsed: 19.76 sec - in org.apache.hadoop.hbase.regionserver.wal.WALReplayWithIndexWritesAndCompressedWALIT
Running org.apache.phoenix.coprocessor.StatisticsCollectionRunTrackerIT
Running org.apache.phoenix.end2end.AlterTableIT
Running org.apache.phoenix.end2end.ConnectionUtilIT
Running org.apache.phoenix.end2end.ContextClassloaderIT
Tests run: 4, Failures: 0, Errors: 0, Skipped: 0, Time elapsed: 24.98 sec - in org.apache.phoenix.coprocessor.StatisticsCollectionRunTrackerIT
Running org.apache.phoenix.end2end.CountDistinctCompressionIT
Tests run: 1, Failures: 0, Errors: 0, Skipped: 0, Time elapsed: 17.668 sec - in org.apache.phoenix.end2end.ConnectionUtilIT
Tests run: 3, Failures: 0, Errors: 0, Skipped: 0, Time elapsed: 3.201 sec - in org.apache.phoenix.end2end.ContextClassloaderIT
Tests run: 1, Failures: 0, Errors: 0, Skipped: 0, Time elapsed: 4.286 sec - in org.apache.phoenix.end2end.CountDistinctCompressionIT
Running org.apache.phoenix.end2end.KeyOnlyIT
Running org.apache.phoenix.end2end.CsvBulkLoadToolIT
Running org.apache.phoenix.end2end.IndexToolIT
Running org.apache.phoenix.end2end.MultiCfQueryExecIT
Tests run: 3, Failures: 0, Errors: 0, Skipped: 0, Time elapsed: 14.6 sec - in org.apache.phoenix.end2end.KeyOnlyIT
Tests run: 9, Failures: 0, Errors: 0, Skipped: 0, Time elapsed: 24.691 sec - in org.apache.phoenix.end2end.MultiCfQueryExecIT
Running org.apache.phoenix.end2end.MutableIndexToolIT
Running org.apache.phoenix.end2end.ParallelIteratorsIT
Tests run: 3, Failures: 0, Errors: 0, Skipped: 0, Time elapsed: 15.119 sec - in org.apache.phoenix.end2end.ParallelIteratorsIT
Running org.apache.phoenix.end2end.QueryTimeoutIT
Tests run: 1, Failures: 0, Errors: 0, Skipped: 0, Time elapsed: 80.889 sec - in org.apache.phoenix.end2end.MutableIndexToolIT
Tests run: 2, Failures: 0, Errors: 0, Skipped: 0, Time elapsed: 14.339 sec - in org.apache.phoenix.end2end.QueryTimeoutIT
Running org.apache.phoenix.end2end.QueryWithLimitIT
Tests run: 2, Failures: 0, Errors: 0, Skipped: 0, Time elapsed: 12.853 sec - in org.apache.phoenix.end2end.QueryWithLimitIT
Running org.apache.phoenix.end2end.QueryWithOffsetIT
Running org.apache.phoenix.end2end.RenewLeaseIT
Tests run: 1, Failures: 0, Errors: 0, Skipped: 1, Time elapsed: 0.002 sec - in org.apache.phoenix.end2end.RenewLeaseIT
Tests run: 8, Failures: 0, Errors: 0, Skipped: 0, Time elapsed: 13.807 sec - in org.apache.phoenix.end2end.QueryWithOffsetIT
Running org.apache.phoenix.end2end.SaltedViewIT
Tests run: 56, Failures: 0, Errors: 0, Skipped: 0, Time elapsed: 285.316 sec - in org.apache.phoenix.end2end.AlterTableIT
Running org.apache.phoenix.end2end.SpillableGroupByIT
Tests run: 4, Failures: 0, Errors: 0, Skipped: 0, Time elapsed: 33.964 sec - in org.apache.phoenix.end2end.SaltedViewIT
Tests run: 1, Failures: 0, Errors: 0, Skipped: 0, Time elapsed: 14.776 sec - in org.apache.phoenix.end2end.SpillableGroupByIT
Running org.apache.phoenix.end2end.StatsCollectionDisabledIT
Tests run: 1, Failures: 0, Errors: 0, Skipped: 0, Time elapsed: 4.519 sec - in org.apache.phoenix.end2end.StatsCollectionDisabledIT
Running org.apache.phoenix.end2end.StatsCollectorIT
Running org.apache.phoenix.end2end.StatsCollectorWithSplitsAndMultiCFIT
Tests run: 2, Failures: 0, Errors: 0, Skipped: 0, Time elapsed: 12.419 sec - in org.apache.phoenix.end2end.StatsCollectorWithSplitsAndMultiCFIT
Running org.apache.phoenix.end2end.TenantSpecificTablesDDLIT
Running org.apache.phoenix.end2end.TenantSpecificTablesDMLIT
Tests run: 17, Failures: 0, Errors: 0, Skipped: 0, Time elapsed: 34.381 sec - in org.apache.phoenix.end2end.TenantSpecificTablesDDLIT
Tests run: 16, Failures: 0, Errors: 0, Skipped: 0, Time elapsed: 24.003 sec - in org.apache.phoenix.end2end.TenantSpecificTablesDMLIT
Running org.apache.phoenix.end2end.TransactionalViewIT
Running org.apache.phoenix.end2end.UnionAllIT
Tests run: 16, Failures: 0, Errors: 0, Skipped: 0, Time elapsed: 125.185 sec - in org.apache.phoenix.end2end.StatsCollectorIT
Tests run: 17, Failures: 0, Errors: 0, Skipped: 0, Time elapsed: 32.97 sec - in org.apache.phoenix.end2end.UnionAllIT
Running org.apache.phoenix.end2end.ViewIT
Tests run: 2, Failures: 0, Errors: 0, Skipped: 0, Time elapsed: 64.976 sec - in org.apache.phoenix.end2end.TransactionalViewIT
Running org.apache.phoenix.end2end.UserDefinedFunctionsIT
Tests run: 10, Failures: 0, Errors: 0, Skipped: 0, Time elapsed: 458.531 sec - in org.apache.phoenix.end2end.CsvBulkLoadToolIT
Tests run: 14, Failures: 0, Errors: 0, Skipped: 0, Time elapsed: 26.855 sec - in org.apache.phoenix.end2end.UserDefinedFunctionsIT
Running org.apache.phoenix.end2end.index.AsyncImmutableIndexIT
Running org.apache.phoenix.end2end.index.ImmutableIndexWithStatsIT
Tests run: 1, Failures: 0, Errors: 0, Skipped: 0, Time elapsed: 4.366 sec - in org.apache.phoenix.end2end.index.ImmutableIndexWithStatsIT
Running org.apache.phoenix.end2end.index.MutableIndexFailureIT
Running org.apache.phoenix.end2end.index.MutableIndexReplicationIT
Tests run: 1, Failures: 0, Errors: 0, Skipped: 0, Time elapsed: 18.82 sec - in org.apache.phoenix.end2end.index.MutableIndexReplicationIT
Tests run: 1, Failures: 0, Errors: 0, Skipped: 0, Time elapsed: 100.028 sec - in org.apache.phoenix.end2end.index.AsyncImmutableIndexIT
Running org.apache.phoenix.end2end.index.ReadOnlyIndexFailureIT
Tests run: 48, Failures: 0, Errors: 0, Skipped: 0, Time elapsed: 154.313 sec - in org.apache.phoenix.end2end.ViewIT
Tests run: 2, Failures: 0, Errors: 0, Skipped: 0, Time elapsed: 24.505 sec - in org.apache.phoenix.end2end.index.ReadOnlyIndexFailureIT
Running org.apache.phoenix.hbase.index.FailForUnsupportedHBaseVersionsIT
Running org.apache.phoenix.end2end.index.txn.TxWriteFailureIT
Tests run: 8, Failures: 0, Errors: 0, Skipped: 0, Time elapsed: 115.991 sec - in org.apache.phoenix.end2end.index.MutableIndexFailureIT
Running org.apache.phoenix.execute.PartialCommitIT
Tests run: 1, Failures: 0, Errors: 1, Skipped: 0, Time elapsed: 0.064 sec <<< FAILURE!
- in org.apache.phoenix.execute.PartialCommitIT
org.apache.phoenix.execute.PartialCommitIT  Time elapsed: 0.064 sec  <<< ERROR!
java.io.IOException: No such file or directory
	at org.apache.phoenix.execute.PartialCommitIT.doSetup(PartialCommitIT.java:92)

Tests run: 2, Failures: 0, Errors: 0, Skipped: 0, Time elapsed: 20.662 sec - in org.apache.phoenix.hbase.index.FailForUnsupportedHBaseVersionsIT
Running org.apache.phoenix.hbase.index.covered.EndToEndCoveredColumnsIndexBuilderIT
Tests run: 8, Failures: 0, Errors: 0, Skipped: 0, Time elapsed: 32.345 sec - in org.apache.phoenix.end2end.index.txn.TxWriteFailureIT
Tests run: 2, Failures: 0, Errors: 0, Skipped: 0, Time elapsed: 7.976 sec - in org.apache.phoenix.hbase.index.covered.EndToEndCoveredColumnsIndexBuilderIT
Running org.apache.phoenix.hbase.index.covered.example.EndToEndCoveredIndexingIT
Running org.apache.phoenix.hbase.index.covered.example.EndtoEndIndexingWithCompressionIT
Running org.apache.phoenix.hbase.index.covered.example.FailWithoutRetriesIT
Tests run: 1, Failures: 0, Errors: 0, Skipped: 0, Time elapsed: 8.242 sec - in org.apache.phoenix.hbase.index.covered.example.FailWithoutRetriesIT
Running org.apache.phoenix.iterate.RoundRobinResultIteratorWithStatsIT
Tests run: 1, Failures: 0, Errors: 0, Skipped: 0, Time elapsed: 14.248 sec - in org.apache.phoenix.iterate.RoundRobinResultIteratorWithStatsIT
Running org.apache.phoenix.iterate.ScannerLeaseRenewalIT
Tests run: 11, Failures: 0, Errors: 0, Skipped: 0, Time elapsed: 53.538 sec - in org.apache.phoenix.hbase.index.covered.example.EndToEndCoveredIndexingIT
Tests run: 11, Failures: 0, Errors: 0, Skipped: 0, Time elapsed: 52.489 sec - in org.apache.phoenix.hbase.index.covered.example.EndtoEndIndexingWithCompressionIT
Running org.apache.phoenix.monitoring.PhoenixMetricsIT
Running org.apache.phoenix.rpc.PhoenixClientRpcIT
Running org.apache.phoenix.rpc.PhoenixServerRpcIT
Tests run: 2, Failures: 0, Errors: 0, Skipped: 0, Time elapsed: 5.467 sec - in org.apache.phoenix.rpc.PhoenixClientRpcIT
Tests run: 1, Failures: 0, Errors: 0, Skipped: 0, Time elapsed: 15.245 sec - in org.apache.phoenix.rpc.PhoenixServerRpcIT
Tests run: 18, Failures: 0, Errors: 0, Skipped: 0, Time elapsed: 46.032 sec - in org.apache.phoenix.monitoring.PhoenixMetricsIT
Tests run: 16, Failures: 0, Errors: 0, Skipped: 0, Time elapsed: 850.737 sec - in org.apache.phoenix.end2end.IndexToolIT
Tests run: 2, Failures: 0, Errors: 0, Skipped: 0, Time elapsed: 163.992 sec - in org.apache.phoenix.iterate.ScannerLeaseRenewalIT

Results :

Tests in error: 
  PartialCommitIT.doSetup:92->BaseTest.setUpTestDriver:632->BaseTest.setupTxManager:534
ยป IO

Tests run: 333, Failures: 0, Errors: 1, Skipped: 1

[INFO] 
[INFO] --- maven-failsafe-plugin:2.19.1:verify (ClientManagedTimeTests) @ phoenix-core ---
[INFO] ------------------------------------------------------------------------
[INFO] Reactor Summary:
[INFO] 
[INFO] Apache Phoenix ..................................... SUCCESS [  2.309 s]
[INFO] Phoenix Core ....................................... FAILURE [41:25 min]
[INFO] Phoenix - Flume .................................... SKIPPED
[INFO] Phoenix - Pig ...................................... SKIPPED
[INFO] Phoenix Query Server Client ........................ SKIPPED
[INFO] Phoenix Query Server ............................... SKIPPED
[INFO] Phoenix - Pherf .................................... SKIPPED
[INFO] Phoenix - Spark .................................... SKIPPED
[INFO] Phoenix - Hive ..................................... SKIPPED
[INFO] Phoenix Client ..................................... SKIPPED
[INFO] Phoenix Server ..................................... SKIPPED
[INFO] Phoenix Assembly ................................... SKIPPED
[INFO] Phoenix - Tracing Web Application .................. SKIPPED
[INFO] ------------------------------------------------------------------------
[INFO] BUILD FAILURE
[INFO] ------------------------------------------------------------------------
[INFO] Total time: 41:29 min
[INFO] Finished at: 2016-09-11T20:35:05+00:00
[INFO] Final Memory: 73M/1157M
[INFO] ------------------------------------------------------------------------
[ERROR] Failed to execute goal org.apache.maven.plugins:maven-failsafe-plugin:2.19.1:verify
(ClientManagedTimeTests) on project phoenix-core: There are test failures.
[ERROR] 
[ERROR] Please refer to <https://builds.apache.org/job/Phoenix-4.8-HBase-0.98/ws/phoenix-core/target/failsafe-reports>
for the individual test results.
[ERROR] -> [Help 1]
[ERROR] 
[ERROR] To see the full stack trace of the errors, re-run Maven with the -e switch.
[ERROR] Re-run Maven using the -X switch to enable full debug logging.
[ERROR] 
[ERROR] For more information about the errors and possible solutions, please read the following
articles:
[ERROR] [Help 1] http://cwiki.apache.org/confluence/display/MAVEN/MojoFailureException
[ERROR] 
[ERROR] After correcting the problems, you can resume the build with the command
[ERROR]   mvn <goals> -rf :phoenix-core
Build step 'Invoke top-level Maven targets' marked build as failure
Archiving artifacts
Compressed 1.89 GB of artifacts by 56.2% relative to #14
Recording test results

Mime
View raw message