phoenix-commits mailing list archives

Site index · List index
Message view « Date » · « Thread »
Top « Date » · « Thread »
From Apache Jenkins Server <jenk...@builds.apache.org>
Subject Build failed in Jenkins: Phoenix-4.8-HBase-1.0 #3
Date Thu, 01 Sep 2016 01:03:55 GMT
See <https://builds.apache.org/job/Phoenix-4.8-HBase-1.0/3/changes>

Changes:

[elserj] PHOENIX-3189 Perform Kerberos login before ConnectionInfo is constructed

------------------------------------------
[...truncated 331 lines...]
Running org.apache.phoenix.hbase.index.util.TestIndexManagementUtil
Tests run: 3, Failures: 0, Errors: 0, Skipped: 0, Time elapsed: 0.002 sec - in org.apache.phoenix.hbase.index.util.TestIndexManagementUtil
Running org.apache.phoenix.memory.MemoryManagerTest
Tests run: 6, Failures: 0, Errors: 0, Skipped: 3, Time elapsed: 0.041 sec - in org.apache.phoenix.memory.MemoryManagerTest
Running org.apache.phoenix.cache.TenantCacheTest
Tests run: 2, Failures: 0, Errors: 0, Skipped: 0, Time elapsed: 0.007 sec - in org.apache.phoenix.cache.TenantCacheTest
Running org.apache.phoenix.cache.JodaTimezoneCacheTest
Tests run: 4, Failures: 0, Errors: 0, Skipped: 0, Time elapsed: 0.015 sec - in org.apache.phoenix.cache.JodaTimezoneCacheTest
Running org.apache.phoenix.expression.ArrayFillFunctionTest
Tests run: 14, Failures: 0, Errors: 0, Skipped: 0, Time elapsed: 0.01 sec - in org.apache.phoenix.expression.ArrayFillFunctionTest
Running org.apache.phoenix.expression.ColumnExpressionTest
Tests run: 4, Failures: 0, Errors: 0, Skipped: 0, Time elapsed: 0.002 sec - in org.apache.phoenix.expression.ColumnExpressionTest
Running org.apache.phoenix.expression.SortOrderExpressionTest
Tests run: 24, Failures: 0, Errors: 0, Skipped: 0, Time elapsed: 0.111 sec - in org.apache.phoenix.expression.SortOrderExpressionTest
Running org.apache.phoenix.expression.LikeExpressionTest
Tests run: 5, Failures: 0, Errors: 0, Skipped: 0, Time elapsed: 0.011 sec - in org.apache.phoenix.expression.LikeExpressionTest
Running org.apache.phoenix.expression.CoerceExpressionTest
Tests run: 5, Failures: 0, Errors: 0, Skipped: 0, Time elapsed: 0.004 sec - in org.apache.phoenix.expression.CoerceExpressionTest
Running org.apache.phoenix.expression.StringToArrayFunctionTest
Tests run: 20, Failures: 0, Errors: 0, Skipped: 0, Time elapsed: 0.012 sec - in org.apache.phoenix.expression.StringToArrayFunctionTest
Running org.apache.phoenix.expression.RegexpSubstrFunctionTest
Tests run: 1, Failures: 0, Errors: 0, Skipped: 0, Time elapsed: 0.007 sec - in org.apache.phoenix.expression.RegexpSubstrFunctionTest
Running org.apache.phoenix.expression.ArrayToStringFunctionTest
Tests run: 24, Failures: 0, Errors: 0, Skipped: 0, Time elapsed: 0.012 sec - in org.apache.phoenix.expression.ArrayToStringFunctionTest
Running org.apache.phoenix.expression.ArrayPrependFunctionTest
Tests run: 37, Failures: 0, Errors: 0, Skipped: 0, Time elapsed: 0.138 sec - in org.apache.phoenix.expression.ArrayPrependFunctionTest
Running org.apache.phoenix.expression.ILikeExpressionTest
Tests run: 3, Failures: 0, Errors: 0, Skipped: 0, Time elapsed: 0.01 sec - in org.apache.phoenix.expression.ILikeExpressionTest
Running org.apache.phoenix.expression.PowerFunctionTest
Tests run: 1, Failures: 0, Errors: 0, Skipped: 0, Time elapsed: 0.111 sec - in org.apache.phoenix.expression.PowerFunctionTest
Running org.apache.phoenix.expression.LnLogFunctionTest
Tests run: 1, Failures: 0, Errors: 0, Skipped: 0, Time elapsed: 0.023 sec - in org.apache.phoenix.expression.LnLogFunctionTest
Running org.apache.phoenix.expression.ExpFunctionTest
Tests run: 1, Failures: 0, Errors: 0, Skipped: 0, Time elapsed: 0.006 sec - in org.apache.phoenix.expression.ExpFunctionTest
Running org.apache.phoenix.expression.ArrayAppendFunctionTest
Tests run: 25, Failures: 0, Errors: 0, Skipped: 0, Time elapsed: 0.081 sec - in org.apache.phoenix.expression.ArrayAppendFunctionTest
Running org.apache.phoenix.expression.CbrtFunctionTest
Tests run: 1, Failures: 0, Errors: 0, Skipped: 0, Time elapsed: 0.006 sec - in org.apache.phoenix.expression.CbrtFunctionTest
Running org.apache.phoenix.expression.function.ExternalSqlTypeIdFunctionTest
Tests run: 3, Failures: 0, Errors: 0, Skipped: 0, Time elapsed: 0.002 sec - in org.apache.phoenix.expression.function.ExternalSqlTypeIdFunctionTest
Running org.apache.phoenix.expression.function.InstrFunctionTest
Tests run: 1, Failures: 0, Errors: 0, Skipped: 0, Time elapsed: 0.002 sec - in org.apache.phoenix.expression.function.InstrFunctionTest
Running org.apache.phoenix.expression.function.BuiltinFunctionConstructorTest
Tests run: 2, Failures: 0, Errors: 0, Skipped: 0, Time elapsed: 0.032 sec - in org.apache.phoenix.expression.function.BuiltinFunctionConstructorTest
Running org.apache.phoenix.expression.ArrayConcatFunctionTest
Tests run: 35, Failures: 0, Errors: 0, Skipped: 0, Time elapsed: 0.335 sec - in org.apache.phoenix.expression.ArrayConcatFunctionTest
Running org.apache.phoenix.expression.RegexpReplaceFunctionTest
Tests run: 1, Failures: 0, Errors: 0, Skipped: 0, Time elapsed: 0.005 sec - in org.apache.phoenix.expression.RegexpReplaceFunctionTest
Running org.apache.phoenix.expression.NullValueTest
Tests run: 3, Failures: 0, Errors: 0, Skipped: 0, Time elapsed: 0.143 sec - in org.apache.phoenix.expression.NullValueTest
Running org.apache.phoenix.expression.RoundFloorCeilExpressionsTest
Tests run: 22, Failures: 0, Errors: 0, Skipped: 0, Time elapsed: 0.381 sec - in org.apache.phoenix.expression.RoundFloorCeilExpressionsTest
Running org.apache.phoenix.expression.DeterminismTest
Tests run: 1, Failures: 0, Errors: 0, Skipped: 0, Time elapsed: 0.001 sec - in org.apache.phoenix.expression.DeterminismTest
Running org.apache.phoenix.expression.RegexpSplitFunctionTest
Tests run: 1, Failures: 0, Errors: 0, Skipped: 0, Time elapsed: 0.009 sec - in org.apache.phoenix.expression.RegexpSplitFunctionTest
Running org.apache.phoenix.expression.SqrtFunctionTest
Tests run: 1, Failures: 0, Errors: 0, Skipped: 0, Time elapsed: 0.005 sec - in org.apache.phoenix.expression.SqrtFunctionTest
Running org.apache.phoenix.expression.OctetLengthFunctionTest
Tests run: 1, Failures: 0, Errors: 0, Skipped: 0, Time elapsed: 0.009 sec - in org.apache.phoenix.expression.OctetLengthFunctionTest
Running org.apache.phoenix.expression.ArithmeticOperationTest
Tests run: 6, Failures: 0, Errors: 0, Skipped: 0, Time elapsed: 0.007 sec - in org.apache.phoenix.expression.ArithmeticOperationTest
Running org.apache.phoenix.expression.SignFunctionTest
Tests run: 1, Failures: 0, Errors: 0, Skipped: 0, Time elapsed: 0.01 sec - in org.apache.phoenix.expression.SignFunctionTest
Running org.apache.phoenix.expression.GetSetByteBitFunctionTest
Tests run: 2, Failures: 0, Errors: 0, Skipped: 0, Time elapsed: 0.447 sec - in org.apache.phoenix.expression.GetSetByteBitFunctionTest
Running org.apache.phoenix.expression.util.regex.PatternPerformanceTest
Tests run: 1, Failures: 0, Errors: 0, Skipped: 0, Time elapsed: 0.002 sec - in org.apache.phoenix.expression.util.regex.PatternPerformanceTest
Running org.apache.phoenix.expression.AbsFunctionTest
Tests run: 1, Failures: 0, Errors: 0, Skipped: 0, Time elapsed: 0.009 sec - in org.apache.phoenix.expression.AbsFunctionTest
Running org.apache.phoenix.trace.TraceMetricsSourceTest
Tests run: 3, Failures: 0, Errors: 0, Skipped: 0, Time elapsed: 0.182 sec - in org.apache.phoenix.trace.TraceMetricsSourceTest
Running org.apache.phoenix.util.csv.StringToArrayConverterTest
Tests run: 4, Failures: 0, Errors: 0, Skipped: 0, Time elapsed: 0.194 sec - in org.apache.phoenix.util.csv.StringToArrayConverterTest
Running org.apache.phoenix.util.csv.CsvUpsertExecutorTest
Tests run: 6, Failures: 0, Errors: 0, Skipped: 0, Time elapsed: 0.206 sec - in org.apache.phoenix.util.csv.CsvUpsertExecutorTest
Running org.apache.phoenix.util.PrefixByteEncoderDecoderTest
Tests run: 3, Failures: 0, Errors: 0, Skipped: 0, Time elapsed: 0.002 sec - in org.apache.phoenix.util.PrefixByteEncoderDecoderTest
Running org.apache.phoenix.util.LikeExpressionTest
Tests run: 1, Failures: 0, Errors: 0, Skipped: 0, Time elapsed: 0.001 sec - in org.apache.phoenix.util.LikeExpressionTest
Running org.apache.phoenix.util.TenantIdByteConversionTest
Tests run: 18, Failures: 0, Errors: 0, Skipped: 0, Time elapsed: 0.019 sec - in org.apache.phoenix.util.TenantIdByteConversionTest
Running org.apache.phoenix.util.QueryUtilTest
Tests run: 9, Failures: 0, Errors: 0, Skipped: 0, Time elapsed: 0.006 sec - in org.apache.phoenix.util.QueryUtilTest
Running org.apache.phoenix.util.StringUtilTest
Tests run: 5, Failures: 0, Errors: 0, Skipped: 0, Time elapsed: 0.002 sec - in org.apache.phoenix.util.StringUtilTest
Running org.apache.phoenix.util.MetaDataUtilTest
Tests run: 4, Failures: 0, Errors: 0, Skipped: 0, Time elapsed: 0.023 sec - in org.apache.phoenix.util.MetaDataUtilTest
Running org.apache.phoenix.util.PhoenixContextExecutorTest
Tests run: 1, Failures: 0, Errors: 0, Skipped: 0, Time elapsed: 0.001 sec - in org.apache.phoenix.util.PhoenixContextExecutorTest
Running org.apache.phoenix.util.JDBCUtilTest
Tests run: 12, Failures: 0, Errors: 0, Skipped: 0, Time elapsed: 0.004 sec - in org.apache.phoenix.util.JDBCUtilTest
Running org.apache.phoenix.util.ScanUtilTest
Tests run: 20, Failures: 0, Errors: 0, Skipped: 0, Time elapsed: 0.017 sec - in org.apache.phoenix.util.ScanUtilTest
Running org.apache.phoenix.util.PhoenixRuntimeTest
Tests run: 2, Failures: 0, Errors: 0, Skipped: 0, Time elapsed: 4.753 sec - in org.apache.phoenix.query.ScannerLeaseRenewalTest
Running org.apache.phoenix.util.json.JsonUpsertExecutorTest
Tests run: 11, Failures: 0, Errors: 0, Skipped: 0, Time elapsed: 0.369 sec - in org.apache.phoenix.util.PhoenixRuntimeTest
Running org.apache.phoenix.util.Base62EncoderTest
Tests run: 1, Failures: 0, Errors: 0, Skipped: 0, Time elapsed: 0.014 sec - in org.apache.phoenix.util.Base62EncoderTest
Running org.apache.phoenix.util.DateUtilTest
Tests run: 22, Failures: 0, Errors: 0, Skipped: 0, Time elapsed: 0.012 sec - in org.apache.phoenix.util.DateUtilTest
Running org.apache.phoenix.util.ColumnInfoTest
Tests run: 5, Failures: 0, Errors: 0, Skipped: 0, Time elapsed: 0.004 sec - in org.apache.phoenix.util.ColumnInfoTest
Running org.apache.phoenix.util.PhoenixEncodeDecodeTest
Tests run: 5, Failures: 0, Errors: 0, Skipped: 0, Time elapsed: 0.402 sec - in org.apache.phoenix.util.json.JsonUpsertExecutorTest
Running org.apache.phoenix.util.PropertiesUtilTest
Tests run: 3, Failures: 0, Errors: 0, Skipped: 0, Time elapsed: 0.019 sec - in org.apache.phoenix.util.PropertiesUtilTest
Running org.apache.phoenix.util.ByteUtilTest
Tests run: 4, Failures: 0, Errors: 0, Skipped: 0, Time elapsed: 0.147 sec - in org.apache.phoenix.util.PhoenixEncodeDecodeTest
Running org.apache.phoenix.util.LogUtilTest
Tests run: 3, Failures: 0, Errors: 0, Skipped: 0, Time elapsed: 0.079 sec - in org.apache.phoenix.util.ByteUtilTest
Running org.apache.phoenix.util.SequenceUtilTest
Tests run: 18, Failures: 0, Errors: 0, Skipped: 0, Time elapsed: 0.008 sec - in org.apache.phoenix.util.SequenceUtilTest
Running org.apache.phoenix.util.IndexUtilTest
Tests run: 2, Failures: 0, Errors: 0, Skipped: 0, Time elapsed: 0.002 sec - in org.apache.phoenix.util.IndexUtilTest
Running org.apache.hadoop.hbase.ipc.PhoenixIndexRpcSchedulerTest
Tests run: 3, Failures: 0, Errors: 0, Skipped: 0, Time elapsed: 0.063 sec - in org.apache.phoenix.util.LogUtilTest
Running org.apache.hadoop.hbase.regionserver.PhoenixRpcSchedulerFactoryTest
Tests run: 2, Failures: 0, Errors: 0, Skipped: 0, Time elapsed: 0.012 sec - in org.apache.hadoop.hbase.regionserver.PhoenixRpcSchedulerFactoryTest
Tests run: 2, Failures: 0, Errors: 0, Skipped: 0, Time elapsed: 0.214 sec - in org.apache.hadoop.hbase.ipc.PhoenixIndexRpcSchedulerTest
Tests run: 7, Failures: 0, Errors: 7, Skipped: 0, Time elapsed: 20.264 sec <<< FAILURE!
- in org.apache.phoenix.jdbc.SecureUserConnectionsTest
testMultipleConnectionsAsSameUserWithoutLogin(org.apache.phoenix.jdbc.SecureUserConnectionsTest)
 Time elapsed: 0.238 sec  <<< ERROR!
java.sql.SQLException: ERROR 103 (08004): Unable to establish connection.
	at org.apache.phoenix.jdbc.SecureUserConnectionsTest.testMultipleConnectionsAsSameUserWithoutLogin(SecureUserConnectionsTest.java:326)
Caused by: java.io.IOException: Login failure for user1@EXAMPLE.COM from keytab <https://builds.apache.org/job/Phoenix-4.8-HBase-1.0/ws/phoenix-core/target/SecureUserConnectionsTest/keytabs/user1.keytab>:
javax.security.auth.login.LoginException: java.lang.IllegalArgumentException: Illegal principal
name user1@EXAMPLE.COM: org.apache.hadoop.security.authentication.util.KerberosName$NoMatchingRule:
No rules applied to user1@EXAMPLE.COM
	at org.apache.phoenix.jdbc.SecureUserConnectionsTest.testMultipleConnectionsAsSameUserWithoutLogin(SecureUserConnectionsTest.java:326)
Caused by: javax.security.auth.login.LoginException: java.lang.IllegalArgumentException: Illegal
principal name user1@EXAMPLE.COM: org.apache.hadoop.security.authentication.util.KerberosName$NoMatchingRule:
No rules applied to user1@EXAMPLE.COM
	at org.apache.phoenix.jdbc.SecureUserConnectionsTest.testMultipleConnectionsAsSameUserWithoutLogin(SecureUserConnectionsTest.java:326)
Caused by: java.lang.IllegalArgumentException: Illegal principal name user1@EXAMPLE.COM: org.apache.hadoop.security.authentication.util.KerberosName$NoMatchingRule:
No rules applied to user1@EXAMPLE.COM
	at org.apache.phoenix.jdbc.SecureUserConnectionsTest.testMultipleConnectionsAsSameUserWithoutLogin(SecureUserConnectionsTest.java:326)
Caused by: org.apache.hadoop.security.authentication.util.KerberosName$NoMatchingRule: No
rules applied to user1@EXAMPLE.COM
	at org.apache.phoenix.jdbc.SecureUserConnectionsTest.testMultipleConnectionsAsSameUserWithoutLogin(SecureUserConnectionsTest.java:326)

testAlternatingDestructiveLogins(org.apache.phoenix.jdbc.SecureUserConnectionsTest)  Time
elapsed: 0.023 sec  <<< ERROR!
java.io.IOException: Login failure for user1@EXAMPLE.COM from keytab <https://builds.apache.org/job/Phoenix-4.8-HBase-1.0/ws/phoenix-core/target/SecureUserConnectionsTest/keytabs/user1.keytab>:
javax.security.auth.login.LoginException: java.lang.IllegalArgumentException: Illegal principal
name user1@EXAMPLE.COM: org.apache.hadoop.security.authentication.util.KerberosName$NoMatchingRule:
No rules applied to user1@EXAMPLE.COM
	at org.apache.phoenix.jdbc.SecureUserConnectionsTest.testAlternatingDestructiveLogins(SecureUserConnectionsTest.java:280)
Caused by: javax.security.auth.login.LoginException: java.lang.IllegalArgumentException: Illegal
principal name user1@EXAMPLE.COM: org.apache.hadoop.security.authentication.util.KerberosName$NoMatchingRule:
No rules applied to user1@EXAMPLE.COM
	at org.apache.phoenix.jdbc.SecureUserConnectionsTest.testAlternatingDestructiveLogins(SecureUserConnectionsTest.java:280)
Caused by: java.lang.IllegalArgumentException: Illegal principal name user1@EXAMPLE.COM: org.apache.hadoop.security.authentication.util.KerberosName$NoMatchingRule:
No rules applied to user1@EXAMPLE.COM
	at org.apache.phoenix.jdbc.SecureUserConnectionsTest.testAlternatingDestructiveLogins(SecureUserConnectionsTest.java:280)
Caused by: org.apache.hadoop.security.authentication.util.KerberosName$NoMatchingRule: No
rules applied to user1@EXAMPLE.COM
	at org.apache.phoenix.jdbc.SecureUserConnectionsTest.testAlternatingDestructiveLogins(SecureUserConnectionsTest.java:280)

testAlternatingLogins(org.apache.phoenix.jdbc.SecureUserConnectionsTest)  Time elapsed: 0.015
sec  <<< ERROR!
java.io.IOException: Login failure for user1@EXAMPLE.COM from keytab <https://builds.apache.org/job/Phoenix-4.8-HBase-1.0/ws/phoenix-core/target/SecureUserConnectionsTest/keytabs/user1.keytab>
	at org.apache.phoenix.jdbc.SecureUserConnectionsTest.testAlternatingLogins(SecureUserConnectionsTest.java:234)
Caused by: javax.security.auth.login.LoginException: java.lang.IllegalArgumentException: Illegal
principal name user1@EXAMPLE.COM: org.apache.hadoop.security.authentication.util.KerberosName$NoMatchingRule:
No rules applied to user1@EXAMPLE.COM
	at org.apache.phoenix.jdbc.SecureUserConnectionsTest.testAlternatingLogins(SecureUserConnectionsTest.java:234)
Caused by: java.lang.IllegalArgumentException: Illegal principal name user1@EXAMPLE.COM: org.apache.hadoop.security.authentication.util.KerberosName$NoMatchingRule:
No rules applied to user1@EXAMPLE.COM
	at org.apache.phoenix.jdbc.SecureUserConnectionsTest.testAlternatingLogins(SecureUserConnectionsTest.java:234)
Caused by: org.apache.hadoop.security.authentication.util.KerberosName$NoMatchingRule: No
rules applied to user1@EXAMPLE.COM
	at org.apache.phoenix.jdbc.SecureUserConnectionsTest.testAlternatingLogins(SecureUserConnectionsTest.java:234)

testAlternatingConnectionsWithoutLogin(org.apache.phoenix.jdbc.SecureUserConnectionsTest)
 Time elapsed: 0.019 sec  <<< ERROR!
java.sql.SQLException: ERROR 103 (08004): Unable to establish connection.
	at org.apache.phoenix.jdbc.SecureUserConnectionsTest.testAlternatingConnectionsWithoutLogin(SecureUserConnectionsTest.java:347)
Caused by: java.io.IOException: Login failure for user1@EXAMPLE.COM from keytab <https://builds.apache.org/job/Phoenix-4.8-HBase-1.0/ws/phoenix-core/target/SecureUserConnectionsTest/keytabs/user1.keytab>:
javax.security.auth.login.LoginException: java.lang.IllegalArgumentException: Illegal principal
name user1@EXAMPLE.COM: org.apache.hadoop.security.authentication.util.KerberosName$NoMatchingRule:
No rules applied to user1@EXAMPLE.COM
	at org.apache.phoenix.jdbc.SecureUserConnectionsTest.testAlternatingConnectionsWithoutLogin(SecureUserConnectionsTest.java:347)
Caused by: javax.security.auth.login.LoginException: java.lang.IllegalArgumentException: Illegal
principal name user1@EXAMPLE.COM: org.apache.hadoop.security.authentication.util.KerberosName$NoMatchingRule:
No rules applied to user1@EXAMPLE.COM
	at org.apache.phoenix.jdbc.SecureUserConnectionsTest.testAlternatingConnectionsWithoutLogin(SecureUserConnectionsTest.java:347)
Caused by: java.lang.IllegalArgumentException: Illegal principal name user1@EXAMPLE.COM: org.apache.hadoop.security.authentication.util.KerberosName$NoMatchingRule:
No rules applied to user1@EXAMPLE.COM
	at org.apache.phoenix.jdbc.SecureUserConnectionsTest.testAlternatingConnectionsWithoutLogin(SecureUserConnectionsTest.java:347)
Caused by: org.apache.hadoop.security.authentication.util.KerberosName$NoMatchingRule: No
rules applied to user1@EXAMPLE.COM
	at org.apache.phoenix.jdbc.SecureUserConnectionsTest.testAlternatingConnectionsWithoutLogin(SecureUserConnectionsTest.java:347)

testMultipleUniqueUGIInstancesAreDisjoint(org.apache.phoenix.jdbc.SecureUserConnectionsTest)
 Time elapsed: 0.015 sec  <<< ERROR!
java.io.IOException: Login failure for user1@EXAMPLE.COM from keytab <https://builds.apache.org/job/Phoenix-4.8-HBase-1.0/ws/phoenix-core/target/SecureUserConnectionsTest/keytabs/user1.keytab>
	at org.apache.phoenix.jdbc.SecureUserConnectionsTest.testMultipleUniqueUGIInstancesAreDisjoint(SecureUserConnectionsTest.java:204)
Caused by: javax.security.auth.login.LoginException: java.lang.IllegalArgumentException: Illegal
principal name user1@EXAMPLE.COM: org.apache.hadoop.security.authentication.util.KerberosName$NoMatchingRule:
No rules applied to user1@EXAMPLE.COM
	at org.apache.phoenix.jdbc.SecureUserConnectionsTest.testMultipleUniqueUGIInstancesAreDisjoint(SecureUserConnectionsTest.java:204)
Caused by: java.lang.IllegalArgumentException: Illegal principal name user1@EXAMPLE.COM: org.apache.hadoop.security.authentication.util.KerberosName$NoMatchingRule:
No rules applied to user1@EXAMPLE.COM
	at org.apache.phoenix.jdbc.SecureUserConnectionsTest.testMultipleUniqueUGIInstancesAreDisjoint(SecureUserConnectionsTest.java:204)
Caused by: org.apache.hadoop.security.authentication.util.KerberosName$NoMatchingRule: No
rules applied to user1@EXAMPLE.COM
	at org.apache.phoenix.jdbc.SecureUserConnectionsTest.testMultipleUniqueUGIInstancesAreDisjoint(SecureUserConnectionsTest.java:204)

testMultipleInvocationsBySameUserAreEquivalent(org.apache.phoenix.jdbc.SecureUserConnectionsTest)
 Time elapsed: 0.014 sec  <<< ERROR!
java.io.IOException: Login failure for user1@EXAMPLE.COM from keytab <https://builds.apache.org/job/Phoenix-4.8-HBase-1.0/ws/phoenix-core/target/SecureUserConnectionsTest/keytabs/user1.keytab>
	at org.apache.phoenix.jdbc.SecureUserConnectionsTest.testMultipleInvocationsBySameUserAreEquivalent(SecureUserConnectionsTest.java:178)
Caused by: javax.security.auth.login.LoginException: java.lang.IllegalArgumentException: Illegal
principal name user1@EXAMPLE.COM: org.apache.hadoop.security.authentication.util.KerberosName$NoMatchingRule:
No rules applied to user1@EXAMPLE.COM
	at org.apache.phoenix.jdbc.SecureUserConnectionsTest.testMultipleInvocationsBySameUserAreEquivalent(SecureUserConnectionsTest.java:178)
Caused by: java.lang.IllegalArgumentException: Illegal principal name user1@EXAMPLE.COM: org.apache.hadoop.security.authentication.util.KerberosName$NoMatchingRule:
No rules applied to user1@EXAMPLE.COM
	at org.apache.phoenix.jdbc.SecureUserConnectionsTest.testMultipleInvocationsBySameUserAreEquivalent(SecureUserConnectionsTest.java:178)
Caused by: org.apache.hadoop.security.authentication.util.KerberosName$NoMatchingRule: No
rules applied to user1@EXAMPLE.COM
	at org.apache.phoenix.jdbc.SecureUserConnectionsTest.testMultipleInvocationsBySameUserAreEquivalent(SecureUserConnectionsTest.java:178)

testMultipleConnectionsAsSameUser(org.apache.phoenix.jdbc.SecureUserConnectionsTest)  Time
elapsed: 0.015 sec  <<< ERROR!
java.io.IOException: Login failure for user1@EXAMPLE.COM from keytab <https://builds.apache.org/job/Phoenix-4.8-HBase-1.0/ws/phoenix-core/target/SecureUserConnectionsTest/keytabs/user1.keytab>:
javax.security.auth.login.LoginException: java.lang.IllegalArgumentException: Illegal principal
name user1@EXAMPLE.COM: org.apache.hadoop.security.authentication.util.KerberosName$NoMatchingRule:
No rules applied to user1@EXAMPLE.COM
	at org.apache.phoenix.jdbc.SecureUserConnectionsTest.testMultipleConnectionsAsSameUser(SecureUserConnectionsTest.java:306)
Caused by: javax.security.auth.login.LoginException: java.lang.IllegalArgumentException: Illegal
principal name user1@EXAMPLE.COM: org.apache.hadoop.security.authentication.util.KerberosName$NoMatchingRule:
No rules applied to user1@EXAMPLE.COM
	at org.apache.phoenix.jdbc.SecureUserConnectionsTest.testMultipleConnectionsAsSameUser(SecureUserConnectionsTest.java:306)
Caused by: java.lang.IllegalArgumentException: Illegal principal name user1@EXAMPLE.COM: org.apache.hadoop.security.authentication.util.KerberosName$NoMatchingRule:
No rules applied to user1@EXAMPLE.COM
	at org.apache.phoenix.jdbc.SecureUserConnectionsTest.testMultipleConnectionsAsSameUser(SecureUserConnectionsTest.java:306)
Caused by: org.apache.hadoop.security.authentication.util.KerberosName$NoMatchingRule: No
rules applied to user1@EXAMPLE.COM
	at org.apache.phoenix.jdbc.SecureUserConnectionsTest.testMultipleConnectionsAsSameUser(SecureUserConnectionsTest.java:306)


Results :

Tests in error: 
  SecureUserConnectionsTest.testAlternatingConnectionsWithoutLogin:347 » SQL ERR...
  SecureUserConnectionsTest.testAlternatingDestructiveLogins:280 » IO Login fail...
  SecureUserConnectionsTest.testAlternatingLogins:234 » IO Login failure for use...
  SecureUserConnectionsTest.testMultipleConnectionsAsSameUser:306 » IO Login fai...
  SecureUserConnectionsTest.testMultipleConnectionsAsSameUserWithoutLogin:326 » SQL
  SecureUserConnectionsTest.testMultipleInvocationsBySameUserAreEquivalent:178 » IO
  SecureUserConnectionsTest.testMultipleUniqueUGIInstancesAreDisjoint:204 » IO L...

Tests run: 1395, Failures: 0, Errors: 7, Skipped: 5

[INFO] ------------------------------------------------------------------------
[INFO] Reactor Summary:
[INFO] 
[INFO] Apache Phoenix ..................................... SUCCESS [  2.493 s]
[INFO] Phoenix Core ....................................... FAILURE [01:05 min]
[INFO] Phoenix - Flume .................................... SKIPPED
[INFO] Phoenix - Pig ...................................... SKIPPED
[INFO] Phoenix Query Server Client ........................ SKIPPED
[INFO] Phoenix Query Server ............................... SKIPPED
[INFO] Phoenix - Pherf .................................... SKIPPED
[INFO] Phoenix - Spark .................................... SKIPPED
[INFO] Phoenix - Hive ..................................... SKIPPED
[INFO] Phoenix Client ..................................... SKIPPED
[INFO] Phoenix Server ..................................... SKIPPED
[INFO] Phoenix Assembly ................................... SKIPPED
[INFO] Phoenix - Tracing Web Application .................. SKIPPED
[INFO] ------------------------------------------------------------------------
[INFO] BUILD FAILURE
[INFO] ------------------------------------------------------------------------
[INFO] Total time: 01:10 min
[INFO] Finished at: 2016-09-01T00:58:13+00:00
[INFO] Final Memory: 82M/1370M
[INFO] ------------------------------------------------------------------------
[ERROR] Failed to execute goal org.apache.maven.plugins:maven-surefire-plugin:2.19.1:test
(default-test) on project phoenix-core: There are test failures.
[ERROR] 
[ERROR] Please refer to <https://builds.apache.org/job/Phoenix-4.8-HBase-1.0/ws/phoenix-core/target/surefire-reports>
for the individual test results.
[ERROR] -> [Help 1]
[ERROR] 
[ERROR] To see the full stack trace of the errors, re-run Maven with the -e switch.
[ERROR] Re-run Maven using the -X switch to enable full debug logging.
[ERROR] 
[ERROR] For more information about the errors and possible solutions, please read the following
articles:
[ERROR] [Help 1] http://cwiki.apache.org/confluence/display/MAVEN/MojoFailureException
[ERROR] 
[ERROR] After correcting the problems, you can resume the build with the command
[ERROR]   mvn <goals> -rf :phoenix-core
Build step 'Invoke top-level Maven targets' marked build as failure
Archiving artifacts
Recording test results

Mime
View raw message