phoenix-commits mailing list archives

Site index · List index
Message view « Date » · « Thread »
Top « Date » · « Thread »
From Apache Jenkins Server <jenk...@builds.apache.org>
Subject Build failed in Jenkins: Phoenix-4.x-HBase-1.1 #151
Date Wed, 03 Aug 2016 12:56:44 GMT
See <https://builds.apache.org/job/Phoenix-4.x-HBase-1.1/151/>

------------------------------------------
[...truncated 2105 lines...]
Caused by: java.lang.RuntimeException: Master not initialized after 200000ms seconds
	at org.apache.phoenix.end2end.index.AsyncImmutableIndexIT.doSetup(AsyncImmutableIndexIT.java:52)

Tests run: 1, Failures: 0, Errors: 1, Skipped: 0, Time elapsed: 0.009 sec <<< FAILURE!
- in org.apache.phoenix.end2end.ViewIT
org.apache.phoenix.end2end.ViewIT  Time elapsed: 0.008 sec  <<< ERROR!
java.lang.RuntimeException: java.io.IOException: Shutting down
Caused by: java.io.IOException: Shutting down
Caused by: java.lang.RuntimeException: Master not initialized after 200000ms seconds

Running org.apache.phoenix.end2end.index.ImmutableIndexWithStatsIT
Tests run: 1, Failures: 0, Errors: 1, Skipped: 0, Time elapsed: 0.006 sec <<< FAILURE!
- in org.apache.phoenix.end2end.index.ImmutableIndexWithStatsIT
org.apache.phoenix.end2end.index.ImmutableIndexWithStatsIT  Time elapsed: 0.005 sec  <<<
ERROR!
java.lang.RuntimeException: java.io.IOException: Shutting down
	at org.apache.phoenix.end2end.index.ImmutableIndexWithStatsIT.doSetup(ImmutableIndexWithStatsIT.java:52)
Caused by: java.io.IOException: Shutting down
	at org.apache.phoenix.end2end.index.ImmutableIndexWithStatsIT.doSetup(ImmutableIndexWithStatsIT.java:52)
Caused by: java.lang.RuntimeException: Master not initialized after 200000ms seconds
	at org.apache.phoenix.end2end.index.ImmutableIndexWithStatsIT.doSetup(ImmutableIndexWithStatsIT.java:52)

Running org.apache.phoenix.end2end.index.MutableIndexFailureIT
Tests run: 1, Failures: 0, Errors: 1, Skipped: 0, Time elapsed: 0.006 sec <<< FAILURE!
- in org.apache.phoenix.end2end.index.MutableIndexFailureIT
org.apache.phoenix.end2end.index.MutableIndexFailureIT  Time elapsed: 0.005 sec  <<<
ERROR!
java.lang.RuntimeException: java.io.IOException: Shutting down
	at org.apache.phoenix.end2end.index.MutableIndexFailureIT.doSetup(MutableIndexFailureIT.java:115)
Caused by: java.io.IOException: Shutting down
	at org.apache.phoenix.end2end.index.MutableIndexFailureIT.doSetup(MutableIndexFailureIT.java:115)
Caused by: java.lang.RuntimeException: Master not initialized after 200000ms seconds
	at org.apache.phoenix.end2end.index.MutableIndexFailureIT.doSetup(MutableIndexFailureIT.java:115)

Running org.apache.phoenix.hbase.index.FailForUnsupportedHBaseVersionsIT
Running org.apache.phoenix.end2end.index.MutableIndexReplicationIT
Tests run: 1, Failures: 0, Errors: 1, Skipped: 0, Time elapsed: 0.006 sec <<< FAILURE!
- in org.apache.phoenix.end2end.index.MutableIndexReplicationIT
org.apache.phoenix.end2end.index.MutableIndexReplicationIT  Time elapsed: 0.005 sec  <<<
ERROR!
java.io.IOException: Shutting down
	at org.apache.phoenix.end2end.index.MutableIndexReplicationIT.setupConfigsAndStartCluster(MutableIndexReplicationIT.java:170)
	at org.apache.phoenix.end2end.index.MutableIndexReplicationIT.setUpBeforeClass(MutableIndexReplicationIT.java:108)
Caused by: java.lang.RuntimeException: Master not initialized after 200000ms seconds
	at org.apache.phoenix.end2end.index.MutableIndexReplicationIT.setupConfigsAndStartCluster(MutableIndexReplicationIT.java:170)
	at org.apache.phoenix.end2end.index.MutableIndexReplicationIT.setUpBeforeClass(MutableIndexReplicationIT.java:108)

Running org.apache.phoenix.end2end.index.ReadOnlyIndexFailureIT
Tests run: 1, Failures: 0, Errors: 1, Skipped: 0, Time elapsed: 0.007 sec <<< FAILURE!
- in org.apache.phoenix.end2end.index.ReadOnlyIndexFailureIT
org.apache.phoenix.end2end.index.ReadOnlyIndexFailureIT  Time elapsed: 0.006 sec  <<<
ERROR!
java.lang.RuntimeException: java.io.IOException: Shutting down
	at org.apache.phoenix.end2end.index.ReadOnlyIndexFailureIT.doSetup(ReadOnlyIndexFailureIT.java:119)
Caused by: java.io.IOException: Shutting down
	at org.apache.phoenix.end2end.index.ReadOnlyIndexFailureIT.doSetup(ReadOnlyIndexFailureIT.java:119)
Caused by: java.lang.RuntimeException: Master not initialized after 200000ms seconds
	at org.apache.phoenix.end2end.index.ReadOnlyIndexFailureIT.doSetup(ReadOnlyIndexFailureIT.java:119)

Running org.apache.phoenix.end2end.index.txn.TxWriteFailureIT
Tests run: 1, Failures: 0, Errors: 1, Skipped: 0, Time elapsed: 0.005 sec <<< FAILURE!
- in org.apache.phoenix.end2end.index.txn.TxWriteFailureIT
org.apache.phoenix.end2end.index.txn.TxWriteFailureIT  Time elapsed: 0.004 sec  <<<
ERROR!
java.lang.RuntimeException: java.io.IOException: Shutting down
	at org.apache.phoenix.end2end.index.txn.TxWriteFailureIT.doSetup(TxWriteFailureIT.java:86)
Caused by: java.io.IOException: Shutting down
	at org.apache.phoenix.end2end.index.txn.TxWriteFailureIT.doSetup(TxWriteFailureIT.java:86)
Caused by: java.lang.RuntimeException: Master not initialized after 200000ms seconds
	at org.apache.phoenix.end2end.index.txn.TxWriteFailureIT.doSetup(TxWriteFailureIT.java:86)

Running org.apache.phoenix.execute.PartialCommitIT
Tests run: 1, Failures: 0, Errors: 1, Skipped: 0, Time elapsed: 0.007 sec <<< FAILURE!
- in org.apache.phoenix.execute.PartialCommitIT
org.apache.phoenix.execute.PartialCommitIT  Time elapsed: 0.006 sec  <<< ERROR!
java.lang.RuntimeException: java.io.IOException: Shutting down
	at org.apache.phoenix.execute.PartialCommitIT.doSetup(PartialCommitIT.java:92)
Caused by: java.io.IOException: Shutting down
	at org.apache.phoenix.execute.PartialCommitIT.doSetup(PartialCommitIT.java:92)
Caused by: java.lang.RuntimeException: Master not initialized after 200000ms seconds
	at org.apache.phoenix.execute.PartialCommitIT.doSetup(PartialCommitIT.java:92)

Tests run: 2, Failures: 0, Errors: 1, Skipped: 0, Time elapsed: 208.927 sec <<< FAILURE!
- in org.apache.phoenix.hbase.index.FailForUnsupportedHBaseVersionsIT
testDoesNotStartRegionServerForUnsupportedCompressionAndVersion(org.apache.phoenix.hbase.index.FailForUnsupportedHBaseVersionsIT)
 Time elapsed: 208.327 sec  <<< ERROR!
java.io.IOException: Shutting down
	at org.apache.phoenix.hbase.index.FailForUnsupportedHBaseVersionsIT.testDoesNotStartRegionServerForUnsupportedCompressionAndVersion(FailForUnsupportedHBaseVersionsIT.java:121)
Caused by: java.lang.RuntimeException: Master not initialized after 200000ms seconds
	at org.apache.phoenix.hbase.index.FailForUnsupportedHBaseVersionsIT.testDoesNotStartRegionServerForUnsupportedCompressionAndVersion(FailForUnsupportedHBaseVersionsIT.java:121)

Running org.apache.phoenix.hbase.index.covered.EndToEndCoveredColumnsIndexBuilderIT
Tests run: 1, Failures: 0, Errors: 1, Skipped: 0, Time elapsed: 0.004 sec <<< FAILURE!
- in org.apache.phoenix.hbase.index.covered.EndToEndCoveredColumnsIndexBuilderIT
org.apache.phoenix.hbase.index.covered.EndToEndCoveredColumnsIndexBuilderIT  Time elapsed:
0.004 sec  <<< ERROR!
java.io.IOException: Shutting down
	at org.apache.phoenix.hbase.index.covered.EndToEndCoveredColumnsIndexBuilderIT.setupCluster(EndToEndCoveredColumnsIndexBuilderIT.java:107)
Caused by: java.lang.RuntimeException: Master not initialized after 200000ms seconds
	at org.apache.phoenix.hbase.index.covered.EndToEndCoveredColumnsIndexBuilderIT.setupCluster(EndToEndCoveredColumnsIndexBuilderIT.java:107)

Running org.apache.phoenix.hbase.index.covered.example.EndToEndCoveredIndexingIT
Tests run: 1, Failures: 0, Errors: 1, Skipped: 0, Time elapsed: 0.006 sec <<< FAILURE!
- in org.apache.phoenix.hbase.index.covered.example.EndToEndCoveredIndexingIT
org.apache.phoenix.hbase.index.covered.example.EndToEndCoveredIndexingIT  Time elapsed: 0.005
sec  <<< ERROR!
java.io.IOException: Shutting down
	at org.apache.phoenix.hbase.index.covered.example.EndToEndCoveredIndexingIT.setupCluster(EndToEndCoveredIndexingIT.java:131)
Caused by: java.lang.RuntimeException: Master not initialized after 200000ms seconds
	at org.apache.phoenix.hbase.index.covered.example.EndToEndCoveredIndexingIT.setupCluster(EndToEndCoveredIndexingIT.java:131)

Running org.apache.phoenix.hbase.index.covered.example.EndtoEndIndexingWithCompressionIT
Tests run: 1, Failures: 0, Errors: 1, Skipped: 0, Time elapsed: 0.004 sec <<< FAILURE!
- in org.apache.phoenix.hbase.index.covered.example.EndtoEndIndexingWithCompressionIT
org.apache.phoenix.hbase.index.covered.example.EndtoEndIndexingWithCompressionIT  Time elapsed:
0.004 sec  <<< ERROR!
java.io.IOException: Shutting down
	at org.apache.phoenix.hbase.index.covered.example.EndtoEndIndexingWithCompressionIT.setupCluster(EndtoEndIndexingWithCompressionIT.java:42)
Caused by: java.lang.RuntimeException: Master not initialized after 200000ms seconds
	at org.apache.phoenix.hbase.index.covered.example.EndtoEndIndexingWithCompressionIT.setupCluster(EndtoEndIndexingWithCompressionIT.java:42)

Running org.apache.phoenix.hbase.index.covered.example.FailWithoutRetriesIT
Tests run: 1, Failures: 0, Errors: 1, Skipped: 0, Time elapsed: 0.007 sec <<< FAILURE!
- in org.apache.phoenix.hbase.index.covered.example.FailWithoutRetriesIT
org.apache.phoenix.hbase.index.covered.example.FailWithoutRetriesIT  Time elapsed: 0.006 sec
 <<< ERROR!
java.io.IOException: Shutting down
	at org.apache.phoenix.hbase.index.covered.example.FailWithoutRetriesIT.setupCluster(FailWithoutRetriesIT.java:84)
Caused by: java.lang.RuntimeException: Master not initialized after 200000ms seconds
	at org.apache.phoenix.hbase.index.covered.example.FailWithoutRetriesIT.setupCluster(FailWithoutRetriesIT.java:84)

Running org.apache.phoenix.iterate.RoundRobinResultIteratorWithStatsIT
Tests run: 1, Failures: 0, Errors: 1, Skipped: 0, Time elapsed: 0.004 sec <<< FAILURE!
- in org.apache.phoenix.iterate.RoundRobinResultIteratorWithStatsIT
org.apache.phoenix.iterate.RoundRobinResultIteratorWithStatsIT  Time elapsed: 0.004 sec  <<<
ERROR!
java.lang.RuntimeException: java.io.IOException: Shutting down
	at org.apache.phoenix.iterate.RoundRobinResultIteratorWithStatsIT.doSetup(RoundRobinResultIteratorWithStatsIT.java:58)
Caused by: java.io.IOException: Shutting down
	at org.apache.phoenix.iterate.RoundRobinResultIteratorWithStatsIT.doSetup(RoundRobinResultIteratorWithStatsIT.java:58)
Caused by: java.lang.RuntimeException: Master not initialized after 200000ms seconds
	at org.apache.phoenix.iterate.RoundRobinResultIteratorWithStatsIT.doSetup(RoundRobinResultIteratorWithStatsIT.java:58)

Running org.apache.phoenix.iterate.ScannerLeaseRenewalIT
Tests run: 1, Failures: 0, Errors: 1, Skipped: 0, Time elapsed: 0.006 sec <<< FAILURE!
- in org.apache.phoenix.iterate.ScannerLeaseRenewalIT
org.apache.phoenix.iterate.ScannerLeaseRenewalIT  Time elapsed: 0.005 sec  <<< ERROR!
java.io.IOException: Shutting down
	at org.apache.phoenix.iterate.ScannerLeaseRenewalIT.setUp(ScannerLeaseRenewalIT.java:70)
Caused by: java.lang.RuntimeException: Master not initialized after 200000ms seconds
	at org.apache.phoenix.iterate.ScannerLeaseRenewalIT.setUp(ScannerLeaseRenewalIT.java:70)

Running org.apache.phoenix.monitoring.PhoenixMetricsIT
Tests run: 1, Failures: 0, Errors: 1, Skipped: 0, Time elapsed: 0.008 sec <<< FAILURE!
- in org.apache.phoenix.monitoring.PhoenixMetricsIT
org.apache.phoenix.monitoring.PhoenixMetricsIT  Time elapsed: 0.007 sec  <<< ERROR!
java.lang.RuntimeException: java.io.IOException: Shutting down
	at org.apache.phoenix.monitoring.PhoenixMetricsIT.doSetup(PhoenixMetricsIT.java:78)
Caused by: java.io.IOException: Shutting down
	at org.apache.phoenix.monitoring.PhoenixMetricsIT.doSetup(PhoenixMetricsIT.java:78)
Caused by: java.lang.RuntimeException: Master not initialized after 200000ms seconds
	at org.apache.phoenix.monitoring.PhoenixMetricsIT.doSetup(PhoenixMetricsIT.java:78)

Running org.apache.phoenix.rpc.PhoenixClientRpcIT
Tests run: 1, Failures: 0, Errors: 1, Skipped: 0, Time elapsed: 0.007 sec <<< FAILURE!
- in org.apache.phoenix.rpc.PhoenixClientRpcIT
org.apache.phoenix.rpc.PhoenixClientRpcIT  Time elapsed: 0.006 sec  <<< ERROR!
java.lang.RuntimeException: java.io.IOException: Shutting down
	at org.apache.phoenix.rpc.PhoenixClientRpcIT.doSetup(PhoenixClientRpcIT.java:47)
Caused by: java.io.IOException: Shutting down
	at org.apache.phoenix.rpc.PhoenixClientRpcIT.doSetup(PhoenixClientRpcIT.java:47)
Caused by: java.lang.RuntimeException: Master not initialized after 200000ms seconds
	at org.apache.phoenix.rpc.PhoenixClientRpcIT.doSetup(PhoenixClientRpcIT.java:47)

Running org.apache.phoenix.rpc.PhoenixServerRpcIT
Tests run: 1, Failures: 0, Errors: 1, Skipped: 0, Time elapsed: 0.007 sec <<< FAILURE!
- in org.apache.phoenix.rpc.PhoenixServerRpcIT
org.apache.phoenix.rpc.PhoenixServerRpcIT  Time elapsed: 0.006 sec  <<< ERROR!
java.lang.RuntimeException: java.io.IOException: Shutting down
	at org.apache.phoenix.rpc.PhoenixServerRpcIT.doSetup(PhoenixServerRpcIT.java:71)
Caused by: java.io.IOException: Shutting down
	at org.apache.phoenix.rpc.PhoenixServerRpcIT.doSetup(PhoenixServerRpcIT.java:71)
Caused by: java.lang.RuntimeException: Master not initialized after 200000ms seconds
	at org.apache.phoenix.rpc.PhoenixServerRpcIT.doSetup(PhoenixServerRpcIT.java:71)


Results :

Tests in error: 
  WALReplayWithIndexWritesAndCompressedWALIT.setUp:98->setupCluster:109->startCluster:142
? IO
  WALReplayWithIndexWritesAndUncompressedWALInHBase_094_9_IT>WALReplayWithIndexWritesAndCompressedWALIT.setUp:98->WALReplayWithIndexWritesAndCompressedWALIT.setupCluster:109->WALReplayWithIndexWritesAndCompressedWALIT.startCluster:142
? IO
  StatisticsCollectionRunTrackerIT.doSetup:56->BaseTest.setUpTestDriver:624->BaseTest.setUpTestDriver:628->BaseTest.checkClusterInitialized:559->BaseTest.setUpTestCluster:572->BaseTest.initMiniCluster:681
? Runtime
  AlterTableIT.doSetup:90->BaseTest.setUpTestDriver:624->BaseTest.setUpTestDriver:628->BaseTest.checkClusterInitialized:559->BaseTest.setUpTestCluster:572->BaseTest.initMiniCluster:681
? Runtime
  ConnectionUtilIT.setUp:52 ? IO Shutting down
  ContextClassloaderIT.setUpBeforeClass:61 ? IO Shutting down
  CountDistinctCompressionIT.doSetup:48->BaseTest.setUpTestDriver:624->BaseTest.setUpTestDriver:628->BaseTest.checkClusterInitialized:559->BaseTest.setUpTestCluster:572->BaseTest.initMiniCluster:681
? Runtime
  CsvBulkLoadToolIT.doSetup:60->BaseTest.setUpRealDriver:646 ? Runtime java.io.I...
  IndexToolIT.doSetup:94->BaseTest.setUpRealDriver:646 ? Runtime java.io.IOExcep...
  KeyOnlyIT.doSetup:57->BaseTest.setUpTestDriver:624->BaseTest.setUpTestDriver:628->BaseTest.checkClusterInitialized:559->BaseTest.setUpTestCluster:572->BaseTest.initMiniCluster:681
? Runtime
  MultiCfQueryExecIT.doSetup:56->BaseTest.setUpTestDriver:624->BaseTest.setUpTestDriver:628->BaseTest.checkClusterInitialized:559->BaseTest.setUpTestCluster:572->BaseTest.initMiniCluster:681
? Runtime
  MutableIndexToolIT.doSetup:50->BaseTest.setUpRealDriver:646 ? Runtime java.io....
  ParallelIteratorsIT.doSetup:76->BaseTest.setUpTestDriver:624->BaseTest.setUpTestDriver:628->BaseTest.checkClusterInitialized:559->BaseTest.setUpTestCluster:572->BaseTest.initMiniCluster:681
? Runtime
  QueryTimeoutIT.doSetup:62->BaseTest.setUpTestDriver:624->BaseTest.setUpTestDriver:628->BaseTest.checkClusterInitialized:559->BaseTest.setUpTestCluster:572->BaseTest.initMiniCluster:681
? Runtime
  QueryWithLimitIT.doSetup:56->BaseTest.setUpTestDriver:624->BaseTest.setUpTestDriver:628->BaseTest.checkClusterInitialized:559->BaseTest.setUpTestCluster:572->BaseTest.initMiniCluster:681
? Runtime
  QueryWithOffsetIT.doSetup:71->BaseTest.setUpTestDriver:624->BaseTest.setUpTestDriver:628->BaseTest.checkClusterInitialized:559->BaseTest.setUpTestCluster:572->BaseTest.initMiniCluster:681
? Runtime
  SaltedViewIT>BaseViewIT.doSetup:74->BaseTest.setUpTestDriver:624->BaseTest.setUpTestDriver:628->BaseTest.checkClusterInitialized:559->BaseTest.setUpTestCluster:572->BaseTest.initMiniCluster:681
? Runtime
  SpillableGroupByIT.doSetup:72->BaseTest.setUpTestDriver:624->BaseTest.setUpTestDriver:628->BaseTest.checkClusterInitialized:559->BaseTest.setUpTestCluster:572->BaseTest.initMiniCluster:681
? Runtime
  StatsCollectionDisabledIT.doSetup:54->BaseTest.setUpTestDriver:624->BaseTest.setUpTestDriver:628->BaseTest.checkClusterInitialized:559->BaseTest.setUpTestCluster:572->BaseTest.initMiniCluster:681
? Runtime
  StatsCollectorIT.doSetup:77->BaseTest.setUpTestDriver:624->BaseTest.setUpTestDriver:628->BaseTest.checkClusterInitialized:559->BaseTest.setUpTestCluster:572->BaseTest.initMiniCluster:681
? Runtime
  StatsCollectorWithSplitsAndMultiCFIT.doSetup:61->BaseTest.setUpTestDriver:624->BaseTest.setUpTestDriver:628->BaseTest.checkClusterInitialized:559->BaseTest.setUpTestCluster:572->BaseTest.initMiniCluster:681
? Runtime
  TenantSpecificTablesDDLIT>BaseTenantSpecificTablesIT.doSetup:79->BaseTest.setUpTestDriver:624->BaseTest.setUpTestDriver:628->BaseTest.checkClusterInitialized:559->BaseTest.setUpTestCluster:572->BaseTest.initMiniCluster:681
? Runtime
  TenantSpecificTablesDMLIT>BaseTenantSpecificTablesIT.doSetup:79->BaseTest.setUpTestDriver:624->BaseTest.setUpTestDriver:628->BaseTest.checkClusterInitialized:559->BaseTest.setUpTestCluster:572->BaseTest.initMiniCluster:681
? Runtime
  TransactionalViewIT.doSetup:46->BaseTest.setUpTestDriver:624->BaseTest.setUpTestDriver:628->BaseTest.checkClusterInitialized:559->BaseTest.setUpTestCluster:572->BaseTest.initMiniCluster:681
? Runtime
  UnionAllIT.doSetup:49->BaseTest.setUpTestDriver:624->BaseTest.setUpTestDriver:628->BaseTest.checkClusterInitialized:559->BaseTest.setUpTestCluster:572->BaseTest.initMiniCluster:681
? Runtime
  UserDefinedFunctionsIT.doSetup:249 ? IO Shutting down
  ViewIT>BaseViewIT.doSetup:74->BaseTest.setUpTestDriver:624->BaseTest.setUpTestDriver:628->BaseTest.checkClusterInitialized:559->BaseTest.setUpTestCluster:572->BaseTest.initMiniCluster:681
? Runtime
  AsyncImmutableIndexIT.doSetup:52->BaseTest.setUpRealDriver:646 ? Runtime java....
  ImmutableIndexWithStatsIT.doSetup:52->BaseTest.setUpTestDriver:624->BaseTest.setUpTestDriver:628->BaseTest.checkClusterInitialized:559->BaseTest.setUpTestCluster:572->BaseTest.initMiniCluster:681
? Runtime
  MutableIndexFailureIT.doSetup:115->BaseTest.setUpTestDriver:628->BaseTest.checkClusterInitialized:559->BaseTest.setUpTestCluster:572->BaseTest.initMiniCluster:681
? Runtime
  MutableIndexReplicationIT.setUpBeforeClass:108->setupConfigsAndStartCluster:170 ? IO
  ReadOnlyIndexFailureIT.doSetup:119->BaseTest.setUpTestDriver:628->BaseTest.checkClusterInitialized:559->BaseTest.setUpTestCluster:572->BaseTest.initMiniCluster:681
? Runtime
  TxWriteFailureIT.doSetup:86->BaseTest.setUpTestDriver:628->BaseTest.checkClusterInitialized:559->BaseTest.setUpTestCluster:572->BaseTest.initMiniCluster:681
? Runtime
  PartialCommitIT.doSetup:92->BaseTest.setUpTestDriver:628->BaseTest.checkClusterInitialized:559->BaseTest.setUpTestCluster:572->BaseTest.initMiniCluster:681
? Runtime
  FailForUnsupportedHBaseVersionsIT.testDoesNotStartRegionServerForUnsupportedCompressionAndVersion:121
? IO
  EndToEndCoveredColumnsIndexBuilderIT.setupCluster:107 ? IO Shutting down
  EndToEndCoveredIndexingIT.setupCluster:131 ? IO Shutting down
  EndtoEndIndexingWithCompressionIT.setupCluster:42 ? IO Shutting down
  FailWithoutRetriesIT.setupCluster:84 ? IO Shutting down
  RoundRobinResultIteratorWithStatsIT.doSetup:58->BaseTest.setUpTestDriver:624->BaseTest.setUpTestDriver:628->BaseTest.checkClusterInitialized:559->BaseTest.setUpTestCluster:572->BaseTest.initMiniCluster:681
? Runtime
  ScannerLeaseRenewalIT.setUp:70 ? IO Shutting down
  PhoenixMetricsIT.doSetup:78->BaseTest.setUpTestDriver:624->BaseTest.setUpTestDriver:628->BaseTest.checkClusterInitialized:559->BaseTest.setUpTestCluster:572->BaseTest.initMiniCluster:681
? Runtime
  PhoenixClientRpcIT.doSetup:47->BaseTest.setUpTestDriver:628->BaseTest.checkClusterInitialized:559->BaseTest.setUpTestCluster:572->BaseTest.initMiniCluster:681
? Runtime
  PhoenixServerRpcIT.doSetup:71->BaseTest.setUpTestDriver:628->BaseTest.checkClusterInitialized:559->BaseTest.setUpTestCluster:572->BaseTest.initMiniCluster:681
? Runtime

Tests run: 45, Failures: 0, Errors: 44, Skipped: 0

[INFO] 
[INFO] --- maven-failsafe-plugin:2.19.1:verify (ClientManagedTimeTests) @ phoenix-core ---
[INFO] ------------------------------------------------------------------------
[INFO] Reactor Summary:
[INFO] 
[INFO] Apache Phoenix .................................... SUCCESS [  2.460 s]
[INFO] Phoenix Core ...................................... FAILURE [  02:23 h]
[INFO] Phoenix - Flume ................................... SKIPPED
[INFO] Phoenix - Pig ..................................... SKIPPED
[INFO] Phoenix Query Server Client ....................... SKIPPED
[INFO] Phoenix Query Server .............................. SKIPPED
[INFO] Phoenix - Pherf ................................... SKIPPED
[INFO] Phoenix - Spark ................................... SKIPPED
[INFO] Phoenix - Hive .................................... SKIPPED
[INFO] Phoenix Client .................................... SKIPPED
[INFO] Phoenix Server .................................... SKIPPED
[INFO] Phoenix Assembly .................................. SKIPPED
[INFO] Phoenix - Tracing Web Application ................. SKIPPED
[INFO] ------------------------------------------------------------------------
[INFO] BUILD FAILURE
[INFO] ------------------------------------------------------------------------
[INFO] Total time: 02:23 h
[INFO] Finished at: 2016-08-03T12:53:43+00:00
[INFO] Final Memory: 52M/1028M
[INFO] ------------------------------------------------------------------------
[ERROR] Failed to execute goal org.apache.maven.plugins:maven-failsafe-plugin:2.19.1:verify
(ClientManagedTimeTests) on project phoenix-core: There are test failures.
[ERROR] 
[ERROR] Please refer to /x1/jenkins/jenkins-slave/workspace/Phoenix-4.x-HBase-1.1/phoenix-core/target/failsafe-reports
for the individual test results.
[ERROR] -> [Help 1]
[ERROR] 
[ERROR] To see the full stack trace of the errors, re-run Maven with the -e switch.
[ERROR] Re-run Maven using the -X switch to enable full debug logging.
[ERROR] 
[ERROR] For more information about the errors and possible solutions, please read the following
articles:
[ERROR] [Help 1] http://cwiki.apache.org/confluence/display/MAVEN/MojoFailureException
[ERROR] 
[ERROR] After correcting the problems, you can resume the build with the command
[ERROR]   mvn <goals> -rf :phoenix-core
Build step 'Invoke top-level Maven targets' marked build as failure
Archiving artifacts
Recording test results

Mime
View raw message