phoenix-commits mailing list archives

Site index · List index
Message view « Date » · « Thread »
Top « Date » · « Thread »
From Apache Jenkins Server <jenk...@builds.apache.org>
Subject Build failed in Jenkins: Phoenix | Master #1350
Date Wed, 03 Aug 2016 00:28:56 GMT
See <https://builds.apache.org/job/Phoenix-master/1350/changes>

Changes:

[elserj] PHOENIX-3126 Tie a driver instance to a specific user (Prabhjyot Singh)

------------------------------------------
[...truncated 722 lines...]
Running org.apache.phoenix.tx.TxCheckpointIT
Tests run: 6, Failures: 0, Errors: 0, Skipped: 0, Time elapsed: 110.448 sec - in org.apache.phoenix.trace.PhoenixTracingEndToEndIT
Tests run: 20, Failures: 0, Errors: 0, Skipped: 0, Time elapsed: 264.284 sec - in org.apache.phoenix.tx.TxCheckpointIT
Tests run: 21, Failures: 0, Errors: 0, Skipped: 1, Time elapsed: 340.647 sec - in org.apache.phoenix.tx.TransactionIT
Tests run: 40, Failures: 0, Errors: 0, Skipped: 0, Time elapsed: 774.369 sec - in org.apache.phoenix.end2end.index.LocalIndexIT
Tests run: 40, Failures: 0, Errors: 0, Skipped: 0, Time elapsed: 967.484 sec - in org.apache.phoenix.end2end.index.MutableIndexIT

Results :

Tests run: 1070, Failures: 0, Errors: 0, Skipped: 5

[INFO] 
[INFO] --- maven-failsafe-plugin:2.19.1:integration-test (HBaseManagedTimeTableReuseTest)
@ phoenix-core ---

-------------------------------------------------------
 T E S T S
-------------------------------------------------------
Running org.apache.phoenix.end2end.ArithmeticQueryIT
Running org.apache.phoenix.end2end.AlterSessionIT
Tests run: 2, Failures: 0, Errors: 0, Skipped: 0, Time elapsed: 0.073 sec - in org.apache.phoenix.end2end.AlterSessionIT
Running org.apache.phoenix.end2end.ArraysWithNullsIT
Running org.apache.phoenix.end2end.ArrayToStringFunctionIT
Running org.apache.phoenix.end2end.AbsFunctionEnd2EndIT
Tests run: 1, Failures: 0, Errors: 0, Skipped: 0, Time elapsed: 4.723 sec - in org.apache.phoenix.end2end.AbsFunctionEnd2EndIT
Running org.apache.phoenix.end2end.AutoCommitIT
Running org.apache.phoenix.end2end.ArrayFillFunctionIT
Tests run: 1, Failures: 0, Errors: 0, Skipped: 0, Time elapsed: 4.597 sec - in org.apache.phoenix.end2end.AutoCommitIT
Running org.apache.phoenix.end2end.CbrtFunctionEnd2EndIT
Tests run: 2, Failures: 0, Errors: 0, Skipped: 0, Time elapsed: 0.392 sec - in org.apache.phoenix.end2end.CbrtFunctionEnd2EndIT
Running org.apache.phoenix.end2end.ConvertTimezoneFunctionIT
Tests run: 36, Failures: 0, Errors: 0, Skipped: 0, Time elapsed: 26.627 sec - in org.apache.phoenix.end2end.ArrayToStringFunctionIT
Running org.apache.phoenix.end2end.DecodeFunctionIT
Tests run: 26, Failures: 0, Errors: 0, Skipped: 0, Time elapsed: 19.404 sec - in org.apache.phoenix.end2end.ArrayFillFunctionIT
Tests run: 7, Failures: 0, Errors: 0, Skipped: 0, Time elapsed: 19.049 sec - in org.apache.phoenix.end2end.ConvertTimezoneFunctionIT
Running org.apache.phoenix.end2end.DynamicFamilyIT
Tests run: 6, Failures: 0, Errors: 0, Skipped: 0, Time elapsed: 18.212 sec - in org.apache.phoenix.end2end.DecodeFunctionIT
Tests run: 4, Failures: 0, Errors: 0, Skipped: 0, Time elapsed: 6.941 sec - in org.apache.phoenix.end2end.DynamicFamilyIT
Running org.apache.phoenix.end2end.FirstValueFunctionIT
Running org.apache.phoenix.end2end.DynamicUpsertIT
Tests run: 7, Failures: 0, Errors: 0, Skipped: 0, Time elapsed: 0.104 sec - in org.apache.phoenix.end2end.DynamicUpsertIT
Tests run: 16, Failures: 0, Errors: 0, Skipped: 0, Time elapsed: 51.222 sec - in org.apache.phoenix.end2end.ArraysWithNullsIT
Running org.apache.phoenix.end2end.GetSetByteBitFunctionEnd2EndIT
Tests run: 1, Failures: 0, Errors: 0, Skipped: 0, Time elapsed: 0.078 sec - in org.apache.phoenix.end2end.GetSetByteBitFunctionEnd2EndIT
Running org.apache.phoenix.end2end.MD5FunctionIT
Running org.apache.phoenix.end2end.LikeExpressionIT
Running org.apache.phoenix.end2end.DistinctPrefixFilterIT
Tests run: 3, Failures: 0, Errors: 0, Skipped: 0, Time elapsed: 6.985 sec - in org.apache.phoenix.end2end.MD5FunctionIT
Running org.apache.phoenix.end2end.MinMaxAggregateFunctionIT
Tests run: 3, Failures: 0, Errors: 0, Skipped: 0, Time elapsed: 8.857 sec - in org.apache.phoenix.end2end.LikeExpressionIT
Tests run: 1, Failures: 0, Errors: 0, Skipped: 0, Time elapsed: 4.554 sec - in org.apache.phoenix.end2end.MinMaxAggregateFunctionIT
Running org.apache.phoenix.end2end.NthValueFunctionIT
Running org.apache.phoenix.end2end.OctetLengthFunctionEnd2EndIT
Tests run: 1, Failures: 0, Errors: 0, Skipped: 0, Time elapsed: 4.502 sec - in org.apache.phoenix.end2end.OctetLengthFunctionEnd2EndIT
Tests run: 5, Failures: 0, Errors: 0, Skipped: 0, Time elapsed: 15.254 sec - in org.apache.phoenix.end2end.DistinctPrefixFilterIT
Running org.apache.phoenix.end2end.PowerFunctionEnd2EndIT
Tests run: 7, Failures: 0, Errors: 0, Skipped: 0, Time elapsed: 27.489 sec - in org.apache.phoenix.end2end.FirstValueFunctionIT
Running org.apache.phoenix.end2end.QueryMoreIT
Tests run: 1, Failures: 0, Errors: 0, Skipped: 0, Time elapsed: 0.465 sec - in org.apache.phoenix.end2end.PowerFunctionEnd2EndIT
Running org.apache.phoenix.end2end.RTrimFunctionIT
Running org.apache.phoenix.end2end.PrimitiveTypeIT
Tests run: 9, Failures: 0, Errors: 0, Skipped: 0, Time elapsed: 0.134 sec - in org.apache.phoenix.end2end.PrimitiveTypeIT
Running org.apache.phoenix.end2end.ReadOnlyIT
Tests run: 26, Failures: 0, Errors: 0, Skipped: 0, Time elapsed: 88.422 sec - in org.apache.phoenix.end2end.ArithmeticQueryIT
Tests run: 2, Failures: 0, Errors: 0, Skipped: 0, Time elapsed: 6.734 sec - in org.apache.phoenix.end2end.RTrimFunctionIT
Running org.apache.phoenix.end2end.ReverseFunctionIT
Running org.apache.phoenix.end2end.RegexpSplitFunctionIT
Tests run: 12, Failures: 0, Errors: 0, Skipped: 0, Time elapsed: 1.583 sec - in org.apache.phoenix.end2end.RegexpSplitFunctionIT
Running org.apache.phoenix.end2end.RoundFloorCeilFunctionsEnd2EndIT
Tests run: 1, Failures: 0, Errors: 0, Skipped: 0, Time elapsed: 11.482 sec - in org.apache.phoenix.end2end.ReadOnlyIT
Running org.apache.phoenix.end2end.SerialIteratorsIT
Tests run: 1, Failures: 0, Errors: 0, Skipped: 0, Time elapsed: 4.444 sec - in org.apache.phoenix.end2end.SerialIteratorsIT
Running org.apache.phoenix.end2end.ServerExceptionIT
Tests run: 1, Failures: 0, Errors: 0, Skipped: 0, Time elapsed: 2.415 sec - in org.apache.phoenix.end2end.ServerExceptionIT
Tests run: 33, Failures: 0, Errors: 0, Skipped: 0, Time elapsed: 10.47 sec - in org.apache.phoenix.end2end.RoundFloorCeilFunctionsEnd2EndIT
Tests run: 5, Failures: 0, Errors: 0, Skipped: 0, Time elapsed: 15.77 sec - in org.apache.phoenix.end2end.ReverseFunctionIT
Running org.apache.phoenix.end2end.SortOrderIT
Running org.apache.phoenix.end2end.StatementHintsIT
Running org.apache.phoenix.end2end.SignFunctionEnd2EndIT
Tests run: 2, Failures: 0, Errors: 0, Skipped: 0, Time elapsed: 4.427 sec - in org.apache.phoenix.end2end.StatementHintsIT
Tests run: 2, Failures: 0, Errors: 0, Skipped: 0, Time elapsed: 0.272 sec - in org.apache.phoenix.end2end.SignFunctionEnd2EndIT
Tests run: 11, Failures: 0, Errors: 0, Skipped: 0, Time elapsed: 41.209 sec - in org.apache.phoenix.end2end.NthValueFunctionIT
Running org.apache.phoenix.end2end.TimezoneOffsetFunctionIT
Running org.apache.phoenix.end2end.StringToArrayFunctionIT
Running org.apache.phoenix.end2end.StoreNullsIT
Tests run: 3, Failures: 0, Errors: 0, Skipped: 0, Time elapsed: 16.125 sec - in org.apache.phoenix.end2end.StoreNullsIT
Running org.apache.phoenix.end2end.ToCharFunctionIT
Tests run: 6, Failures: 0, Errors: 0, Skipped: 0, Time elapsed: 51.784 sec - in org.apache.phoenix.end2end.QueryMoreIT
Running org.apache.phoenix.end2end.UpsertSelectAutoCommitIT
Tests run: 22, Failures: 0, Errors: 0, Skipped: 0, Time elapsed: 20.587 sec - in org.apache.phoenix.end2end.StringToArrayFunctionIT
Running org.apache.phoenix.end2end.index.AsyncImmutableIndexIT
Tests run: 7, Failures: 0, Errors: 0, Skipped: 0, Time elapsed: 30.615 sec - in org.apache.phoenix.end2end.TimezoneOffsetFunctionIT
Running org.apache.phoenix.end2end.index.AsyncIndexAutoBuildIT
Tests run: 1, Failures: 0, Errors: 0, Skipped: 0, Time elapsed: 12.754 sec - in org.apache.phoenix.end2end.index.AsyncImmutableIndexIT
Running org.apache.phoenix.end2end.index.IndexIT
Tests run: 3, Failures: 0, Errors: 0, Skipped: 0, Time elapsed: 17.905 sec - in org.apache.phoenix.end2end.UpsertSelectAutoCommitIT
Running org.apache.phoenix.end2end.salted.SaltedTableUpsertSelectIT
Tests run: 1, Failures: 0, Errors: 0, Skipped: 0, Time elapsed: 12.202 sec - in org.apache.phoenix.end2end.index.AsyncIndexAutoBuildIT
Running org.apache.phoenix.end2end.salted.SaltedTableVarLengthRowKeyIT
Tests run: 1, Failures: 0, Errors: 0, Skipped: 0, Time elapsed: 4.38 sec - in org.apache.phoenix.end2end.salted.SaltedTableVarLengthRowKeyIT
Running org.apache.phoenix.iterate.PhoenixQueryTimeoutIT
Tests run: 2, Failures: 0, Errors: 0, Skipped: 0, Time elapsed: 0.158 sec - in org.apache.phoenix.iterate.PhoenixQueryTimeoutIT
Tests run: 12, Failures: 0, Errors: 0, Skipped: 0, Time elapsed: 55.901 sec - in org.apache.phoenix.end2end.ToCharFunctionIT
Tests run: 6, Failures: 0, Errors: 0, Skipped: 0, Time elapsed: 49.906 sec - in org.apache.phoenix.end2end.salted.SaltedTableUpsertSelectIT
Tests run: 45, Failures: 0, Errors: 0, Skipped: 0, Time elapsed: 186.828 sec - in org.apache.phoenix.end2end.SortOrderIT
Tests run: 136, Failures: 0, Errors: 0, Skipped: 0, Time elapsed: 1,125.203 sec - in org.apache.phoenix.end2end.index.IndexIT

Results :

Tests run: 480, Failures: 0, Errors: 0, Skipped: 0

[INFO] 
[INFO] --- maven-failsafe-plugin:2.19.1:integration-test (NeedTheirOwnClusterTests) @ phoenix-core
---

-------------------------------------------------------
 T E S T S
-------------------------------------------------------
Running org.apache.hadoop.hbase.regionserver.wal.WALReplayWithIndexWritesAndUncompressedWALInHBase_094_9_IT
Running org.apache.hadoop.hbase.regionserver.wal.WALReplayWithIndexWritesAndCompressedWALIT
Running org.apache.phoenix.coprocessor.StatisticsCollectionRunTrackerIT
Running org.apache.phoenix.end2end.ConnectionUtilIT
Tests run: 1, Failures: 0, Errors: 0, Skipped: 0, Time elapsed: 40.725 sec - in org.apache.hadoop.hbase.regionserver.wal.WALReplayWithIndexWritesAndUncompressedWALInHBase_094_9_IT
Tests run: 1, Failures: 0, Errors: 0, Skipped: 0, Time elapsed: 43.664 sec - in org.apache.hadoop.hbase.regionserver.wal.WALReplayWithIndexWritesAndCompressedWALIT
Running org.apache.phoenix.end2end.AlterTableIT
Tests run: 4, Failures: 0, Errors: 0, Skipped: 0, Time elapsed: 35.303 sec - in org.apache.phoenix.coprocessor.StatisticsCollectionRunTrackerIT
Tests run: 1, Failures: 0, Errors: 0, Skipped: 0, Time elapsed: 36.687 sec - in org.apache.phoenix.end2end.ConnectionUtilIT
Running org.apache.phoenix.end2end.CountDistinctCompressionIT
Running org.apache.phoenix.end2end.ContextClassloaderIT
Tests run: 3, Failures: 0, Errors: 0, Skipped: 0, Time elapsed: 11.392 sec - in org.apache.phoenix.end2end.ContextClassloaderIT
Tests run: 1, Failures: 0, Errors: 0, Skipped: 0, Time elapsed: 14.874 sec - in org.apache.phoenix.end2end.CountDistinctCompressionIT
Running org.apache.phoenix.end2end.IndexToolIT
Running org.apache.phoenix.end2end.CsvBulkLoadToolIT
Running org.apache.phoenix.end2end.KeyOnlyIT
Running org.apache.phoenix.end2end.MultiCfQueryExecIT
Tests run: 3, Failures: 0, Errors: 0, Skipped: 0, Time elapsed: 20.809 sec - in org.apache.phoenix.end2end.KeyOnlyIT
Tests run: 9, Failures: 0, Errors: 0, Skipped: 0, Time elapsed: 36.082 sec - in org.apache.phoenix.end2end.MultiCfQueryExecIT
Running org.apache.phoenix.end2end.MutableIndexToolIT
Running org.apache.phoenix.end2end.ParallelIteratorsIT
Tests run: 3, Failures: 0, Errors: 0, Skipped: 0, Time elapsed: 46.886 sec - in org.apache.phoenix.end2end.ParallelIteratorsIT
Tests run: 1, Failures: 0, Errors: 0, Skipped: 0, Time elapsed: 133.49 sec - in org.apache.phoenix.end2end.MutableIndexToolIT
Running org.apache.phoenix.end2end.QueryTimeoutIT
Tests run: 2, Failures: 0, Errors: 0, Skipped: 0, Time elapsed: 21.967 sec - in org.apache.phoenix.end2end.QueryTimeoutIT
Running org.apache.phoenix.end2end.QueryWithLimitIT
Tests run: 2, Failures: 0, Errors: 0, Skipped: 0, Time elapsed: 25.26 sec - in org.apache.phoenix.end2end.QueryWithLimitIT
Running org.apache.phoenix.end2end.QueryWithOffsetIT
Tests run: 8, Failures: 0, Errors: 0, Skipped: 0, Time elapsed: 24.369 sec - in org.apache.phoenix.end2end.QueryWithOffsetIT
Running org.apache.phoenix.end2end.SaltedViewIT
Running org.apache.phoenix.end2end.SpillableGroupByIT
Tests run: 1, Failures: 0, Errors: 0, Skipped: 0, Time elapsed: 16.65 sec - in org.apache.phoenix.end2end.SpillableGroupByIT
Tests run: 4, Failures: 0, Errors: 0, Skipped: 0, Time elapsed: 50.618 sec - in org.apache.phoenix.end2end.SaltedViewIT
Running org.apache.phoenix.end2end.StatsCollectionDisabledIT
Running org.apache.phoenix.end2end.StatsCollectorIT
Tests run: 1, Failures: 0, Errors: 0, Skipped: 0, Time elapsed: 11.31 sec - in org.apache.phoenix.end2end.StatsCollectionDisabledIT
Tests run: 56, Failures: 0, Errors: 0, Skipped: 0, Time elapsed: 525.37 sec - in org.apache.phoenix.end2end.AlterTableIT
Running org.apache.phoenix.end2end.StatsCollectorWithSplitsAndMultiCFIT
Tests run: 2, Failures: 0, Errors: 0, Skipped: 0, Time elapsed: 12.169 sec - in org.apache.phoenix.end2end.StatsCollectorWithSplitsAndMultiCFIT
Running org.apache.phoenix.end2end.TenantSpecificTablesDDLIT
Tests run: 10, Failures: 0, Errors: 0, Skipped: 0, Time elapsed: 517.475 sec - in org.apache.phoenix.end2end.CsvBulkLoadToolIT
Running org.apache.phoenix.end2end.TenantSpecificTablesDMLIT
Tests run: 17, Failures: 0, Errors: 0, Skipped: 0, Time elapsed: 58.114 sec - in org.apache.phoenix.end2end.TenantSpecificTablesDDLIT
Tests run: 16, Failures: 0, Errors: 0, Skipped: 0, Time elapsed: 39.508 sec - in org.apache.phoenix.end2end.TenantSpecificTablesDMLIT
Tests run: 16, Failures: 0, Errors: 0, Skipped: 0, Time elapsed: 150.963 sec - in org.apache.phoenix.end2end.StatsCollectorIT
Running org.apache.phoenix.end2end.TransactionalViewIT
Running org.apache.phoenix.end2end.UnionAllIT
Running org.apache.phoenix.end2end.ViewIT
Running org.apache.phoenix.end2end.UserDefinedFunctionsIT
Tests run: 2, Failures: 0, Errors: 0, Skipped: 0, Time elapsed: 74.06 sec - in org.apache.phoenix.end2end.TransactionalViewIT
Tests run: 17, Failures: 0, Errors: 0, Skipped: 0, Time elapsed: 53.555 sec - in org.apache.phoenix.end2end.UnionAllIT
Running org.apache.phoenix.end2end.index.AsyncIndexRegularBuildIT
Running org.apache.phoenix.end2end.index.ImmutableIndexWithStatsIT
Tests run: 14, Failures: 0, Errors: 0, Skipped: 0, Time elapsed: 95.704 sec - in org.apache.phoenix.end2end.UserDefinedFunctionsIT
Tests run: 1, Failures: 0, Errors: 0, Skipped: 0, Time elapsed: 13.798 sec - in org.apache.phoenix.end2end.index.ImmutableIndexWithStatsIT
Tests run: 1, Failures: 0, Errors: 0, Skipped: 0, Time elapsed: 43.082 sec - in org.apache.phoenix.end2end.index.AsyncIndexRegularBuildIT
Running org.apache.phoenix.end2end.index.MutableIndexFailureIT
Running org.apache.phoenix.end2end.index.MutableIndexReplicationIT
Running org.apache.phoenix.end2end.index.ReadOnlyIndexFailureIT
Tests run: 2, Failures: 0, Errors: 0, Skipped: 0, Time elapsed: 44.42 sec - in org.apache.phoenix.end2end.index.ReadOnlyIndexFailureIT
Tests run: 1, Failures: 0, Errors: 0, Skipped: 0, Time elapsed: 54.393 sec - in org.apache.phoenix.end2end.index.MutableIndexReplicationIT
Tests run: 48, Failures: 0, Errors: 0, Skipped: 0, Time elapsed: 255.908 sec - in org.apache.phoenix.end2end.ViewIT
Running org.apache.phoenix.hbase.index.FailForUnsupportedHBaseVersionsIT
Running org.apache.phoenix.end2end.index.txn.TxWriteFailureIT
Tests run: 2, Failures: 0, Errors: 0, Skipped: 0, Time elapsed: 23.989 sec - in org.apache.phoenix.hbase.index.FailForUnsupportedHBaseVersionsIT
Tests run: 8, Failures: 0, Errors: 0, Skipped: 0, Time elapsed: 148.954 sec - in org.apache.phoenix.end2end.index.MutableIndexFailureIT
Running org.apache.phoenix.hbase.index.covered.EndToEndCoveredColumnsIndexBuilderIT
Running org.apache.phoenix.execute.PartialCommitIT
Tests run: 12, Failures: 0, Errors: 0, Skipped: 0, Time elapsed: 4.437 sec - in org.apache.phoenix.execute.PartialCommitIT
Tests run: 8, Failures: 0, Errors: 0, Skipped: 0, Time elapsed: 50.919 sec - in org.apache.phoenix.end2end.index.txn.TxWriteFailureIT
Tests run: 2, Failures: 0, Errors: 0, Skipped: 0, Time elapsed: 27.024 sec - in org.apache.phoenix.hbase.index.covered.EndToEndCoveredColumnsIndexBuilderIT
Running org.apache.phoenix.hbase.index.covered.example.FailWithoutRetriesIT
Running org.apache.phoenix.hbase.index.covered.example.EndToEndCoveredIndexingIT
Tests run: 1, Failures: 0, Errors: 0, Skipped: 0, Time elapsed: 7.819 sec - in org.apache.phoenix.hbase.index.covered.example.FailWithoutRetriesIT
Running org.apache.phoenix.hbase.index.covered.example.EndtoEndIndexingWithCompressionIT
Running org.apache.phoenix.iterate.RoundRobinResultIteratorWithStatsIT
Running org.apache.phoenix.iterate.ScannerLeaseRenewalIT
Tests run: 1, Failures: 0, Errors: 0, Skipped: 0, Time elapsed: 14.748 sec - in org.apache.phoenix.iterate.RoundRobinResultIteratorWithStatsIT
Tests run: 16, Failures: 0, Errors: 0, Skipped: 0, Time elapsed: 991.43 sec - in org.apache.phoenix.end2end.IndexToolIT
Running org.apache.phoenix.monitoring.PhoenixMetricsIT
Running org.apache.phoenix.rpc.PhoenixClientRpcIT
Tests run: 2, Failures: 0, Errors: 0, Skipped: 0, Time elapsed: 18.776 sec - in org.apache.phoenix.rpc.PhoenixClientRpcIT
Running org.apache.phoenix.rpc.PhoenixServerRpcIT
Tests run: 1, Failures: 0, Errors: 0, Skipped: 0, Time elapsed: 17.826 sec - in org.apache.phoenix.rpc.PhoenixServerRpcIT
Tests run: 18, Failures: 0, Errors: 0, Skipped: 0, Time elapsed: 110.081 sec - in org.apache.phoenix.monitoring.PhoenixMetricsIT
Tests run: 2, Failures: 0, Errors: 0, Skipped: 0, Time elapsed: 168.474 sec - in org.apache.phoenix.iterate.ScannerLeaseRenewalIT
Tests run: 11, Failures: 0, Errors: 0, Skipped: 0, Time elapsed: 217.318 sec - in org.apache.phoenix.hbase.index.covered.example.EndtoEndIndexingWithCompressionIT
Tests run: 11, Failures: 0, Errors: 0, Skipped: 0, Time elapsed: 224.874 sec - in org.apache.phoenix.hbase.index.covered.example.EndToEndCoveredIndexingIT

Results :

Tests run: 343, Failures: 0, Errors: 0, Skipped: 0

[INFO] 
[INFO] --- maven-failsafe-plugin:2.19.1:verify (ClientManagedTimeTests) @ phoenix-core ---
[INFO] ------------------------------------------------------------------------
[INFO] Reactor Summary:
[INFO] 
[INFO] Apache Phoenix .................................... SUCCESS [  3.205 s]
[INFO] Phoenix Core ...................................... FAILURE [  01:28 h]
[INFO] Phoenix - Flume ................................... SKIPPED
[INFO] Phoenix - Pig ..................................... SKIPPED
[INFO] Phoenix Query Server Client ....................... SKIPPED
[INFO] Phoenix Query Server .............................. SKIPPED
[INFO] Phoenix - Pherf ................................... SKIPPED
[INFO] Phoenix - Spark ................................... SKIPPED
[INFO] Phoenix - Hive .................................... SKIPPED
[INFO] Phoenix Client .................................... SKIPPED
[INFO] Phoenix Server .................................... SKIPPED
[INFO] Phoenix Assembly .................................. SKIPPED
[INFO] Phoenix - Tracing Web Application ................. SKIPPED
[INFO] ------------------------------------------------------------------------
[INFO] BUILD FAILURE
[INFO] ------------------------------------------------------------------------
[INFO] Total time: 01:28 h
[INFO] Finished at: 2016-08-03T00:21:56+00:00
[INFO] Final Memory: 52M/1172M
[INFO] ------------------------------------------------------------------------
[ERROR] Failed to execute goal org.apache.maven.plugins:maven-failsafe-plugin:2.19.1:verify
(ClientManagedTimeTests) on project phoenix-core: There was a timeout or other error in the
fork -> [Help 1]
[ERROR] 
[ERROR] To see the full stack trace of the errors, re-run Maven with the -e switch.
[ERROR] Re-run Maven using the -X switch to enable full debug logging.
[ERROR] 
[ERROR] For more information about the errors and possible solutions, please read the following
articles:
[ERROR] [Help 1] http://cwiki.apache.org/confluence/display/MAVEN/MojoExecutionException
[ERROR] 
[ERROR] After correcting the problems, you can resume the build with the command
[ERROR]   mvn <goals> -rf :phoenix-core
Build step 'Invoke top-level Maven targets' marked build as failure
Archiving artifacts
Compressed 2.15 GB of artifacts by 58.5% relative to #1346
Updating PHOENIX-3126
Recording test results

Mime
View raw message