phoenix-commits mailing list archives

Site index · List index
Message view « Date » · « Thread »
Top « Date » · « Thread »
From Apache Jenkins Server <jenk...@builds.apache.org>
Subject Build failed in Jenkins: Phoenix-4.x-HBase-1.1 #64
Date Fri, 17 Jun 2016 20:42:26 GMT
See <https://builds.apache.org/job/Phoenix-4.x-HBase-1.1/64/changes>

Changes:

[samarth] PHOENIX-2276 Addednum2 to fix test failures

------------------------------------------
[...truncated 8623 lines...]
Tests run: 6, Failures: 0, Errors: 0, Skipped: 0, Time elapsed: 97.04 sec - in org.apache.phoenix.trace.PhoenixTracingEndToEndIT
Running org.apache.phoenix.tx.TxCheckpointIT
Tests run: 40, Failures: 0, Errors: 0, Skipped: 0, Time elapsed: 499.245 sec - in org.apache.phoenix.end2end.index.LocalIndexIT
Tests run: 128, Failures: 0, Errors: 0, Skipped: 0, Time elapsed: 598.691 sec - in org.apache.phoenix.end2end.index.IndexIT
Tests run: 20, Failures: 0, Errors: 0, Skipped: 0, Time elapsed: 132.333 sec - in org.apache.phoenix.tx.TxCheckpointIT
Tests run: 21, Failures: 0, Errors: 0, Skipped: 1, Time elapsed: 209.528 sec - in org.apache.phoenix.tx.TransactionIT
Tests run: 36, Failures: 0, Errors: 0, Skipped: 0, Time elapsed: 678.834 sec - in org.apache.phoenix.end2end.index.MutableIndexIT

Results :

Failed tests: 
  TenantSpecificViewIndexIT.testMultiCFViewLocalIndex:84->testMultiCFViewIndex:116->createViewAndIndexesWithTenantId:201
expected:<...CAN OVER A.MT_BASE [['b',1],'f']
    SERVER FIL...> but was:<...CAN OVER A.MT_BASE [[1,'b'],'f']
    SERVER FIL...>

Tests run: 1189, Failures: 1, Errors: 0, Skipped: 5

[INFO] 
[INFO] --- maven-failsafe-plugin:2.19.1:integration-test (HBaseManagedTimeTableReuseTest)
@ phoenix-core ---

-------------------------------------------------------
 T E S T S
-------------------------------------------------------
Running org.apache.phoenix.end2end.ArrayToStringFunctionIT
Running org.apache.phoenix.end2end.ArithmeticQueryIT
Running org.apache.phoenix.end2end.AbsFunctionEnd2EndIT
Running org.apache.phoenix.end2end.AlterSessionIT
Tests run: 2, Failures: 0, Errors: 0, Skipped: 0, Time elapsed: 0.16 sec - in org.apache.phoenix.end2end.AlterSessionIT
Running org.apache.phoenix.end2end.ArraysWithNullsIT
Running org.apache.phoenix.end2end.ArrayFillFunctionIT
Tests run: 1, Failures: 0, Errors: 0, Skipped: 0, Time elapsed: 2.895 sec - in org.apache.phoenix.end2end.AbsFunctionEnd2EndIT
Running org.apache.phoenix.end2end.AutoCommitIT
Tests run: 1, Failures: 0, Errors: 0, Skipped: 0, Time elapsed: 1.452 sec - in org.apache.phoenix.end2end.AutoCommitIT
Running org.apache.phoenix.end2end.CbrtFunctionEnd2EndIT
Tests run: 2, Failures: 0, Errors: 0, Skipped: 0, Time elapsed: 0.567 sec - in org.apache.phoenix.end2end.CbrtFunctionEnd2EndIT
Running org.apache.phoenix.end2end.ConvertTimezoneFunctionIT
Tests run: 26, Failures: 0, Errors: 0, Skipped: 0, Time elapsed: 13.98 sec - in org.apache.phoenix.end2end.ArrayFillFunctionIT
Running org.apache.phoenix.end2end.DecodeFunctionIT
Tests run: 36, Failures: 0, Errors: 0, Skipped: 0, Time elapsed: 20.405 sec - in org.apache.phoenix.end2end.ArrayToStringFunctionIT
Tests run: 7, Failures: 0, Errors: 0, Skipped: 0, Time elapsed: 14.694 sec - in org.apache.phoenix.end2end.ConvertTimezoneFunctionIT
Running org.apache.phoenix.end2end.DynamicFamilyIT
Running org.apache.phoenix.end2end.DistinctPrefixFilterIT
Tests run: 6, Failures: 0, Errors: 0, Skipped: 0, Time elapsed: 12.854 sec - in org.apache.phoenix.end2end.DecodeFunctionIT
Tests run: 4, Failures: 0, Errors: 0, Skipped: 0, Time elapsed: 4.692 sec - in org.apache.phoenix.end2end.DynamicFamilyIT
Running org.apache.phoenix.end2end.FirstValueFunctionIT
Running org.apache.phoenix.end2end.DynamicUpsertIT
Tests run: 7, Failures: 0, Errors: 0, Skipped: 0, Time elapsed: 0.202 sec - in org.apache.phoenix.end2end.DynamicUpsertIT
Tests run: 16, Failures: 0, Errors: 0, Skipped: 0, Time elapsed: 31.861 sec - in org.apache.phoenix.end2end.ArraysWithNullsIT
Running org.apache.phoenix.end2end.GetSetByteBitFunctionEnd2EndIT
Tests run: 1, Failures: 0, Errors: 0, Skipped: 0, Time elapsed: 0.201 sec - in org.apache.phoenix.end2end.GetSetByteBitFunctionEnd2EndIT
Running org.apache.phoenix.end2end.MD5FunctionIT
Running org.apache.phoenix.end2end.LikeExpressionIT
Tests run: 3, Failures: 0, Errors: 0, Skipped: 0, Time elapsed: 2.73 sec - in org.apache.phoenix.end2end.LikeExpressionIT
Running org.apache.phoenix.end2end.MinMaxAggregateFunctionIT
Tests run: 3, Failures: 0, Errors: 0, Skipped: 0, Time elapsed: 6.957 sec - in org.apache.phoenix.end2end.MD5FunctionIT
Tests run: 1, Failures: 0, Errors: 0, Skipped: 0, Time elapsed: 2.478 sec - in org.apache.phoenix.end2end.MinMaxAggregateFunctionIT
Running org.apache.phoenix.end2end.NthValueFunctionIT
Running org.apache.phoenix.end2end.OctetLengthFunctionEnd2EndIT
Tests run: 7, Failures: 0, Errors: 0, Skipped: 0, Time elapsed: 13.658 sec - in org.apache.phoenix.end2end.FirstValueFunctionIT
Tests run: 1, Failures: 0, Errors: 0, Skipped: 0, Time elapsed: 2.38 sec - in org.apache.phoenix.end2end.OctetLengthFunctionEnd2EndIT
Running org.apache.phoenix.end2end.PrimitiveTypeIT
Tests run: 9, Failures: 0, Errors: 0, Skipped: 0, Time elapsed: 0.16 sec - in org.apache.phoenix.end2end.PrimitiveTypeIT
Running org.apache.phoenix.end2end.QueryMoreIT
Running org.apache.phoenix.end2end.PowerFunctionEnd2EndIT
Tests run: 1, Failures: 0, Errors: 0, Skipped: 0, Time elapsed: 0.654 sec - in org.apache.phoenix.end2end.PowerFunctionEnd2EndIT
Running org.apache.phoenix.end2end.RTrimFunctionIT
Tests run: 26, Failures: 0, Errors: 0, Skipped: 0, Time elapsed: 53.566 sec - in org.apache.phoenix.end2end.ArithmeticQueryIT
Running org.apache.phoenix.end2end.ReadOnlyIT
Tests run: 2, Failures: 0, Errors: 0, Skipped: 0, Time elapsed: 3.726 sec - in org.apache.phoenix.end2end.RTrimFunctionIT
Running org.apache.phoenix.end2end.RegexpSplitFunctionIT
Tests run: 11, Failures: 0, Errors: 0, Skipped: 0, Time elapsed: 0.354 sec - in org.apache.phoenix.end2end.RegexpSplitFunctionIT
Running org.apache.phoenix.end2end.ReverseFunctionIT
Tests run: 1, Failures: 0, Errors: 0, Skipped: 0, Time elapsed: 8.864 sec - in org.apache.phoenix.end2end.ReadOnlyIT
Running org.apache.phoenix.end2end.RoundFloorCeilFunctionsEnd2EndIT
Tests run: 5, Failures: 0, Errors: 0, Skipped: 0, Time elapsed: 35.867 sec - in org.apache.phoenix.end2end.DistinctPrefixFilterIT
Running org.apache.phoenix.end2end.SerialIteratorsIT
Tests run: 11, Failures: 0, Errors: 0, Skipped: 0, Time elapsed: 22.924 sec - in org.apache.phoenix.end2end.NthValueFunctionIT
Running org.apache.phoenix.end2end.ServerExceptionIT
Tests run: 1, Failures: 0, Errors: 0, Skipped: 0, Time elapsed: 2.441 sec - in org.apache.phoenix.end2end.SerialIteratorsIT
Tests run: 1, Failures: 0, Errors: 0, Skipped: 0, Time elapsed: 2.372 sec - in org.apache.phoenix.end2end.ServerExceptionIT
Running org.apache.phoenix.end2end.SortOrderIT
Tests run: 5, Failures: 0, Errors: 0, Skipped: 0, Time elapsed: 11.8 sec - in org.apache.phoenix.end2end.ReverseFunctionIT
Running org.apache.phoenix.end2end.StatementHintsIT
Tests run: 33, Failures: 0, Errors: 0, Skipped: 0, Time elapsed: 8.025 sec - in org.apache.phoenix.end2end.RoundFloorCeilFunctionsEnd2EndIT
Running org.apache.phoenix.end2end.SignFunctionEnd2EndIT
Tests run: 2, Failures: 0, Errors: 0, Skipped: 0, Time elapsed: 2.495 sec - in org.apache.phoenix.end2end.StatementHintsIT
Tests run: 2, Failures: 0, Errors: 0, Skipped: 0, Time elapsed: 0.491 sec - in org.apache.phoenix.end2end.SignFunctionEnd2EndIT
Running org.apache.phoenix.end2end.TimezoneOffsetFunctionIT
Running org.apache.phoenix.end2end.StoreNullsIT
Running org.apache.phoenix.end2end.StringToArrayFunctionIT
Tests run: 6, Failures: 0, Errors: 0, Skipped: 0, Time elapsed: 30.135 sec - in org.apache.phoenix.end2end.QueryMoreIT
Running org.apache.phoenix.end2end.ToCharFunctionIT
Tests run: 3, Failures: 0, Errors: 0, Skipped: 0, Time elapsed: 12.284 sec - in org.apache.phoenix.end2end.StoreNullsIT
Tests run: 7, Failures: 0, Errors: 0, Skipped: 0, Time elapsed: 14.403 sec - in org.apache.phoenix.end2end.TimezoneOffsetFunctionIT
Running org.apache.phoenix.end2end.UpsertSelectAutoCommitIT
Running org.apache.phoenix.end2end.salted.SaltedTableUpsertSelectIT
Tests run: 22, Failures: 0, Errors: 0, Skipped: 0, Time elapsed: 13.228 sec - in org.apache.phoenix.end2end.StringToArrayFunctionIT
Running org.apache.phoenix.end2end.salted.SaltedTableVarLengthRowKeyIT
Tests run: 1, Failures: 0, Errors: 0, Skipped: 0, Time elapsed: 2.488 sec - in org.apache.phoenix.end2end.salted.SaltedTableVarLengthRowKeyIT
Running org.apache.phoenix.iterate.PhoenixQueryTimeoutIT
Tests run: 2, Failures: 0, Errors: 0, Skipped: 0, Time elapsed: 0.118 sec - in org.apache.phoenix.iterate.PhoenixQueryTimeoutIT
Tests run: 3, Failures: 0, Errors: 0, Skipped: 0, Time elapsed: 10.977 sec - in org.apache.phoenix.end2end.UpsertSelectAutoCommitIT
Tests run: 11, Failures: 0, Errors: 0, Skipped: 0, Time elapsed: 24.05 sec - in org.apache.phoenix.end2end.ToCharFunctionIT
Tests run: 6, Failures: 0, Errors: 0, Skipped: 0, Time elapsed: 25.189 sec - in org.apache.phoenix.end2end.salted.SaltedTableUpsertSelectIT
Tests run: 45, Failures: 0, Errors: 0, Skipped: 0, Time elapsed: 111.533 sec - in org.apache.phoenix.end2end.SortOrderIT

Results :

Tests run: 340, Failures: 0, Errors: 0, Skipped: 0

[INFO] 
[INFO] --- maven-failsafe-plugin:2.19.1:integration-test (NeedTheirOwnClusterTests) @ phoenix-core
---

-------------------------------------------------------
 T E S T S
-------------------------------------------------------
Running org.apache.hadoop.hbase.regionserver.wal.WALReplayWithIndexWritesAndUncompressedWALInHBase_094_9_IT
Running org.apache.hadoop.hbase.regionserver.wal.WALReplayWithIndexWritesAndCompressedWALIT
Running org.apache.phoenix.coprocessor.StatisticsCollectionRunTrackerIT
Tests run: 1, Failures: 0, Errors: 0, Skipped: 0, Time elapsed: 33.878 sec - in org.apache.hadoop.hbase.regionserver.wal.WALReplayWithIndexWritesAndUncompressedWALInHBase_094_9_IT
Running org.apache.phoenix.end2end.AlterTableIT
Tests run: 1, Failures: 0, Errors: 0, Skipped: 0, Time elapsed: 36.536 sec - in org.apache.hadoop.hbase.regionserver.wal.WALReplayWithIndexWritesAndCompressedWALIT
Running org.apache.phoenix.end2end.ConnectionUtilIT
Tests run: 4, Failures: 0, Errors: 0, Skipped: 0, Time elapsed: 32.274 sec - in org.apache.phoenix.coprocessor.StatisticsCollectionRunTrackerIT
Running org.apache.phoenix.end2end.ContextClassloaderIT
Running org.apache.phoenix.end2end.CountDistinctCompressionIT
Tests run: 1, Failures: 0, Errors: 0, Skipped: 0, Time elapsed: 27.537 sec - in org.apache.phoenix.end2end.ConnectionUtilIT
Tests run: 3, Failures: 0, Errors: 0, Skipped: 0, Time elapsed: 9.134 sec - in org.apache.phoenix.end2end.ContextClassloaderIT
Tests run: 1, Failures: 0, Errors: 0, Skipped: 0, Time elapsed: 12.174 sec - in org.apache.phoenix.end2end.CountDistinctCompressionIT
Running org.apache.phoenix.end2end.CsvBulkLoadToolIT
Running org.apache.phoenix.end2end.KeyOnlyIT
Running org.apache.phoenix.end2end.IndexToolIT
Running org.apache.phoenix.end2end.MultiCfQueryExecIT
Tests run: 3, Failures: 0, Errors: 0, Skipped: 0, Time elapsed: 12.66 sec - in org.apache.phoenix.end2end.KeyOnlyIT
Tests run: 9, Failures: 0, Errors: 0, Skipped: 0, Time elapsed: 24.411 sec - in org.apache.phoenix.end2end.MultiCfQueryExecIT
Running org.apache.phoenix.end2end.MutableIndexToolIT
Running org.apache.phoenix.end2end.ParallelIteratorsIT
Tests run: 3, Failures: 0, Errors: 0, Skipped: 0, Time elapsed: 32.494 sec - in org.apache.phoenix.end2end.ParallelIteratorsIT
Running org.apache.phoenix.end2end.QueryTimeoutIT
Tests run: 1, Failures: 0, Errors: 0, Skipped: 0, Time elapsed: 110.776 sec - in org.apache.phoenix.end2end.MutableIndexToolIT
Tests run: 1, Failures: 0, Errors: 0, Skipped: 0, Time elapsed: 31.008 sec - in org.apache.phoenix.end2end.QueryTimeoutIT
Running org.apache.phoenix.end2end.QueryWithLimitIT
Tests run: 2, Failures: 0, Errors: 0, Skipped: 0, Time elapsed: 19.893 sec - in org.apache.phoenix.end2end.QueryWithLimitIT
Running org.apache.phoenix.end2end.QueryWithOffsetIT
Tests run: 8, Failures: 0, Errors: 0, Skipped: 0, Time elapsed: 21.386 sec - in org.apache.phoenix.end2end.QueryWithOffsetIT
Running org.apache.phoenix.end2end.SaltedViewIT
Running org.apache.phoenix.end2end.SpillableGroupByIT
Tests run: 1, Failures: 0, Errors: 0, Skipped: 0, Time elapsed: 12.321 sec - in org.apache.phoenix.end2end.SpillableGroupByIT
Tests run: 4, Failures: 0, Errors: 0, Skipped: 0, Time elapsed: 41.842 sec - in org.apache.phoenix.end2end.SaltedViewIT
Tests run: 56, Failures: 0, Errors: 0, Skipped: 0, Time elapsed: 391.33 sec - in org.apache.phoenix.end2end.AlterTableIT
Running org.apache.phoenix.end2end.StatsCollectionDisabledIT
Running org.apache.phoenix.end2end.StatsCollectorIT
Running org.apache.phoenix.end2end.StatsCollectorWithSplitsAndMultiCFIT
Tests run: 1, Failures: 0, Errors: 0, Skipped: 0, Time elapsed: 11.544 sec - in org.apache.phoenix.end2end.StatsCollectionDisabledIT
Tests run: 2, Failures: 0, Errors: 0, Skipped: 0, Time elapsed: 12.474 sec - in org.apache.phoenix.end2end.StatsCollectorWithSplitsAndMultiCFIT
Running org.apache.phoenix.end2end.TenantSpecificTablesDDLIT
Running org.apache.phoenix.end2end.TenantSpecificTablesDMLIT
Tests run: 16, Failures: 0, Errors: 0, Skipped: 0, Time elapsed: 31.262 sec - in org.apache.phoenix.end2end.TenantSpecificTablesDMLIT
Tests run: 17, Failures: 0, Errors: 0, Skipped: 0, Time elapsed: 52.273 sec - in org.apache.phoenix.end2end.TenantSpecificTablesDDLIT
Running org.apache.phoenix.end2end.TransactionalViewIT
Tests run: 16, Failures: 0, Errors: 0, Skipped: 0, Time elapsed: 139.036 sec - in org.apache.phoenix.end2end.StatsCollectorIT
Running org.apache.phoenix.end2end.UnionAllIT
Tests run: 17, Failures: 0, Errors: 0, Skipped: 0, Time elapsed: 38.905 sec - in org.apache.phoenix.end2end.UnionAllIT
Running org.apache.phoenix.end2end.UserDefinedFunctionsIT
Tests run: 10, Failures: 0, Errors: 0, Skipped: 0, Time elapsed: 535.999 sec - in org.apache.phoenix.end2end.CsvBulkLoadToolIT
Tests run: 2, Failures: 0, Errors: 0, Skipped: 0, Time elapsed: 69.51 sec - in org.apache.phoenix.end2end.TransactionalViewIT
Running org.apache.phoenix.end2end.ViewIT
Running org.apache.phoenix.end2end.index.ImmutableIndexWithStatsIT
Tests run: 1, Failures: 0, Errors: 0, Skipped: 0, Time elapsed: 12.662 sec - in org.apache.phoenix.end2end.index.ImmutableIndexWithStatsIT
Tests run: 14, Failures: 0, Errors: 0, Skipped: 0, Time elapsed: 53.83 sec - in org.apache.phoenix.end2end.UserDefinedFunctionsIT
Running org.apache.phoenix.end2end.index.MutableIndexFailureIT
Running org.apache.phoenix.end2end.index.ReadOnlyIndexFailureIT
Running org.apache.phoenix.end2end.index.MutableIndexReplicationIT
Tests run: 1, Failures: 0, Errors: 0, Skipped: 0, Time elapsed: 28.894 sec - in org.apache.phoenix.end2end.index.MutableIndexReplicationIT
Tests run: 2, Failures: 0, Errors: 0, Skipped: 0, Time elapsed: 31.916 sec - in org.apache.phoenix.end2end.index.ReadOnlyIndexFailureIT
Running org.apache.phoenix.end2end.index.txn.TxWriteFailureIT
Running org.apache.phoenix.execute.PartialCommitIT
Tests run: 8, Failures: 0, Errors: 0, Skipped: 0, Time elapsed: 133.739 sec - in org.apache.phoenix.end2end.index.MutableIndexFailureIT
Running org.apache.phoenix.hbase.index.FailForUnsupportedHBaseVersionsIT
Tests run: 12, Failures: 0, Errors: 0, Skipped: 0, Time elapsed: 8.216 sec - in org.apache.phoenix.execute.PartialCommitIT
Running org.apache.phoenix.hbase.index.covered.EndToEndCoveredColumnsIndexBuilderIT
Tests run: 8, Failures: 0, Errors: 0, Skipped: 0, Time elapsed: 42.686 sec - in org.apache.phoenix.end2end.index.txn.TxWriteFailureIT
Tests run: 48, Failures: 0, Errors: 0, Skipped: 0, Time elapsed: 180.454 sec - in org.apache.phoenix.end2end.ViewIT
Tests run: 2, Failures: 0, Errors: 0, Skipped: 0, Time elapsed: 23.817 sec - in org.apache.phoenix.hbase.index.FailForUnsupportedHBaseVersionsIT
Tests run: 2, Failures: 0, Errors: 0, Skipped: 0, Time elapsed: 17.925 sec - in org.apache.phoenix.hbase.index.covered.EndToEndCoveredColumnsIndexBuilderIT
Running org.apache.phoenix.hbase.index.covered.example.FailWithoutRetriesIT
Tests run: 1, Failures: 0, Errors: 0, Skipped: 0, Time elapsed: 7.956 sec - in org.apache.phoenix.hbase.index.covered.example.FailWithoutRetriesIT
Running org.apache.phoenix.hbase.index.covered.example.EndToEndCoveredIndexingIT
Running org.apache.phoenix.hbase.index.covered.example.EndtoEndIndexingWithCompressionIT
Running org.apache.phoenix.iterate.RoundRobinResultIteratorWithStatsIT
Running org.apache.phoenix.iterate.ScannerLeaseRenewalIT
Tests run: 1, Failures: 0, Errors: 0, Skipped: 0, Time elapsed: 13.338 sec - in org.apache.phoenix.iterate.RoundRobinResultIteratorWithStatsIT
Running org.apache.phoenix.monitoring.PhoenixMetricsIT
Tests run: 11, Failures: 0, Errors: 0, Skipped: 0, Time elapsed: 131.61 sec - in org.apache.phoenix.hbase.index.covered.example.EndToEndCoveredIndexingIT
Tests run: 18, Failures: 0, Errors: 0, Skipped: 0, Time elapsed: 65.587 sec - in org.apache.phoenix.monitoring.PhoenixMetricsIT
Tests run: 11, Failures: 0, Errors: 0, Skipped: 0, Time elapsed: 131.049 sec - in org.apache.phoenix.hbase.index.covered.example.EndtoEndIndexingWithCompressionIT
Running org.apache.phoenix.rpc.PhoenixServerRpcIT
Running org.apache.phoenix.rpc.PhoenixClientRpcIT
Tests run: 2, Failures: 0, Errors: 0, Skipped: 0, Time elapsed: 12.845 sec - in org.apache.phoenix.rpc.PhoenixClientRpcIT
Tests run: 2, Failures: 0, Errors: 0, Skipped: 0, Time elapsed: 22.401 sec - in org.apache.phoenix.rpc.PhoenixServerRpcIT
Tests run: 2, Failures: 0, Errors: 0, Skipped: 0, Time elapsed: 171.469 sec - in org.apache.phoenix.iterate.ScannerLeaseRenewalIT
Tests run: 16, Failures: 0, Errors: 0, Skipped: 0, Time elapsed: 1,000.559 sec - in org.apache.phoenix.end2end.IndexToolIT

Results :

Tests run: 342, Failures: 0, Errors: 0, Skipped: 0

[INFO] 
[INFO] --- maven-failsafe-plugin:2.19.1:verify (ClientManagedTimeTests) @ phoenix-core ---
[INFO] ------------------------------------------------------------------------
[INFO] Reactor Summary:
[INFO] 
[INFO] Apache Phoenix .................................... SUCCESS [5.200s]
[INFO] Phoenix Core ...................................... FAILURE [56:21.116s]
[INFO] Phoenix - Flume ................................... SKIPPED
[INFO] Phoenix - Pig ..................................... SKIPPED
[INFO] Phoenix Query Server Client ....................... SKIPPED
[INFO] Phoenix Query Server .............................. SKIPPED
[INFO] Phoenix - Pherf ................................... SKIPPED
[INFO] Phoenix - Spark ................................... SKIPPED
[INFO] Phoenix - Hive .................................... SKIPPED
[INFO] Phoenix Client .................................... SKIPPED
[INFO] Phoenix Server .................................... SKIPPED
[INFO] Phoenix Assembly .................................. SKIPPED
[INFO] Phoenix - Tracing Web Application ................. SKIPPED
[INFO] ------------------------------------------------------------------------
[INFO] BUILD FAILURE
[INFO] ------------------------------------------------------------------------
[INFO] Total time: 56:27.444s
[INFO] Finished at: Fri Jun 17 20:34:49 UTC 2016
[INFO] Final Memory: 52M/1180M
[INFO] ------------------------------------------------------------------------
[ERROR] Failed to execute goal org.apache.maven.plugins:maven-failsafe-plugin:2.19.1:verify
(ClientManagedTimeTests) on project phoenix-core: There are test failures.
[ERROR] 
[ERROR] Please refer to <https://builds.apache.org/job/Phoenix-4.x-HBase-1.1/ws/phoenix-core/target/failsafe-reports>
for the individual test results.
[ERROR] -> [Help 1]
[ERROR] 
[ERROR] To see the full stack trace of the errors, re-run Maven with the -e switch.
[ERROR] Re-run Maven using the -X switch to enable full debug logging.
[ERROR] 
[ERROR] For more information about the errors and possible solutions, please read the following
articles:
[ERROR] [Help 1] http://cwiki.apache.org/confluence/display/MAVEN/MojoFailureException
[ERROR] 
[ERROR] After correcting the problems, you can resume the build with the command
[ERROR]   mvn <goals> -rf :phoenix-core
Build step 'Invoke top-level Maven targets' marked build as failure
Archiving artifacts
Compressed 1.46 GB of artifacts by 26.4% relative to #42
Recording test results

Mime
View raw message