phoenix-commits mailing list archives

Site index · List index
Message view « Date » · « Thread »
Top « Date » · « Thread »
From Apache Jenkins Server <jenk...@builds.apache.org>
Subject Build failed in Jenkins: Phoenix-4.x-HBase-1.1 #87
Date Fri, 24 Jun 2016 00:41:02 GMT
See <https://builds.apache.org/job/Phoenix-4.x-HBase-1.1/87/changes>

Changes:

[ankitsinghal59] PHOENIX-2949 Fix estimated region size when checking for serial query

------------------------------------------
[...truncated 1673 lines...]
[INFO] Installing <https://builds.apache.org/job/Phoenix-4.x-HBase-1.1/87/artifact/phoenix-queryserver/target/phoenix-queryserver-4.8.0-HBase-1.1-SNAPSHOT-tests.jar>
to /home/jenkins/.m2/repository/org/apache/phoenix/phoenix-queryserver/4.8.0-HBase-1.1-SNAPSHOT/phoenix-queryserver-4.8.0-HBase-1.1-SNAPSHOT-tests.jar
[INFO]                                                                         
[INFO] ------------------------------------------------------------------------
[INFO] Building Phoenix - Pherf 4.8.0-HBase-1.1-SNAPSHOT
[INFO] ------------------------------------------------------------------------
Downloading: http://repo.maven.apache.org/maven2/junit/junit-dep/maven-metadata.xml
Downloading: http://repository.apache.org/snapshots/junit/junit-dep/maven-metadata.xml
Downloading: https://repository.apache.org/content/repositories/releases/junit/junit-dep/maven-metadata.xml
Downloading: https://oss.sonatype.org/content/repositories/snapshots/junit/junit-dep/maven-metadata.xml

563/563 B   
            
Downloaded: http://repo.maven.apache.org/maven2/junit/junit-dep/maven-metadata.xml (563 B
at 2.7 KB/sec)
            
            
Downloading: http://repository.apache.org/snapshots/commons-io/commons-io/maven-metadata.xml
Downloading: http://repo.maven.apache.org/maven2/commons-io/commons-io/maven-metadata.xml
Downloading: https://repository.apache.org/content/repositories/releases/commons-io/commons-io/maven-metadata.xml
Downloading: https://oss.sonatype.org/content/repositories/snapshots/commons-io/commons-io/maven-metadata.xml
754/754 B   
396/396 B   754/754 B   
                        
Downloaded: http://repo.maven.apache.org/maven2/commons-io/commons-io/maven-metadata.xml (754
B at 13.6 KB/sec)
396/396 B   754/754 B   
                        
Downloaded: http://repository.apache.org/snapshots/commons-io/commons-io/maven-metadata.xml
(396 B at 5.9 KB/sec)
                        
Downloaded: https://repository.apache.org/content/repositories/releases/commons-io/commons-io/maven-metadata.xml
(754 B at 6.9 KB/sec)
                        
Downloading: https://repository.apache.org/content/repositories/releases/commons-io/commons-io/2.5-RC4-SNAPSHOT/maven-metadata.xml
Downloading: http://repository.apache.org/snapshots/commons-io/commons-io/2.5-RC4-SNAPSHOT/maven-metadata.xml
Downloading: https://oss.sonatype.org/content/repositories/snapshots/commons-io/commons-io/2.5-RC4-SNAPSHOT/maven-metadata.xml
3/3 KB                  
         
         
Downloaded: http://repository.apache.org/snapshots/commons-io/commons-io/2.5-RC4-SNAPSHOT/maven-metadata.xml
(3 KB at 38.1 KB/sec)
         
Downloading: https://repository.apache.org/content/repositories/releases/commons-io/commons-io/2.5-RC5-SNAPSHOT/maven-metadata.xml
Downloading: http://repository.apache.org/snapshots/commons-io/commons-io/2.5-RC5-SNAPSHOT/maven-metadata.xml
Downloading: https://oss.sonatype.org/content/repositories/snapshots/commons-io/commons-io/2.5-RC5-SNAPSHOT/maven-metadata.xml
3/3 KB   
         
         
Downloaded: http://repository.apache.org/snapshots/commons-io/commons-io/2.5-RC5-SNAPSHOT/maven-metadata.xml
(3 KB at 38.7 KB/sec)
         
Downloading: https://repository.apache.org/content/repositories/releases/commons-io/commons-io/2.6-SNAPSHOT/maven-metadata.xml
Downloading: http://repository.apache.org/snapshots/commons-io/commons-io/2.6-SNAPSHOT/maven-metadata.xml
Downloading: https://oss.sonatype.org/content/repositories/snapshots/commons-io/commons-io/2.6-SNAPSHOT/maven-metadata.xml
3/3 KB   
         
         
Downloaded: http://repository.apache.org/snapshots/commons-io/commons-io/2.6-SNAPSHOT/maven-metadata.xml
(3 KB at 35.4 KB/sec)
         
[INFO] 
[INFO] --- maven-clean-plugin:2.5:clean (default-clean) @ phoenix-pherf ---
[INFO] Deleting <https://builds.apache.org/job/Phoenix-4.x-HBase-1.1/ws/phoenix-pherf/target>
[INFO] 
[INFO] --- maven-checkstyle-plugin:2.13:check (validate) @ phoenix-pherf ---
[INFO] 
[INFO] --- build-helper-maven-plugin:1.9.1:add-test-source (add-test-source) @ phoenix-pherf
---
[INFO] Test Source directory: <https://builds.apache.org/job/Phoenix-4.x-HBase-1.1/ws/phoenix-pherf/src/it/java>
added.
[INFO] 
[INFO] --- build-helper-maven-plugin:1.9.1:add-test-resource (add-test-resource) @ phoenix-pherf
---
[INFO] 
[INFO] --- maven-remote-resources-plugin:1.5:process (default) @ phoenix-pherf ---
[INFO] artifact junit:junit-dep: checking for updates from apache release
[INFO] artifact junit:junit-dep: checking for updates from central
[INFO] artifact junit:junit: checking for updates from apache release
[INFO] artifact junit:junit: checking for updates from central
[INFO] artifact commons-io:commons-io: checking for updates from apache release
[INFO] artifact commons-io:commons-io: checking for updates from central
[INFO] 
[INFO] --- maven-resources-plugin:2.6:resources (default-resources) @ phoenix-pherf ---
[INFO] Using 'UTF-8' encoding to copy filtered resources.
[INFO] Copying 3 resources
[INFO] Copying 3 resources
[INFO] Copying 3 resources
[INFO] 
[INFO] --- maven-compiler-plugin:3.0:compile (default-compile) @ phoenix-pherf ---
[INFO] Changes detected - recompiling the module!
[INFO] Compiling 65 source files to <https://builds.apache.org/job/Phoenix-4.x-HBase-1.1/ws/phoenix-pherf/target/classes>
[WARNING] <https://builds.apache.org/job/Phoenix-4.x-HBase-1.1/ws/phoenix-pherf/src/main/java/org/apache/phoenix/pherf/jmx/monitors/FreeMemoryMonitor.java>:
Some input files use unchecked or unsafe operations.
[WARNING] <https://builds.apache.org/job/Phoenix-4.x-HBase-1.1/ws/phoenix-pherf/src/main/java/org/apache/phoenix/pherf/jmx/monitors/FreeMemoryMonitor.java>:
Recompile with -Xlint:unchecked for details.
[INFO] 
[INFO] --- maven-dependency-plugin:2.1:build-classpath (create-mrapp-generated-classpath)
@ phoenix-pherf ---
[INFO] Wrote classpath file '<https://builds.apache.org/job/Phoenix-4.x-HBase-1.1/ws/phoenix-pherf/target/classes/mrapp-generated-classpath'.>
[INFO] 
[INFO] --- maven-resources-plugin:2.6:testResources (default-testResources) @ phoenix-pherf
---
[INFO] Using 'UTF-8' encoding to copy filtered resources.
[INFO] Copying 5 resources
[INFO] Copying 5 resources
[INFO] skip non existing resourceDirectory <https://builds.apache.org/job/Phoenix-4.x-HBase-1.1/ws/phoenix-pherf/src/it/resources>
[INFO] Copying 3 resources
[INFO] 
[INFO] --- maven-compiler-plugin:3.0:testCompile (default-testCompile) @ phoenix-pherf ---
[INFO] Changes detected - recompiling the module!
[INFO] Compiling 14 source files to <https://builds.apache.org/job/Phoenix-4.x-HBase-1.1/ws/phoenix-pherf/target/test-classes>
[WARNING] <https://builds.apache.org/job/Phoenix-4.x-HBase-1.1/ws/phoenix-pherf/src/test/java/org/apache/phoenix/pherf/RowCalculatorTest.java>:
<https://builds.apache.org/job/Phoenix-4.x-HBase-1.1/ws/phoenix-pherf/src/test/java/org/apache/phoenix/pherf/RowCalculatorTest.java>
uses or overrides a deprecated API.
[WARNING] <https://builds.apache.org/job/Phoenix-4.x-HBase-1.1/ws/phoenix-pherf/src/test/java/org/apache/phoenix/pherf/RowCalculatorTest.java>:
Recompile with -Xlint:deprecation for details.
[WARNING] <https://builds.apache.org/job/Phoenix-4.x-HBase-1.1/ws/phoenix-pherf/src/test/java/org/apache/phoenix/pherf/ResultTest.java>:
Some input files use unchecked or unsafe operations.
[WARNING] <https://builds.apache.org/job/Phoenix-4.x-HBase-1.1/ws/phoenix-pherf/src/test/java/org/apache/phoenix/pherf/ResultTest.java>:
Recompile with -Xlint:unchecked for details.
[INFO] 
[INFO] --- maven-surefire-plugin:2.19.1:test (default-test) @ phoenix-pherf ---

-------------------------------------------------------
 T E S T S
-------------------------------------------------------
Running org.apache.phoenix.pherf.ResourceTest
Tests run: 3, Failures: 0, Errors: 0, Skipped: 0, Time elapsed: 1.061 sec - in org.apache.phoenix.pherf.ResourceTest
Running org.apache.phoenix.pherf.ConfigurationParserTest
Tests run: 2, Failures: 0, Errors: 0, Skipped: 0, Time elapsed: 0.626 sec - in org.apache.phoenix.pherf.ConfigurationParserTest
Running org.apache.phoenix.pherf.RuleGeneratorTest
Tests run: 6, Failures: 0, Errors: 0, Skipped: 0, Time elapsed: 1.763 sec - in org.apache.phoenix.pherf.RuleGeneratorTest
Running org.apache.phoenix.pherf.ResultTest
Tests run: 4, Failures: 0, Errors: 0, Skipped: 0, Time elapsed: 4.369 sec - in org.apache.phoenix.pherf.ResultTest
Running org.apache.phoenix.pherf.RowCalculatorTest
Tests run: 4, Failures: 0, Errors: 0, Skipped: 0, Time elapsed: 0.003 sec - in org.apache.phoenix.pherf.RowCalculatorTest
Running org.apache.phoenix.pherf.PherfTest
Tests run: 2, Failures: 0, Errors: 0, Skipped: 0, Time elapsed: 0.51 sec - in org.apache.phoenix.pherf.PherfTest
Running org.apache.phoenix.pherf.TestHBaseProps
Tests run: 1, Failures: 0, Errors: 0, Skipped: 0, Time elapsed: 0.193 sec - in org.apache.phoenix.pherf.TestHBaseProps
Running org.apache.phoenix.pherf.ColumnTest
Tests run: 1, Failures: 0, Errors: 0, Skipped: 0, Time elapsed: 0 sec - in org.apache.phoenix.pherf.ColumnTest
Running org.apache.phoenix.pherf.util.ResourceListTest
Tests run: 1, Failures: 0, Errors: 0, Skipped: 0, Time elapsed: 0 sec - in org.apache.phoenix.pherf.util.ResourceListTest

Results :

Tests run: 24, Failures: 0, Errors: 0, Skipped: 0

[INFO] 
[INFO] --- maven-source-plugin:2.2.1:jar-no-fork (attach-sources) @ phoenix-pherf ---
[INFO] Building jar: <https://builds.apache.org/job/Phoenix-4.x-HBase-1.1/87/artifact/phoenix-pherf/target/phoenix-pherf-4.8.0-HBase-1.1-SNAPSHOT-sources.jar>
[INFO] 
[INFO] --- maven-jar-plugin:2.4:test-jar (default) @ phoenix-pherf ---
[INFO] Building jar: <https://builds.apache.org/job/Phoenix-4.x-HBase-1.1/87/artifact/phoenix-pherf/target/phoenix-pherf-4.8.0-HBase-1.1-SNAPSHOT-tests.jar>
[INFO] 
[INFO] --- maven-jar-plugin:2.4:jar (default-jar) @ phoenix-pherf ---
[INFO] Building jar: <https://builds.apache.org/job/Phoenix-4.x-HBase-1.1/87/artifact/phoenix-pherf/target/phoenix-pherf-4.8.0-HBase-1.1-SNAPSHOT.jar>
[INFO] 
[INFO] --- maven-site-plugin:3.2:attach-descriptor (attach-descriptor) @ phoenix-pherf ---
[INFO] 
[INFO] --- maven-assembly-plugin:2.5.2:single (make-assembly) @ phoenix-pherf ---
[INFO] Reading assembly descriptor: src/main/assembly/minimal.xml
[INFO] artifact junit:junit-dep: checking for updates from apache release
[INFO] artifact junit:junit-dep: checking for updates from central
[INFO] artifact junit:junit: checking for updates from apache release
[INFO] artifact junit:junit: checking for updates from central
[INFO] artifact commons-io:commons-io: checking for updates from apache release
[INFO] artifact commons-io:commons-io: checking for updates from central
[INFO] Building jar: <https://builds.apache.org/job/Phoenix-4.x-HBase-1.1/87/artifact/phoenix-pherf/target/phoenix-pherf-4.8.0-HBase-1.1-SNAPSHOT-minimal.jar>
[INFO] 
[INFO] --- maven-failsafe-plugin:2.19.1:integration-test (ClientManagedTimeTests) @ phoenix-pherf
---

-------------------------------------------------------
 T E S T S
-------------------------------------------------------

Results :

Tests run: 0, Failures: 0, Errors: 0, Skipped: 0

[INFO] 
[INFO] --- maven-failsafe-plugin:2.19.1:integration-test (HBaseManagedTimeTests) @ phoenix-pherf
---

-------------------------------------------------------
 T E S T S
-------------------------------------------------------
Running org.apache.phoenix.pherf.SchemaReaderIT
Running org.apache.phoenix.pherf.DataIngestIT
Running org.apache.phoenix.pherf.PherfMainIT
Tests run: 1, Failures: 0, Errors: 0, Skipped: 0, Time elapsed: 36.604 sec - in org.apache.phoenix.pherf.SchemaReaderIT
Tests run: 4, Failures: 0, Errors: 0, Skipped: 0, Time elapsed: 54.814 sec - in org.apache.phoenix.pherf.DataIngestIT
Tests run: 2, Failures: 0, Errors: 1, Skipped: 0, Time elapsed: 63.026 sec <<< FAILURE!
- in org.apache.phoenix.pherf.PherfMainIT
org.apache.phoenix.pherf.PherfMainIT  Time elapsed: 63.026 sec  <<< ERROR!
java.io.IOException: Unable to delete directory RESULTS.


Results :

Tests in error: 
  PherfMainIT>ResultBaseTestIT.tearDown:57 ยป IO Unable to delete directory RESUL...

Tests run: 7, Failures: 0, Errors: 1, Skipped: 0

[INFO] 
[INFO] --- maven-failsafe-plugin:2.19.1:integration-test (HBaseManagedTimeTableReuseTest)
@ phoenix-pherf ---

-------------------------------------------------------
 T E S T S
-------------------------------------------------------

Results :

Tests run: 0, Failures: 0, Errors: 0, Skipped: 0

[INFO] 
[INFO] --- maven-failsafe-plugin:2.19.1:integration-test (NeedTheirOwnClusterTests) @ phoenix-pherf
---

-------------------------------------------------------
 T E S T S
-------------------------------------------------------

Results :

Tests run: 0, Failures: 0, Errors: 0, Skipped: 0

[INFO] 
[INFO] --- maven-failsafe-plugin:2.19.1:verify (ClientManagedTimeTests) @ phoenix-pherf ---
[INFO] ------------------------------------------------------------------------
[INFO] Reactor Summary:
[INFO] 
[INFO] Apache Phoenix .................................... SUCCESS [2.826s]
[INFO] Phoenix Core ...................................... SUCCESS [1:05:26.574s]
[INFO] Phoenix - Flume ................................... SUCCESS [1:15.436s]
[INFO] Phoenix - Pig ..................................... SUCCESS [3:19.521s]
[INFO] Phoenix Query Server Client ....................... SUCCESS [17.603s]
[INFO] Phoenix Query Server .............................. SUCCESS [1:48.499s]
[INFO] Phoenix - Pherf ................................... FAILURE [1:58.080s]
[INFO] Phoenix - Spark ................................... SKIPPED
[INFO] Phoenix - Hive .................................... SKIPPED
[INFO] Phoenix Client .................................... SKIPPED
[INFO] Phoenix Server .................................... SKIPPED
[INFO] Phoenix Assembly .................................. SKIPPED
[INFO] Phoenix - Tracing Web Application ................. SKIPPED
[INFO] ------------------------------------------------------------------------
[INFO] BUILD FAILURE
[INFO] ------------------------------------------------------------------------
[INFO] Total time: 1:14:09.385s
[INFO] Finished at: Fri Jun 24 00:35:56 UTC 2016
[INFO] Final Memory: 88M/1397M
[INFO] ------------------------------------------------------------------------
[ERROR] Failed to execute goal org.apache.maven.plugins:maven-failsafe-plugin:2.19.1:verify
(ClientManagedTimeTests) on project phoenix-pherf: There are test failures.
[ERROR] 
[ERROR] Please refer to <https://builds.apache.org/job/Phoenix-4.x-HBase-1.1/ws/phoenix-pherf/target/failsafe-reports>
for the individual test results.
[ERROR] -> [Help 1]
[ERROR] 
[ERROR] To see the full stack trace of the errors, re-run Maven with the -e switch.
[ERROR] Re-run Maven using the -X switch to enable full debug logging.
[ERROR] 
[ERROR] For more information about the errors and possible solutions, please read the following
articles:
[ERROR] [Help 1] http://cwiki.apache.org/confluence/display/MAVEN/MojoFailureException
[ERROR] 
[ERROR] After correcting the problems, you can resume the build with the command
[ERROR]   mvn <goals> -rf :phoenix-pherf
Build step 'Invoke top-level Maven targets' marked build as failure
Archiving artifacts
Compressed 1.99 GB of artifacts by 59.6% relative to #82
Recording test results

Mime
View raw message