phoenix-commits mailing list archives

Site index · List index
Message view « Date » · « Thread »
Top « Date » · « Thread »
From Apache Jenkins Server <jenk...@builds.apache.org>
Subject Build failed in Jenkins: Phoenix | Master #1229
Date Fri, 20 May 2016 20:21:03 GMT
See <https://builds.apache.org/job/Phoenix-master/1229/changes>

Changes:

[ssa] PHOENIX-2908 phoenix-core depends on both antlr 3.5 and antlr 2.7.7

[maryannxue] PHOENIX-2894 Sort-merge join works incorrectly with DESC columns

------------------------------------------
[...truncated 1411 lines...]
Downloaded: http://repository.apache.org/snapshots/commons-io/commons-io/2.5-RC4-SNAPSHOT/maven-metadata.xml
(3 KB at 0.7 KB/sec)
Downloading: https://oss.sonatype.org/content/repositories/snapshots/commons-io/commons-io/2.5-RC5-SNAPSHOT/maven-metadata.xml
Downloading: https://repository.apache.org/content/repositories/orgapachetephra-1001/commons-io/commons-io/2.5-RC5-SNAPSHOT/maven-metadata.xml
Downloading: https://repository.apache.org/content/repositories/releases/commons-io/commons-io/2.5-RC5-SNAPSHOT/maven-metadata.xml
Downloading: http://repository.apache.org/snapshots/commons-io/commons-io/2.5-RC5-SNAPSHOT/maven-metadata.xml
3/3 KB   
         
         
         
Downloaded: http://repository.apache.org/snapshots/commons-io/commons-io/2.5-RC5-SNAPSHOT/maven-metadata.xml
(3 KB at 32.1 KB/sec)
         
Downloading: https://repository.apache.org/content/repositories/releases/commons-io/commons-io/2.6-SNAPSHOT/maven-metadata.xml
Downloading: http://repository.apache.org/snapshots/commons-io/commons-io/2.6-SNAPSHOT/maven-metadata.xml
Downloading: https://repository.apache.org/content/repositories/orgapachetephra-1001/commons-io/commons-io/2.6-SNAPSHOT/maven-metadata.xml
Downloading: https://oss.sonatype.org/content/repositories/snapshots/commons-io/commons-io/2.6-SNAPSHOT/maven-metadata.xml
         
3/3 KB   
         
         
Downloaded: http://repository.apache.org/snapshots/commons-io/commons-io/2.6-SNAPSHOT/maven-metadata.xml
(3 KB at 23.1 KB/sec)
         
[INFO] 
[INFO] --- maven-clean-plugin:2.5:clean (default-clean) @ phoenix-pherf ---
[INFO] Deleting <https://builds.apache.org/job/Phoenix-master/ws/phoenix-pherf/target>
[INFO] 
[INFO] --- maven-checkstyle-plugin:2.13:check (validate) @ phoenix-pherf ---
[INFO] 
[INFO] --- build-helper-maven-plugin:1.9.1:add-test-source (add-test-source) @ phoenix-pherf
---
[INFO] Test Source directory: <https://builds.apache.org/job/Phoenix-master/ws/phoenix-pherf/src/it/java>
added.
[INFO] 
[INFO] --- build-helper-maven-plugin:1.9.1:add-test-resource (add-test-resource) @ phoenix-pherf
---
[INFO] 
[INFO] --- maven-remote-resources-plugin:1.5:process (default) @ phoenix-pherf ---
[INFO] artifact junit:junit-dep: checking for updates from apache release
[INFO] artifact junit:junit-dep: checking for updates from apache tephra staging
[INFO] artifact junit:junit-dep: checking for updates from central
[INFO] artifact junit:junit: checking for updates from apache release
[INFO] artifact junit:junit: checking for updates from apache tephra staging
[INFO] artifact junit:junit: checking for updates from central
[INFO] artifact commons-io:commons-io: checking for updates from apache release
[INFO] artifact commons-io:commons-io: checking for updates from apache tephra staging
[INFO] artifact commons-io:commons-io: checking for updates from central
[INFO] 
[INFO] --- maven-resources-plugin:2.6:resources (default-resources) @ phoenix-pherf ---
[INFO] Using 'UTF-8' encoding to copy filtered resources.
[INFO] Copying 3 resources
[INFO] Copying 3 resources
[INFO] Copying 3 resources
[INFO] 
[INFO] --- maven-compiler-plugin:3.0:compile (default-compile) @ phoenix-pherf ---
[INFO] Changes detected - recompiling the module!
[INFO] Compiling 65 source files to <https://builds.apache.org/job/Phoenix-master/ws/phoenix-pherf/target/classes>
[WARNING] <https://builds.apache.org/job/Phoenix-master/ws/phoenix-pherf/src/main/java/org/apache/phoenix/pherf/result/DataLoadThreadTime.java>:
Some input files use unchecked or unsafe operations.
[WARNING] <https://builds.apache.org/job/Phoenix-master/ws/phoenix-pherf/src/main/java/org/apache/phoenix/pherf/result/DataLoadThreadTime.java>:
Recompile with -Xlint:unchecked for details.
[INFO] 
[INFO] --- maven-dependency-plugin:2.1:build-classpath (create-mrapp-generated-classpath)
@ phoenix-pherf ---
[INFO] Wrote classpath file '<https://builds.apache.org/job/Phoenix-master/ws/phoenix-pherf/target/classes/mrapp-generated-classpath'.>
[INFO] 
[INFO] --- maven-resources-plugin:2.6:testResources (default-testResources) @ phoenix-pherf
---
[INFO] Using 'UTF-8' encoding to copy filtered resources.
[INFO] Copying 5 resources
[INFO] Copying 5 resources
[INFO] skip non existing resourceDirectory <https://builds.apache.org/job/Phoenix-master/ws/phoenix-pherf/src/it/resources>
[INFO] Copying 3 resources
[INFO] 
[INFO] --- maven-compiler-plugin:3.0:testCompile (default-testCompile) @ phoenix-pherf ---
[INFO] Changes detected - recompiling the module!
[INFO] Compiling 14 source files to <https://builds.apache.org/job/Phoenix-master/ws/phoenix-pherf/target/test-classes>
[WARNING] <https://builds.apache.org/job/Phoenix-master/ws/phoenix-pherf/src/test/java/org/apache/phoenix/pherf/RowCalculatorTest.java>:
<https://builds.apache.org/job/Phoenix-master/ws/phoenix-pherf/src/test/java/org/apache/phoenix/pherf/RowCalculatorTest.java>
uses or overrides a deprecated API.
[WARNING] <https://builds.apache.org/job/Phoenix-master/ws/phoenix-pherf/src/test/java/org/apache/phoenix/pherf/RowCalculatorTest.java>:
Recompile with -Xlint:deprecation for details.
[WARNING] <https://builds.apache.org/job/Phoenix-master/ws/phoenix-pherf/src/test/java/org/apache/phoenix/pherf/ResultTest.java>:
Some input files use unchecked or unsafe operations.
[WARNING] <https://builds.apache.org/job/Phoenix-master/ws/phoenix-pherf/src/test/java/org/apache/phoenix/pherf/ResultTest.java>:
Recompile with -Xlint:unchecked for details.
[INFO] 
[INFO] --- maven-surefire-plugin:2.19.1:test (default-test) @ phoenix-pherf ---

-------------------------------------------------------
 T E S T S
-------------------------------------------------------
Running org.apache.phoenix.pherf.PherfTest
Tests run: 2, Failures: 0, Errors: 0, Skipped: 0, Time elapsed: 1.255 sec - in org.apache.phoenix.pherf.PherfTest
Running org.apache.phoenix.pherf.ResultTest
Tests run: 4, Failures: 0, Errors: 0, Skipped: 0, Time elapsed: 5.056 sec - in org.apache.phoenix.pherf.ResultTest
Running org.apache.phoenix.pherf.ColumnTest
Tests run: 1, Failures: 0, Errors: 0, Skipped: 0, Time elapsed: 0.001 sec - in org.apache.phoenix.pherf.ColumnTest
Running org.apache.phoenix.pherf.ResourceTest
Tests run: 3, Failures: 0, Errors: 0, Skipped: 0, Time elapsed: 0.621 sec - in org.apache.phoenix.pherf.ResourceTest
Running org.apache.phoenix.pherf.RowCalculatorTest
Tests run: 4, Failures: 0, Errors: 0, Skipped: 0, Time elapsed: 0.005 sec - in org.apache.phoenix.pherf.RowCalculatorTest
Running org.apache.phoenix.pherf.ConfigurationParserTest
Tests run: 2, Failures: 0, Errors: 0, Skipped: 0, Time elapsed: 0.285 sec - in org.apache.phoenix.pherf.ConfigurationParserTest
Running org.apache.phoenix.pherf.RuleGeneratorTest
Tests run: 6, Failures: 0, Errors: 0, Skipped: 0, Time elapsed: 2.232 sec - in org.apache.phoenix.pherf.RuleGeneratorTest
Running org.apache.phoenix.pherf.TestHBaseProps
Tests run: 1, Failures: 0, Errors: 0, Skipped: 0, Time elapsed: 0.275 sec - in org.apache.phoenix.pherf.TestHBaseProps
Running org.apache.phoenix.pherf.util.ResourceListTest
Tests run: 1, Failures: 0, Errors: 0, Skipped: 0, Time elapsed: 0.001 sec - in org.apache.phoenix.pherf.util.ResourceListTest

Results :

Tests run: 24, Failures: 0, Errors: 0, Skipped: 0

[INFO] 
[INFO] --- maven-source-plugin:2.2.1:jar-no-fork (attach-sources) @ phoenix-pherf ---
[INFO] Building jar: <https://builds.apache.org/job/Phoenix-master/1229/artifact/phoenix-pherf/target/phoenix-pherf-4.8.0-HBase-1.2-SNAPSHOT-sources.jar>
[INFO] 
[INFO] --- maven-jar-plugin:2.4:test-jar (default) @ phoenix-pherf ---
[INFO] Building jar: <https://builds.apache.org/job/Phoenix-master/1229/artifact/phoenix-pherf/target/phoenix-pherf-4.8.0-HBase-1.2-SNAPSHOT-tests.jar>
[INFO] 
[INFO] --- maven-jar-plugin:2.4:jar (default-jar) @ phoenix-pherf ---
[INFO] Building jar: <https://builds.apache.org/job/Phoenix-master/1229/artifact/phoenix-pherf/target/phoenix-pherf-4.8.0-HBase-1.2-SNAPSHOT.jar>
[INFO] 
[INFO] --- maven-site-plugin:3.2:attach-descriptor (attach-descriptor) @ phoenix-pherf ---
[INFO] 
[INFO] --- maven-assembly-plugin:2.5.2:single (make-assembly) @ phoenix-pherf ---
[INFO] Reading assembly descriptor: src/main/assembly/minimal.xml
[INFO] artifact junit:junit-dep: checking for updates from apache release
[INFO] artifact junit:junit-dep: checking for updates from apache tephra staging
[INFO] artifact junit:junit-dep: checking for updates from central
[INFO] artifact junit:junit: checking for updates from apache release
[INFO] artifact junit:junit: checking for updates from apache tephra staging
[INFO] artifact junit:junit: checking for updates from central
[INFO] artifact commons-io:commons-io: checking for updates from apache release
[INFO] artifact commons-io:commons-io: checking for updates from apache tephra staging
[INFO] artifact commons-io:commons-io: checking for updates from central
[INFO] Building jar: <https://builds.apache.org/job/Phoenix-master/1229/artifact/phoenix-pherf/target/phoenix-pherf-4.8.0-HBase-1.2-SNAPSHOT-minimal.jar>
[INFO] 
[INFO] --- maven-failsafe-plugin:2.19.1:integration-test (ClientManagedTimeTests) @ phoenix-pherf
---

-------------------------------------------------------
 T E S T S
-------------------------------------------------------

Results :

Tests run: 0, Failures: 0, Errors: 0, Skipped: 0

[INFO] 
[INFO] --- maven-failsafe-plugin:2.19.1:integration-test (HBaseManagedTimeTests) @ phoenix-pherf
---

-------------------------------------------------------
 T E S T S
-------------------------------------------------------
Running org.apache.phoenix.pherf.PherfMainIT
Tests run: 2, Failures: 0, Errors: 2, Skipped: 0, Time elapsed: 0.008 sec <<< FAILURE!
- in org.apache.phoenix.pherf.PherfMainIT
org.apache.phoenix.pherf.PherfMainIT  Time elapsed: 0.008 sec  <<< ERROR!
java.lang.RuntimeException: java.lang.NoClassDefFoundError: org/apache/hadoop/hdfs/MiniDFSCluster
Caused by: java.lang.NoClassDefFoundError: org/apache/hadoop/hdfs/MiniDFSCluster
Caused by: java.lang.ClassNotFoundException: org.apache.hadoop.hdfs.MiniDFSCluster

org.apache.phoenix.pherf.PherfMainIT  Time elapsed: 0.008 sec  <<< ERROR!
java.lang.NullPointerException

Running org.apache.phoenix.pherf.SchemaReaderIT
Tests run: 1, Failures: 0, Errors: 1, Skipped: 0, Time elapsed: 0.006 sec <<< FAILURE!
- in org.apache.phoenix.pherf.SchemaReaderIT
org.apache.phoenix.pherf.SchemaReaderIT  Time elapsed: 0.005 sec  <<< ERROR!
java.lang.RuntimeException: java.lang.NoClassDefFoundError: org/apache/hadoop/hdfs/MiniDFSCluster
Caused by: java.lang.NoClassDefFoundError: org/apache/hadoop/hdfs/MiniDFSCluster
Caused by: java.lang.ClassNotFoundException: org.apache.hadoop.hdfs.MiniDFSCluster

Running org.apache.phoenix.pherf.DataIngestIT
Tests run: 2, Failures: 0, Errors: 2, Skipped: 0, Time elapsed: 0.006 sec <<< FAILURE!
- in org.apache.phoenix.pherf.DataIngestIT
org.apache.phoenix.pherf.DataIngestIT  Time elapsed: 0.005 sec  <<< ERROR!
java.lang.RuntimeException: java.lang.NoClassDefFoundError: org/apache/hadoop/hdfs/MiniDFSCluster
Caused by: java.lang.NoClassDefFoundError: org/apache/hadoop/hdfs/MiniDFSCluster
Caused by: java.lang.ClassNotFoundException: org.apache.hadoop.hdfs.MiniDFSCluster

org.apache.phoenix.pherf.DataIngestIT  Time elapsed: 0.005 sec  <<< ERROR!
java.lang.NullPointerException


Results :

Tests in error: 
org.apache.phoenix.pherf.DataIngestIT.org.apache.phoenix.pherf.DataIngestIT
  Run 1: DataIngestIT>BaseHBaseManagedTimeIT.doSetup:57->BaseTest.setUpTestDriver:630->BaseTest.setUpTestDriver:634->BaseTest.checkClusterInitialized:565->BaseTest.setUpTestCluster:578->BaseTest.initMiniCluster:687
» Runtime
  Run 2: DataIngestIT>ResultBaseTestIT.tearDown:57 » NullPointer

org.apache.phoenix.pherf.PherfMainIT.org.apache.phoenix.pherf.PherfMainIT
  Run 1: PherfMainIT>BaseHBaseManagedTimeIT.doSetup:57->BaseTest.setUpTestDriver:630->BaseTest.setUpTestDriver:634->BaseTest.checkClusterInitialized:565->BaseTest.setUpTestCluster:578->BaseTest.initMiniCluster:687
» Runtime
  Run 2: PherfMainIT>ResultBaseTestIT.tearDown:57 » NullPointer

  SchemaReaderIT>BaseHBaseManagedTimeIT.doSetup:57->BaseTest.setUpTestDriver:630->BaseTest.setUpTestDriver:634->BaseTest.checkClusterInitialized:565->BaseTest.setUpTestCluster:578->BaseTest.initMiniCluster:687
» Runtime

Tests run: 3, Failures: 0, Errors: 3, Skipped: 0

[INFO] 
[INFO] --- maven-failsafe-plugin:2.19.1:integration-test (HBaseManagedTimeTableReuseTest)
@ phoenix-pherf ---

-------------------------------------------------------
 T E S T S
-------------------------------------------------------

Results :

Tests run: 0, Failures: 0, Errors: 0, Skipped: 0

[INFO] 
[INFO] --- maven-failsafe-plugin:2.19.1:integration-test (NeedTheirOwnClusterTests) @ phoenix-pherf
---

-------------------------------------------------------
 T E S T S
-------------------------------------------------------

Results :

Tests run: 0, Failures: 0, Errors: 0, Skipped: 0

[INFO] 
[INFO] --- maven-failsafe-plugin:2.19.1:verify (ClientManagedTimeTests) @ phoenix-pherf ---
[INFO] ------------------------------------------------------------------------
[INFO] Reactor Summary:
[INFO] 
[INFO] Apache Phoenix .................................... SUCCESS [3.694s]
[INFO] Phoenix Core ...................................... SUCCESS [1:00:17.304s]
[INFO] Phoenix - Flume ................................... SUCCESS [1:21.674s]
[INFO] Phoenix - Pig ..................................... SUCCESS [2:52.905s]
[INFO] Phoenix Query Server Client ....................... SUCCESS [3.650s]
[INFO] Phoenix Query Server .............................. SUCCESS [1:50.353s]
[INFO] Phoenix - Pherf ................................... FAILURE [41.536s]
[INFO] Phoenix - Spark ................................... SKIPPED
[INFO] Phoenix - Hive .................................... SKIPPED
[INFO] Phoenix Assembly .................................. SKIPPED
[INFO] Phoenix - Tracing Web Application ................. SKIPPED
[INFO] ------------------------------------------------------------------------
[INFO] BUILD FAILURE
[INFO] ------------------------------------------------------------------------
[INFO] Total time: 1:07:12.087s
[INFO] Finished at: Fri May 20 20:06:49 UTC 2016
[INFO] Final Memory: 83M/1103M
[INFO] ------------------------------------------------------------------------
[ERROR] Failed to execute goal org.apache.maven.plugins:maven-failsafe-plugin:2.19.1:verify
(ClientManagedTimeTests) on project phoenix-pherf: There are test failures.
[ERROR] 
[ERROR] Please refer to <https://builds.apache.org/job/Phoenix-master/ws/phoenix-pherf/target/failsafe-reports>
for the individual test results.
[ERROR] -> [Help 1]
[ERROR] 
[ERROR] To see the full stack trace of the errors, re-run Maven with the -e switch.
[ERROR] Re-run Maven using the -X switch to enable full debug logging.
[ERROR] 
[ERROR] For more information about the errors and possible solutions, please read the following
articles:
[ERROR] [Help 1] http://cwiki.apache.org/confluence/display/MAVEN/MojoFailureException
[ERROR] 
[ERROR] After correcting the problems, you can resume the build with the command
[ERROR]   mvn <goals> -rf :phoenix-pherf
Build step 'Invoke top-level Maven targets' marked build as failure
Archiving artifacts
Compressed 1.93 GB of artifacts by 38.9% relative to #1224
Updating PHOENIX-2894
Updating PHOENIX-2908
Recording test results

Mime
View raw message