phoenix-commits mailing list archives

Site index · List index
Message view « Date » · « Thread »
Top « Date » · « Thread »
From Apache Jenkins Server <jenk...@builds.apache.org>
Subject Build failed in Jenkins: Phoenix-4.x-HBase-1.0 #475
Date Fri, 20 May 2016 08:02:52 GMT
See <https://builds.apache.org/job/Phoenix-4.x-HBase-1.0/475/changes>

Changes:

[ssa] Make sqlline refer to bin/hbase-site.xml by default (Junegunn Choi)

[jamestaylor] PHOENIX-2906 Use org.apache.tephra instead of co.cask.tephra

------------------------------------------
[...truncated 6851 lines...]
99/205 KB   
103/205 KB   
107/205 KB   
111/205 KB   
115/205 KB   
119/205 KB   
123/205 KB   
127/205 KB   
131/205 KB   
135/205 KB   
139/205 KB   
143/205 KB   
147/205 KB   
151/205 KB   
155/205 KB   
159/205 KB   
163/205 KB   
167/205 KB   
171/205 KB   
175/205 KB   
179/205 KB   
183/205 KB   
187/205 KB   
191/205 KB   
195/205 KB   
199/205 KB   
203/205 KB   
205/205 KB   
             
Downloaded: http://repository.apache.org/snapshots/commons-io/commons-io/2.6-SNAPSHOT/commons-io-2.6-20160414.212343-29.jar
(205 KB at 2174.7 KB/sec)
[INFO] 
[INFO] --- maven-clean-plugin:2.5:clean (default-clean) @ phoenix-pherf ---
[INFO] 
[INFO] --- maven-checkstyle-plugin:2.13:check (validate) @ phoenix-pherf ---
[INFO] 
[INFO] --- build-helper-maven-plugin:1.9.1:add-test-source (add-test-source) @ phoenix-pherf
---
[INFO] Test Source directory: <https://builds.apache.org/job/Phoenix-4.x-HBase-1.0/ws/phoenix-pherf/src/it/java>
added.
[INFO] 
[INFO] --- build-helper-maven-plugin:1.9.1:add-test-resource (add-test-resource) @ phoenix-pherf
---
[INFO] 
[INFO] --- maven-remote-resources-plugin:1.5:process (default) @ phoenix-pherf ---
[INFO] artifact junit:junit-dep: checking for updates from apache release
[INFO] artifact junit:junit-dep: checking for updates from apache tephra staging
[INFO] artifact junit:junit-dep: checking for updates from central
[INFO] artifact junit:junit: checking for updates from apache release
[INFO] artifact junit:junit: checking for updates from apache tephra staging
[INFO] artifact junit:junit: checking for updates from central
[INFO] artifact commons-io:commons-io: checking for updates from apache release
[INFO] artifact commons-io:commons-io: checking for updates from apache tephra staging
[INFO] artifact commons-io:commons-io: checking for updates from central
[INFO] 
[INFO] --- maven-resources-plugin:2.6:resources (default-resources) @ phoenix-pherf ---
[INFO] Using 'UTF-8' encoding to copy filtered resources.
[INFO] Copying 3 resources
[INFO] Copying 3 resources
[INFO] Copying 3 resources
[INFO] 
[INFO] --- maven-compiler-plugin:3.0:compile (default-compile) @ phoenix-pherf ---
[INFO] Changes detected - recompiling the module!
[INFO] Compiling 65 source files to <https://builds.apache.org/job/Phoenix-4.x-HBase-1.0/ws/phoenix-pherf/target/classes>
[WARNING] <https://builds.apache.org/job/Phoenix-4.x-HBase-1.0/ws/phoenix-pherf/src/main/java/org/apache/phoenix/pherf/jmx/monitors/TotalMemoryMonitor.java>:
Some input files use unchecked or unsafe operations.
[WARNING] <https://builds.apache.org/job/Phoenix-4.x-HBase-1.0/ws/phoenix-pherf/src/main/java/org/apache/phoenix/pherf/jmx/monitors/TotalMemoryMonitor.java>:
Recompile with -Xlint:unchecked for details.
[INFO] 
[INFO] --- maven-dependency-plugin:2.1:build-classpath (create-mrapp-generated-classpath)
@ phoenix-pherf ---
[INFO] Wrote classpath file '<https://builds.apache.org/job/Phoenix-4.x-HBase-1.0/ws/phoenix-pherf/target/classes/mrapp-generated-classpath'.>
[INFO] 
[INFO] --- maven-resources-plugin:2.6:testResources (default-testResources) @ phoenix-pherf
---
[INFO] Using 'UTF-8' encoding to copy filtered resources.
[INFO] Copying 5 resources
[INFO] Copying 5 resources
[INFO] skip non existing resourceDirectory <https://builds.apache.org/job/Phoenix-4.x-HBase-1.0/ws/phoenix-pherf/src/it/resources>
[INFO] Copying 3 resources
[INFO] 
[INFO] --- maven-compiler-plugin:3.0:testCompile (default-testCompile) @ phoenix-pherf ---
[INFO] Changes detected - recompiling the module!
[INFO] Compiling 14 source files to <https://builds.apache.org/job/Phoenix-4.x-HBase-1.0/ws/phoenix-pherf/target/test-classes>
[WARNING] <https://builds.apache.org/job/Phoenix-4.x-HBase-1.0/ws/phoenix-pherf/src/test/java/org/apache/phoenix/pherf/RowCalculatorTest.java>:
<https://builds.apache.org/job/Phoenix-4.x-HBase-1.0/ws/phoenix-pherf/src/test/java/org/apache/phoenix/pherf/RowCalculatorTest.java>
uses or overrides a deprecated API.
[WARNING] <https://builds.apache.org/job/Phoenix-4.x-HBase-1.0/ws/phoenix-pherf/src/test/java/org/apache/phoenix/pherf/RowCalculatorTest.java>:
Recompile with -Xlint:deprecation for details.
[WARNING] <https://builds.apache.org/job/Phoenix-4.x-HBase-1.0/ws/phoenix-pherf/src/test/java/org/apache/phoenix/pherf/ResultTest.java>:
Some input files use unchecked or unsafe operations.
[WARNING] <https://builds.apache.org/job/Phoenix-4.x-HBase-1.0/ws/phoenix-pherf/src/test/java/org/apache/phoenix/pherf/ResultTest.java>:
Recompile with -Xlint:unchecked for details.
[INFO] 
[INFO] --- maven-surefire-plugin:2.19.1:test (default-test) @ phoenix-pherf ---

-------------------------------------------------------
 T E S T S
-------------------------------------------------------
Running org.apache.phoenix.pherf.ResourceTest
Tests run: 3, Failures: 0, Errors: 0, Skipped: 0, Time elapsed: 0.746 sec - in org.apache.phoenix.pherf.ResourceTest
Running org.apache.phoenix.pherf.RuleGeneratorTest
Tests run: 5, Failures: 0, Errors: 0, Skipped: 0, Time elapsed: 1.968 sec - in org.apache.phoenix.pherf.RuleGeneratorTest
Running org.apache.phoenix.pherf.ConfigurationParserTest
Tests run: 2, Failures: 0, Errors: 0, Skipped: 0, Time elapsed: 0.266 sec - in org.apache.phoenix.pherf.ConfigurationParserTest
Running org.apache.phoenix.pherf.ColumnTest
Tests run: 1, Failures: 0, Errors: 0, Skipped: 0, Time elapsed: 0 sec - in org.apache.phoenix.pherf.ColumnTest
Running org.apache.phoenix.pherf.util.ResourceListTest
Tests run: 1, Failures: 0, Errors: 0, Skipped: 0, Time elapsed: 0 sec - in org.apache.phoenix.pherf.util.ResourceListTest
Running org.apache.phoenix.pherf.RowCalculatorTest
Tests run: 4, Failures: 0, Errors: 0, Skipped: 0, Time elapsed: 0.004 sec - in org.apache.phoenix.pherf.RowCalculatorTest
Running org.apache.phoenix.pherf.TestHBaseProps
Tests run: 1, Failures: 0, Errors: 0, Skipped: 0, Time elapsed: 0.226 sec - in org.apache.phoenix.pherf.TestHBaseProps
Running org.apache.phoenix.pherf.PherfTest
Tests run: 2, Failures: 0, Errors: 0, Skipped: 0, Time elapsed: 0.489 sec - in org.apache.phoenix.pherf.PherfTest
Running org.apache.phoenix.pherf.ResultTest
Tests run: 4, Failures: 0, Errors: 0, Skipped: 0, Time elapsed: 4.329 sec - in org.apache.phoenix.pherf.ResultTest

Results :

Tests run: 23, Failures: 0, Errors: 0, Skipped: 0

[INFO] 
[INFO] --- maven-source-plugin:2.2.1:jar-no-fork (attach-sources) @ phoenix-pherf ---
[INFO] Building jar: <https://builds.apache.org/job/Phoenix-4.x-HBase-1.0/475/artifact/phoenix-pherf/target/phoenix-pherf-4.8.0-HBase-1.0-SNAPSHOT-sources.jar>
[INFO] 
[INFO] --- maven-jar-plugin:2.4:test-jar (default) @ phoenix-pherf ---
[INFO] Building jar: <https://builds.apache.org/job/Phoenix-4.x-HBase-1.0/475/artifact/phoenix-pherf/target/phoenix-pherf-4.8.0-HBase-1.0-SNAPSHOT-tests.jar>
[INFO] 
[INFO] --- maven-jar-plugin:2.4:jar (default-jar) @ phoenix-pherf ---
[INFO] Building jar: <https://builds.apache.org/job/Phoenix-4.x-HBase-1.0/475/artifact/phoenix-pherf/target/phoenix-pherf-4.8.0-HBase-1.0-SNAPSHOT.jar>
[INFO] 
[INFO] --- maven-site-plugin:3.2:attach-descriptor (attach-descriptor) @ phoenix-pherf ---
[INFO] 
[INFO] --- maven-assembly-plugin:2.5.2:single (make-assembly) @ phoenix-pherf ---
[INFO] Reading assembly descriptor: src/main/assembly/minimal.xml
[INFO] artifact junit:junit-dep: checking for updates from apache release
[INFO] artifact junit:junit-dep: checking for updates from apache tephra staging
[INFO] artifact junit:junit-dep: checking for updates from central
[INFO] artifact junit:junit: checking for updates from apache release
[INFO] artifact junit:junit: checking for updates from apache tephra staging
[INFO] artifact junit:junit: checking for updates from central
[INFO] artifact commons-io:commons-io: checking for updates from apache release
[INFO] artifact commons-io:commons-io: checking for updates from apache tephra staging
[INFO] artifact commons-io:commons-io: checking for updates from central
[INFO] Building jar: <https://builds.apache.org/job/Phoenix-4.x-HBase-1.0/475/artifact/phoenix-pherf/target/phoenix-pherf-4.8.0-HBase-1.0-SNAPSHOT-minimal.jar>
[INFO] 
[INFO] --- maven-failsafe-plugin:2.19.1:integration-test (ClientManagedTimeTests) @ phoenix-pherf
---

-------------------------------------------------------
 T E S T S
-------------------------------------------------------

Results :

Tests run: 0, Failures: 0, Errors: 0, Skipped: 0

[INFO] 
[INFO] --- maven-failsafe-plugin:2.19.1:integration-test (HBaseManagedTimeTests) @ phoenix-pherf
---

-------------------------------------------------------
 T E S T S
-------------------------------------------------------
Running org.apache.phoenix.pherf.SchemaReaderIT
Tests run: 1, Failures: 0, Errors: 0, Skipped: 1, Time elapsed: 0.001 sec - in org.apache.phoenix.pherf.SchemaReaderIT
Running org.apache.phoenix.pherf.PherfMainIT
Tests run: 2, Failures: 0, Errors: 2, Skipped: 0, Time elapsed: 0.005 sec <<< FAILURE!
- in org.apache.phoenix.pherf.PherfMainIT
org.apache.phoenix.pherf.PherfMainIT  Time elapsed: 0.005 sec  <<< ERROR!
java.lang.RuntimeException: java.lang.NoClassDefFoundError: org/apache/hadoop/hdfs/MiniDFSCluster
Caused by: java.lang.NoClassDefFoundError: org/apache/hadoop/hdfs/MiniDFSCluster
Caused by: java.lang.ClassNotFoundException: org.apache.hadoop.hdfs.MiniDFSCluster

org.apache.phoenix.pherf.PherfMainIT  Time elapsed: 0.005 sec  <<< ERROR!
java.lang.NullPointerException

Running org.apache.phoenix.pherf.DataIngestIT
Tests run: 2, Failures: 0, Errors: 2, Skipped: 0, Time elapsed: 0.005 sec <<< FAILURE!
- in org.apache.phoenix.pherf.DataIngestIT
org.apache.phoenix.pherf.DataIngestIT  Time elapsed: 0.004 sec  <<< ERROR!
java.lang.RuntimeException: java.lang.NoClassDefFoundError: org/apache/hadoop/hdfs/MiniDFSCluster
Caused by: java.lang.NoClassDefFoundError: org/apache/hadoop/hdfs/MiniDFSCluster
Caused by: java.lang.ClassNotFoundException: org.apache.hadoop.hdfs.MiniDFSCluster

org.apache.phoenix.pherf.DataIngestIT  Time elapsed: 0.005 sec  <<< ERROR!
java.lang.NullPointerException


Results :

Tests in error: 
org.apache.phoenix.pherf.DataIngestIT.org.apache.phoenix.pherf.DataIngestIT
  Run 1: DataIngestIT>BaseHBaseManagedTimeIT.doSetup:57->BaseTest.setUpTestDriver:630->BaseTest.setUpTestDriver:634->BaseTest.checkClusterInitialized:565->BaseTest.setUpTestCluster:578->BaseTest.initMiniCluster:687
» Runtime
  Run 2: DataIngestIT>ResultBaseTestIT.tearDown:57 » NullPointer

org.apache.phoenix.pherf.PherfMainIT.org.apache.phoenix.pherf.PherfMainIT
  Run 1: PherfMainIT>BaseHBaseManagedTimeIT.doSetup:57->BaseTest.setUpTestDriver:630->BaseTest.setUpTestDriver:634->BaseTest.checkClusterInitialized:565->BaseTest.setUpTestCluster:578->BaseTest.initMiniCluster:687
» Runtime
  Run 2: PherfMainIT>ResultBaseTestIT.tearDown:57 » NullPointer


Tests run: 3, Failures: 0, Errors: 2, Skipped: 1

[INFO] 
[INFO] --- maven-failsafe-plugin:2.19.1:integration-test (HBaseManagedTimeTableReuseTest)
@ phoenix-pherf ---

-------------------------------------------------------
 T E S T S
-------------------------------------------------------

Results :

Tests run: 0, Failures: 0, Errors: 0, Skipped: 0

[INFO] 
[INFO] --- maven-failsafe-plugin:2.19.1:integration-test (NeedTheirOwnClusterTests) @ phoenix-pherf
---

-------------------------------------------------------
 T E S T S
-------------------------------------------------------

Results :

Tests run: 0, Failures: 0, Errors: 0, Skipped: 0

[INFO] 
[INFO] --- maven-failsafe-plugin:2.19.1:verify (ClientManagedTimeTests) @ phoenix-pherf ---
[INFO] ------------------------------------------------------------------------
[INFO] Reactor Summary:
[INFO] 
[INFO] Apache Phoenix .................................... SUCCESS [2.867s]
[INFO] Phoenix Core ...................................... SUCCESS [38:42.122s]
[INFO] Phoenix - Flume ................................... SUCCESS [1:04.299s]
[INFO] Phoenix - Pig ..................................... SUCCESS [1:27.121s]
[INFO] Phoenix Query Server Client ....................... SUCCESS [2.660s]
[INFO] Phoenix Query Server .............................. SUCCESS [1:35.991s]
[INFO] Phoenix - Pherf ................................... FAILURE [22.502s]
[INFO] Phoenix - Spark ................................... SKIPPED
[INFO] Phoenix - Hive .................................... SKIPPED
[INFO] Phoenix Assembly .................................. SKIPPED
[INFO] Phoenix - Tracing Web Application ................. SKIPPED
[INFO] ------------------------------------------------------------------------
[INFO] BUILD FAILURE
[INFO] ------------------------------------------------------------------------
[INFO] Total time: 43:18.196s
[INFO] Finished at: Fri May 20 07:48:26 UTC 2016
[INFO] Final Memory: 92M/887M
[INFO] ------------------------------------------------------------------------
[ERROR] Failed to execute goal org.apache.maven.plugins:maven-failsafe-plugin:2.19.1:verify
(ClientManagedTimeTests) on project phoenix-pherf: There are test failures.
[ERROR] 
[ERROR] Please refer to <https://builds.apache.org/job/Phoenix-4.x-HBase-1.0/ws/phoenix-pherf/target/failsafe-reports>
for the individual test results.
[ERROR] -> [Help 1]
[ERROR] 
[ERROR] To see the full stack trace of the errors, re-run Maven with the -e switch.
[ERROR] Re-run Maven using the -X switch to enable full debug logging.
[ERROR] 
[ERROR] For more information about the errors and possible solutions, please read the following
articles:
[ERROR] [Help 1] http://cwiki.apache.org/confluence/display/MAVEN/MojoFailureException
[ERROR] 
[ERROR] After correcting the problems, you can resume the build with the command
[ERROR]   mvn <goals> -rf :phoenix-pherf
Build step 'Invoke top-level Maven targets' marked build as failure
Archiving artifacts
Compressed 1.45 GB of artifacts by 26.6% relative to #472
Recording test results

Mime
View raw message