phoenix-commits mailing list archives

Site index · List index
Message view « Date » · « Thread »
Top « Date » · « Thread »
From Apache Jenkins Server <jenk...@builds.apache.org>
Subject Build failed in Jenkins: Phoenix-4.x-HBase-1.1 #8
Date Fri, 29 Apr 2016 20:56:24 GMT
See <https://builds.apache.org/job/Phoenix-4.x-HBase-1.1/8/changes>

Changes:

[tdsilva] PHOENIX-2852 Dropping columns could trigger upgrade code on server side

[tdsilva] PHOENIX-2795 Support auto partition for views

------------------------------------------
[...truncated 237 lines...]
Tests run: 2, Failures: 0, Errors: 0, Skipped: 0, Time elapsed: 0.055 sec - in org.apache.phoenix.mapreduce.CsvToKeyValueMapperTest
Running org.apache.phoenix.mapreduce.bulkload.TestTableRowkeyPair
Tests run: 1, Failures: 0, Errors: 0, Skipped: 0, Time elapsed: 0.011 sec - in org.apache.phoenix.mapreduce.bulkload.TestTableRowkeyPair
Running org.apache.phoenix.mapreduce.FormatToBytesWritableMapperTest
Tests run: 5, Failures: 0, Errors: 0, Skipped: 0, Time elapsed: 0.433 sec - in org.apache.phoenix.mapreduce.CsvBulkImportUtilTest
Running org.apache.phoenix.mapreduce.util.ColumnInfoToStringEncoderDecoderTest
Tests run: 5, Failures: 0, Errors: 0, Skipped: 0, Time elapsed: 0.215 sec - in org.apache.phoenix.mapreduce.FormatToBytesWritableMapperTest
Running org.apache.phoenix.mapreduce.util.PhoenixConfigurationUtilTest
Tests run: 2, Failures: 0, Errors: 0, Skipped: 0, Time elapsed: 0.285 sec - in org.apache.phoenix.mapreduce.util.ColumnInfoToStringEncoderDecoderTest
Running org.apache.phoenix.compile.QueryMetaDataTest
Tests run: 33, Failures: 0, Errors: 0, Skipped: 0, Time elapsed: 0.483 sec - in org.apache.phoenix.compile.QueryMetaDataTest
Running org.apache.phoenix.compile.JoinQueryCompilerTest
Tests run: 9, Failures: 0, Errors: 0, Skipped: 0, Time elapsed: 0.845 sec - in org.apache.phoenix.mapreduce.util.PhoenixConfigurationUtilTest
Running org.apache.phoenix.compile.WhereOptimizerTest
Tests run: 2, Failures: 0, Errors: 0, Skipped: 0, Time elapsed: 8.587 sec - in org.apache.phoenix.query.ScannerLeaseRenewalTest
Running org.apache.phoenix.compile.ScanRangesTest
Tests run: 34, Failures: 0, Errors: 0, Skipped: 0, Time elapsed: 0.177 sec - in org.apache.phoenix.compile.ScanRangesTest
Running org.apache.phoenix.compile.ViewCompilerTest
Tests run: 2, Failures: 0, Errors: 0, Skipped: 0, Time elapsed: 0.441 sec - in org.apache.phoenix.compile.JoinQueryCompilerTest
Running org.apache.phoenix.compile.LimitCompilerTest
Tests run: 6, Failures: 0, Errors: 0, Skipped: 0, Time elapsed: 0.468 sec - in org.apache.phoenix.compile.LimitCompilerTest
Running org.apache.phoenix.compile.WhereCompilerTest
Tests run: 103, Failures: 0, Errors: 0, Skipped: 0, Time elapsed: 1.406 sec - in org.apache.phoenix.compile.WhereOptimizerTest
Running org.apache.phoenix.compile.QueryOptimizerTest
Tests run: 3, Failures: 0, Errors: 0, Skipped: 0, Time elapsed: 1.283 sec - in org.apache.phoenix.compile.ViewCompilerTest
Running org.apache.phoenix.compile.StatementHintsCompilationTest
Tests run: 45, Failures: 0, Errors: 0, Skipped: 1, Time elapsed: 0.748 sec - in org.apache.phoenix.compile.WhereCompilerTest
Running org.apache.phoenix.compile.QueryCompilerTest
Tests run: 4, Failures: 0, Errors: 0, Skipped: 0, Time elapsed: 0.882 sec - in org.apache.phoenix.compile.StatementHintsCompilationTest
Running org.apache.phoenix.compile.TenantSpecificViewIndexCompileTest
Tests run: 119, Failures: 0, Errors: 0, Skipped: 0, Time elapsed: 1.519 sec - in org.apache.phoenix.compile.QueryCompilerTest
Running org.apache.phoenix.compile.ScanRangesIntersectTest
Tests run: 1, Failures: 0, Errors: 0, Skipped: 0, Time elapsed: 0.002 sec - in org.apache.phoenix.compile.ScanRangesIntersectTest
Running org.apache.phoenix.compile.HavingCompilerTest
Tests run: 40, Failures: 0, Errors: 0, Skipped: 0, Time elapsed: 1.92 sec - in org.apache.phoenix.compile.QueryOptimizerTest
Running org.apache.phoenix.compile.SelectStatementRewriterTest
Tests run: 11, Failures: 0, Errors: 0, Skipped: 0, Time elapsed: 0.358 sec - in org.apache.phoenix.compile.HavingCompilerTest
Running org.apache.phoenix.execute.CorrelatePlanTest
Tests run: 6, Failures: 0, Errors: 0, Skipped: 0, Time elapsed: 0.046 sec - in org.apache.phoenix.execute.CorrelatePlanTest
Running org.apache.phoenix.execute.MutationStateTest
Tests run: 1, Failures: 0, Errors: 0, Skipped: 0, Time elapsed: 0.001 sec - in org.apache.phoenix.execute.MutationStateTest
Running org.apache.phoenix.execute.LiteralResultIteratorPlanTest
Tests run: 3, Failures: 0, Errors: 0, Skipped: 0, Time elapsed: 0.008 sec - in org.apache.phoenix.execute.LiteralResultIteratorPlanTest
Running org.apache.phoenix.execute.DescVarLengthFastByteComparisonsTest
Tests run: 2, Failures: 0, Errors: 0, Skipped: 0, Time elapsed: 0.006 sec - in org.apache.phoenix.execute.DescVarLengthFastByteComparisonsTest
Running org.apache.phoenix.execute.UnnestArrayPlanTest
Tests run: 6, Failures: 0, Errors: 0, Skipped: 0, Time elapsed: 0.014 sec - in org.apache.phoenix.execute.UnnestArrayPlanTest
Running org.apache.phoenix.schema.types.PDateArrayToStringTest
Tests run: 6, Failures: 0, Errors: 0, Skipped: 0, Time elapsed: 0.009 sec - in org.apache.phoenix.schema.types.PDateArrayToStringTest
Running org.apache.phoenix.schema.types.PrimitiveDoublePhoenixArrayToStringTest
Tests run: 6, Failures: 0, Errors: 0, Skipped: 0, Time elapsed: 0.005 sec - in org.apache.phoenix.schema.types.PrimitiveDoublePhoenixArrayToStringTest
Running org.apache.phoenix.schema.types.PDataTypeForArraysTest
Tests run: 5, Failures: 0, Errors: 0, Skipped: 0, Time elapsed: 0.26 sec - in org.apache.phoenix.compile.SelectStatementRewriterTest
Running org.apache.phoenix.schema.types.PrimitiveFloatPhoenixArrayToStringTest
Tests run: 68, Failures: 0, Errors: 0, Skipped: 0, Time elapsed: 0.078 sec - in org.apache.phoenix.schema.types.PDataTypeForArraysTest
Running org.apache.phoenix.schema.types.PrimitiveBytePhoenixArrayToStringTest
Tests run: 6, Failures: 0, Errors: 0, Skipped: 0, Time elapsed: 0.005 sec - in org.apache.phoenix.schema.types.PrimitiveBytePhoenixArrayToStringTest
Running org.apache.phoenix.schema.types.PrimitiveIntPhoenixArrayToStringTest
Tests run: 6, Failures: 0, Errors: 0, Skipped: 0, Time elapsed: 0.005 sec - in org.apache.phoenix.schema.types.PrimitiveIntPhoenixArrayToStringTest
Running org.apache.phoenix.schema.types.PrimitiveLongPhoenixArrayToStringTest
Tests run: 6, Failures: 0, Errors: 0, Skipped: 0, Time elapsed: 0.027 sec - in org.apache.phoenix.schema.types.PrimitiveFloatPhoenixArrayToStringTest
Running org.apache.phoenix.schema.types.PrimitiveShortPhoenixArrayToStringTest
Tests run: 6, Failures: 0, Errors: 0, Skipped: 0, Time elapsed: 0.005 sec - in org.apache.phoenix.schema.types.PrimitiveLongPhoenixArrayToStringTest
Running org.apache.phoenix.schema.types.PDataTypeTest
Tests run: 6, Failures: 0, Errors: 0, Skipped: 0, Time elapsed: 0.012 sec - in org.apache.phoenix.schema.types.PrimitiveShortPhoenixArrayToStringTest
Running org.apache.phoenix.schema.types.PVarcharArrayToStringTest
Tests run: 8, Failures: 0, Errors: 0, Skipped: 0, Time elapsed: 0.009 sec - in org.apache.phoenix.schema.types.PVarcharArrayToStringTest
Running org.apache.phoenix.schema.types.PrimitiveBooleanPhoenixArrayToStringTest
Tests run: 6, Failures: 0, Errors: 0, Skipped: 0, Time elapsed: 0.008 sec - in org.apache.phoenix.schema.types.PrimitiveBooleanPhoenixArrayToStringTest
Running org.apache.phoenix.schema.SaltingUtilTest
Tests run: 2, Failures: 0, Errors: 0, Skipped: 0, Time elapsed: 0.004 sec - in org.apache.phoenix.schema.SaltingUtilTest
Running org.apache.phoenix.schema.RowKeySchemaTest
Tests run: 6, Failures: 0, Errors: 0, Skipped: 0, Time elapsed: 1.347 sec - in org.apache.phoenix.compile.TenantSpecificViewIndexCompileTest
Running org.apache.phoenix.schema.SortOrderTest
Tests run: 8, Failures: 0, Errors: 0, Skipped: 0, Time elapsed: 0.018 sec - in org.apache.phoenix.schema.SortOrderTest
Running org.apache.phoenix.schema.RowKeyValueAccessorTest
Tests run: 34, Failures: 0, Errors: 0, Skipped: 0, Time elapsed: 0.113 sec - in org.apache.phoenix.schema.types.PDataTypeTest
Running org.apache.phoenix.schema.PCharPadTest
Tests run: 9, Failures: 0, Errors: 0, Skipped: 0, Time elapsed: 0.006 sec - in org.apache.phoenix.schema.PCharPadTest
Running org.apache.phoenix.schema.MutationTest
Tests run: 6, Failures: 0, Errors: 0, Skipped: 0, Time elapsed: 0.33 sec - in org.apache.phoenix.schema.RowKeySchemaTest
Running org.apache.phoenix.schema.SchemaUtilTest
Tests run: 6, Failures: 0, Errors: 0, Skipped: 0, Time elapsed: 0.003 sec - in org.apache.phoenix.schema.SchemaUtilTest
Running org.apache.phoenix.schema.ValueBitSetTest
Tests run: 4, Failures: 0, Errors: 0, Skipped: 0, Time elapsed: 0.008 sec - in org.apache.phoenix.schema.ValueBitSetTest
Running org.apache.phoenix.schema.PMetaDataImplTest
Tests run: 5, Failures: 0, Errors: 0, Skipped: 0, Time elapsed: 0.009 sec - in org.apache.phoenix.schema.PMetaDataImplTest
Running org.apache.phoenix.schema.SequenceAllocationTest
Tests run: 1, Failures: 0, Errors: 0, Skipped: 0, Time elapsed: 0.272 sec - in org.apache.phoenix.schema.MutationTest
Running org.apache.phoenix.memory.MemoryManagerTest
Tests run: 2, Failures: 0, Errors: 0, Skipped: 0, Time elapsed: 0.003 sec - in org.apache.phoenix.schema.SequenceAllocationTest
Running org.apache.phoenix.expression.OctetLengthFunctionTest
Tests run: 1, Failures: 0, Errors: 0, Skipped: 0, Time elapsed: 0.041 sec - in org.apache.phoenix.expression.OctetLengthFunctionTest
Running org.apache.phoenix.expression.ArrayAppendFunctionTest
Tests run: 1, Failures: 0, Errors: 0, Skipped: 0, Time elapsed: 0.381 sec - in org.apache.phoenix.schema.RowKeyValueAccessorTest
Running org.apache.phoenix.expression.PowerFunctionTest
Tests run: 1, Failures: 0, Errors: 0, Skipped: 0, Time elapsed: 0.046 sec - in org.apache.phoenix.expression.PowerFunctionTest
Running org.apache.phoenix.expression.RoundFloorCeilExpressionsTest
Tests run: 25, Failures: 0, Errors: 0, Skipped: 0, Time elapsed: 0.977 sec - in org.apache.phoenix.expression.ArrayAppendFunctionTest
Running org.apache.phoenix.expression.StringToArrayFunctionTest
Tests run: 20, Failures: 0, Errors: 0, Skipped: 0, Time elapsed: 0.02 sec - in org.apache.phoenix.expression.StringToArrayFunctionTest
Running org.apache.phoenix.expression.LnLogFunctionTest
Tests run: 1, Failures: 0, Errors: 0, Skipped: 0, Time elapsed: 0.044 sec - in org.apache.phoenix.expression.LnLogFunctionTest
Running org.apache.phoenix.expression.RegexpSplitFunctionTest
Tests run: 22, Failures: 0, Errors: 0, Skipped: 0, Time elapsed: 1.051 sec - in org.apache.phoenix.expression.RoundFloorCeilExpressionsTest
Running org.apache.phoenix.expression.RegexpSubstrFunctionTest
Tests run: 6, Failures: 0, Errors: 1, Skipped: 2, Time elapsed: 1.2 sec <<< FAILURE!
- in org.apache.phoenix.memory.MemoryManagerTest
testWaitUntilResize(org.apache.phoenix.memory.MemoryManagerTest)  Time elapsed: 1.122 sec
 <<< ERROR!
org.apache.phoenix.memory.InsufficientMemoryException: Requested memory of 100 bytes could
not be allocated. Using memory of 60 bytes from global pool of 100 bytes after waiting for
80ms.
	at org.apache.phoenix.memory.MemoryManagerTest.testWaitUntilResize(MemoryManagerTest.java:209)

Running org.apache.phoenix.expression.DeterminismTest
Tests run: 1, Failures: 0, Errors: 0, Skipped: 0, Time elapsed: 0.001 sec - in org.apache.phoenix.expression.DeterminismTest
Running org.apache.phoenix.expression.CbrtFunctionTest
Tests run: 1, Failures: 0, Errors: 0, Skipped: 0, Time elapsed: 0.006 sec - in org.apache.phoenix.expression.CbrtFunctionTest
Running org.apache.phoenix.expression.ArrayConcatFunctionTest
Tests run: 1, Failures: 0, Errors: 0, Skipped: 0, Time elapsed: 0.159 sec - in org.apache.phoenix.expression.RegexpSubstrFunctionTest
Running org.apache.phoenix.expression.ArrayFillFunctionTest
Tests run: 1, Failures: 0, Errors: 0, Skipped: 0, Time elapsed: 0.242 sec - in org.apache.phoenix.expression.RegexpSplitFunctionTest
Running org.apache.phoenix.expression.LikeExpressionTest
Tests run: 4, Failures: 0, Errors: 0, Skipped: 0, Time elapsed: 0.012 sec - in org.apache.phoenix.expression.LikeExpressionTest
Running org.apache.phoenix.expression.ArrayToStringFunctionTest
Tests run: 14, Failures: 0, Errors: 0, Skipped: 0, Time elapsed: 0.027 sec - in org.apache.phoenix.expression.ArrayFillFunctionTest
Running org.apache.phoenix.expression.CoerceExpressionTest
Tests run: 5, Failures: 0, Errors: 0, Skipped: 0, Time elapsed: 0.015 sec - in org.apache.phoenix.expression.CoerceExpressionTest
Running org.apache.phoenix.expression.SqrtFunctionTest
Tests run: 1, Failures: 0, Errors: 0, Skipped: 0, Time elapsed: 0.011 sec - in org.apache.phoenix.expression.SqrtFunctionTest
Running org.apache.phoenix.expression.ExpFunctionTest
Tests run: 24, Failures: 0, Errors: 0, Skipped: 0, Time elapsed: 0.019 sec - in org.apache.phoenix.expression.ArrayToStringFunctionTest
Running org.apache.phoenix.expression.ArrayPrependFunctionTest
Tests run: 1, Failures: 0, Errors: 0, Skipped: 0, Time elapsed: 0.041 sec - in org.apache.phoenix.expression.ExpFunctionTest
Running org.apache.phoenix.expression.SortOrderExpressionTest
Tests run: 24, Failures: 0, Errors: 0, Skipped: 0, Time elapsed: 0.04 sec - in org.apache.phoenix.expression.SortOrderExpressionTest
Running org.apache.phoenix.expression.AbsFunctionTest
Tests run: 1, Failures: 0, Errors: 0, Skipped: 0, Time elapsed: 0.034 sec - in org.apache.phoenix.expression.AbsFunctionTest
Running org.apache.phoenix.expression.ILikeExpressionTest
Tests run: 3, Failures: 0, Errors: 0, Skipped: 0, Time elapsed: 0.035 sec - in org.apache.phoenix.expression.ILikeExpressionTest
Running org.apache.phoenix.expression.ArithmeticOperationTest
Tests run: 37, Failures: 0, Errors: 0, Skipped: 0, Time elapsed: 0.192 sec - in org.apache.phoenix.expression.ArrayPrependFunctionTest
Running org.apache.phoenix.expression.util.regex.PatternPerformanceTest
Tests run: 1, Failures: 0, Errors: 0, Skipped: 0, Time elapsed: 0.003 sec - in org.apache.phoenix.expression.util.regex.PatternPerformanceTest
Tests run: 6, Failures: 0, Errors: 0, Skipped: 0, Time elapsed: 0.033 sec - in org.apache.phoenix.expression.ArithmeticOperationTest
Running org.apache.phoenix.expression.NullValueTest
Running org.apache.phoenix.expression.SignFunctionTest
Tests run: 1, Failures: 0, Errors: 0, Skipped: 0, Time elapsed: 0.011 sec - in org.apache.phoenix.expression.SignFunctionTest
Running org.apache.phoenix.expression.ColumnExpressionTest
Tests run: 4, Failures: 0, Errors: 0, Skipped: 0, Time elapsed: 0.005 sec - in org.apache.phoenix.expression.ColumnExpressionTest
Running org.apache.phoenix.expression.GetSetByteBitFunctionTest
Tests run: 3, Failures: 0, Errors: 0, Skipped: 0, Time elapsed: 0.207 sec - in org.apache.phoenix.expression.NullValueTest
Running org.apache.phoenix.expression.RegexpReplaceFunctionTest
Tests run: 1, Failures: 0, Errors: 0, Skipped: 0, Time elapsed: 0.012 sec - in org.apache.phoenix.expression.RegexpReplaceFunctionTest
Running org.apache.phoenix.expression.function.InstrFunctionTest
Tests run: 1, Failures: 0, Errors: 0, Skipped: 0, Time elapsed: 0.005 sec - in org.apache.phoenix.expression.function.InstrFunctionTest
Running org.apache.phoenix.expression.function.BuiltinFunctionConstructorTest
Tests run: 2, Failures: 0, Errors: 0, Skipped: 0, Time elapsed: 0.055 sec - in org.apache.phoenix.expression.function.BuiltinFunctionConstructorTest
Running org.apache.phoenix.expression.function.ExternalSqlTypeIdFunctionTest
Tests run: 3, Failures: 0, Errors: 0, Skipped: 0, Time elapsed: 0.002 sec - in org.apache.phoenix.expression.function.ExternalSqlTypeIdFunctionTest
Running org.apache.phoenix.util.csv.CsvUpsertExecutorTest
Tests run: 6, Failures: 0, Errors: 0, Skipped: 0, Time elapsed: 0.45 sec - in org.apache.phoenix.util.csv.CsvUpsertExecutorTest
Running org.apache.phoenix.util.csv.StringToArrayConverterTest
Tests run: 35, Failures: 0, Errors: 0, Skipped: 0, Time elapsed: 1.183 sec - in org.apache.phoenix.expression.ArrayConcatFunctionTest
Running org.apache.phoenix.util.PrefixByteEncoderDecoderTest
Tests run: 3, Failures: 0, Errors: 0, Skipped: 0, Time elapsed: 0.007 sec - in org.apache.phoenix.util.PrefixByteEncoderDecoderTest
Running org.apache.phoenix.util.SequenceUtilTest
Tests run: 18, Failures: 0, Errors: 0, Skipped: 0, Time elapsed: 0.031 sec - in org.apache.phoenix.util.SequenceUtilTest
Running org.apache.phoenix.util.Base62EncoderTest
Tests run: 1, Failures: 0, Errors: 0, Skipped: 0, Time elapsed: 0.03 sec - in org.apache.phoenix.util.Base62EncoderTest
Running org.apache.phoenix.util.PhoenixEncodeDecodeTest
Tests run: 2, Failures: 0, Errors: 0, Skipped: 0, Time elapsed: 0.98 sec - in org.apache.phoenix.expression.GetSetByteBitFunctionTest
Running org.apache.phoenix.util.ByteUtilTest
Tests run: 4, Failures: 0, Errors: 0, Skipped: 0, Time elapsed: 0.259 sec - in org.apache.phoenix.util.csv.StringToArrayConverterTest
Running org.apache.phoenix.util.DateUtilTest
Tests run: 18, Failures: 0, Errors: 0, Skipped: 0, Time elapsed: 0.015 sec - in org.apache.phoenix.util.DateUtilTest
Running org.apache.phoenix.util.PhoenixRuntimeTest
Tests run: 3, Failures: 0, Errors: 0, Skipped: 0, Time elapsed: 0.046 sec - in org.apache.phoenix.util.ByteUtilTest
Running org.apache.phoenix.util.ScanUtilTest
Tests run: 20, Failures: 0, Errors: 0, Skipped: 0, Time elapsed: 0.037 sec - in org.apache.phoenix.util.ScanUtilTest
Running org.apache.phoenix.util.TenantIdByteConversionTest
Tests run: 4, Failures: 0, Errors: 0, Skipped: 0, Time elapsed: 0.202 sec - in org.apache.phoenix.util.PhoenixEncodeDecodeTest
Running org.apache.phoenix.util.JDBCUtilTest
Tests run: 12, Failures: 0, Errors: 0, Skipped: 0, Time elapsed: 0.006 sec - in org.apache.phoenix.util.JDBCUtilTest
Running org.apache.phoenix.util.ColumnInfoTest
Tests run: 18, Failures: 0, Errors: 0, Skipped: 0, Time elapsed: 0.026 sec - in org.apache.phoenix.util.TenantIdByteConversionTest
Running org.apache.phoenix.util.LogUtilTest
Tests run: 5, Failures: 0, Errors: 0, Skipped: 0, Time elapsed: 0.017 sec - in org.apache.phoenix.util.ColumnInfoTest
Running org.apache.phoenix.util.LikeExpressionTest
Tests run: 1, Failures: 0, Errors: 0, Skipped: 0, Time elapsed: 0.002 sec - in org.apache.phoenix.util.LikeExpressionTest
Running org.apache.phoenix.util.PhoenixContextExecutorTest
Tests run: 1, Failures: 0, Errors: 0, Skipped: 0, Time elapsed: 0.004 sec - in org.apache.phoenix.util.PhoenixContextExecutorTest
Running org.apache.phoenix.util.StringUtilTest
Tests run: 5, Failures: 0, Errors: 0, Skipped: 0, Time elapsed: 0.004 sec - in org.apache.phoenix.util.StringUtilTest
Running org.apache.phoenix.util.IndexUtilTest
Tests run: 2, Failures: 0, Errors: 0, Skipped: 0, Time elapsed: 0.003 sec - in org.apache.phoenix.util.IndexUtilTest
Running org.apache.phoenix.util.json.JsonUpsertExecutorTest
Tests run: 3, Failures: 0, Errors: 0, Skipped: 0, Time elapsed: 0.103 sec - in org.apache.phoenix.util.LogUtilTest
Running org.apache.phoenix.util.QueryUtilTest
Tests run: 9, Failures: 0, Errors: 0, Skipped: 0, Time elapsed: 0.027 sec - in org.apache.phoenix.util.QueryUtilTest
Running org.apache.phoenix.util.MetaDataUtilTest
Tests run: 3, Failures: 0, Errors: 0, Skipped: 0, Time elapsed: 0.01 sec - in org.apache.phoenix.util.MetaDataUtilTest
Running org.apache.phoenix.util.PropertiesUtilTest
Tests run: 3, Failures: 0, Errors: 0, Skipped: 0, Time elapsed: 0.03 sec - in org.apache.phoenix.util.PropertiesUtilTest
Tests run: 5, Failures: 0, Errors: 0, Skipped: 0, Time elapsed: 0.276 sec - in org.apache.phoenix.util.json.JsonUpsertExecutorTest
Tests run: 11, Failures: 0, Errors: 0, Skipped: 0, Time elapsed: 0.59 sec - in org.apache.phoenix.util.PhoenixRuntimeTest

Results :

Tests in error: 
  MemoryManagerTest.testWaitUntilResize:209 ยป InsufficientMemory Requested memor...

Tests run: 1344, Failures: 0, Errors: 1, Skipped: 4

[INFO] ------------------------------------------------------------------------
[INFO] Reactor Summary:
[INFO] 
[INFO] Apache Phoenix .................................... SUCCESS [5.295s]
[INFO] Phoenix Core ...................................... FAILURE [1:18.619s]
[INFO] Phoenix - Flume ................................... SKIPPED
[INFO] Phoenix - Pig ..................................... SKIPPED
[INFO] Phoenix Query Server Client ....................... SKIPPED
[INFO] Phoenix Query Server .............................. SKIPPED
[INFO] Phoenix - Pherf ................................... SKIPPED
[INFO] Phoenix - Spark ................................... SKIPPED
[INFO] Phoenix - Hive .................................... SKIPPED
[INFO] Phoenix Assembly .................................. SKIPPED
[INFO] Phoenix - Tracing Web Application ................. SKIPPED
[INFO] ------------------------------------------------------------------------
[INFO] BUILD FAILURE
[INFO] ------------------------------------------------------------------------
[INFO] Total time: 1:25.162s
[INFO] Finished at: Fri Apr 29 20:56:26 UTC 2016
[INFO] Final Memory: 73M/1396M
[INFO] ------------------------------------------------------------------------
[ERROR] Failed to execute goal org.apache.maven.plugins:maven-surefire-plugin:2.19.1:test
(default-test) on project phoenix-core: There are test failures.
[ERROR] 
[ERROR] Please refer to <https://builds.apache.org/job/Phoenix-4.x-HBase-1.1/ws/phoenix-core/target/surefire-reports>
for the individual test results.
[ERROR] -> [Help 1]
[ERROR] 
[ERROR] To see the full stack trace of the errors, re-run Maven with the -e switch.
[ERROR] Re-run Maven using the -X switch to enable full debug logging.
[ERROR] 
[ERROR] For more information about the errors and possible solutions, please read the following
articles:
[ERROR] [Help 1] http://cwiki.apache.org/confluence/display/MAVEN/MojoFailureException
[ERROR] 
[ERROR] After correcting the problems, you can resume the build with the command
[ERROR]   mvn <goals> -rf :phoenix-core
Build step 'Invoke top-level Maven targets' marked build as failure
Archiving artifacts
No prior successful build to compare, so performing full copy of artifacts
Recording test results

Mime
View raw message