phoenix-commits mailing list archives

Site index · List index
Message view « Date » · « Thread »
Top « Date » · « Thread »
From Apache Jenkins Server <jenk...@builds.apache.org>
Subject Build failed in Jenkins: Phoenix | Master #1204
Date Thu, 28 Apr 2016 00:37:56 GMT
See <https://builds.apache.org/job/Phoenix-master/1204/changes>

Changes:

[tdsilva] PHOENIX-2852 Dropping columns could trigger upgrade code on server side

------------------------------------------
[...truncated 703 lines...]
Running org.apache.phoenix.end2end.index.txn.RollbackIT
Tests run: 62, Failures: 0, Errors: 0, Skipped: 0, Time elapsed: 516.385 sec - in org.apache.phoenix.end2end.index.IndexExpressionIT
Running org.apache.phoenix.iterate.RoundRobinResultIteratorIT
Tests run: 6, Failures: 0, Errors: 0, Skipped: 0, Time elapsed: 129.836 sec - in org.apache.phoenix.end2end.index.txn.MutableRollbackIT
Running org.apache.phoenix.rpc.UpdateCacheIT
Tests run: 8, Failures: 0, Errors: 0, Skipped: 0, Time elapsed: 84.587 sec - in org.apache.phoenix.end2end.index.txn.RollbackIT
Running org.apache.phoenix.trace.PhoenixTableMetricsWriterIT
Tests run: 2, Failures: 0, Errors: 0, Skipped: 0, Time elapsed: 4.972 sec - in org.apache.phoenix.trace.PhoenixTableMetricsWriterIT
Running org.apache.phoenix.trace.PhoenixTraceReaderIT
Tests run: 2, Failures: 0, Errors: 0, Skipped: 0, Time elapsed: 0.455 sec - in org.apache.phoenix.trace.PhoenixTraceReaderIT
Running org.apache.phoenix.trace.PhoenixTracingEndToEndIT
Tests run: 7, Failures: 0, Errors: 0, Skipped: 0, Time elapsed: 43.532 sec - in org.apache.phoenix.rpc.UpdateCacheIT
Running org.apache.phoenix.tx.TransactionIT
Tests run: 9, Failures: 0, Errors: 0, Skipped: 0, Time elapsed: 178.924 sec - in org.apache.phoenix.iterate.RoundRobinResultIteratorIT
Running org.apache.phoenix.tx.TxCheckpointIT
Tests run: 6, Failures: 0, Errors: 0, Skipped: 0, Time elapsed: 95.351 sec - in org.apache.phoenix.trace.PhoenixTracingEndToEndIT
Tests run: 128, Failures: 0, Errors: 0, Skipped: 0, Time elapsed: 885.583 sec - in org.apache.phoenix.end2end.index.IndexIT
Tests run: 16, Failures: 0, Errors: 0, Skipped: 0, Time elapsed: 227.168 sec - in org.apache.phoenix.tx.TxCheckpointIT
Tests run: 20, Failures: 0, Errors: 0, Skipped: 1, Time elapsed: 344.358 sec - in org.apache.phoenix.tx.TransactionIT
Tests run: 40, Failures: 0, Errors: 0, Skipped: 0, Time elapsed: 1,042.749 sec - in org.apache.phoenix.end2end.index.LocalIndexIT

Results :

Tests run: 1092, Failures: 0, Errors: 0, Skipped: 5

[INFO] 
[INFO] --- maven-failsafe-plugin:2.19.1:integration-test (HBaseManagedTimeTableReuseTest)
@ phoenix-core ---

-------------------------------------------------------
 T E S T S
-------------------------------------------------------
Running org.apache.phoenix.end2end.ArithmeticQueryIT
Running org.apache.phoenix.end2end.AbsFunctionEnd2EndIT
Running org.apache.phoenix.end2end.ArrayFillFunctionIT
Running org.apache.phoenix.end2end.ArrayToStringFunctionIT
Tests run: 1, Failures: 0, Errors: 0, Skipped: 0, Time elapsed: 3.22 sec - in org.apache.phoenix.end2end.AbsFunctionEnd2EndIT
Running org.apache.phoenix.end2end.ArraysWithNullsIT
Running org.apache.phoenix.end2end.AlterSessionIT
Tests run: 2, Failures: 0, Errors: 0, Skipped: 0, Time elapsed: 0.203 sec - in org.apache.phoenix.end2end.AlterSessionIT
Running org.apache.phoenix.end2end.AutoCommitIT
Tests run: 1, Failures: 0, Errors: 0, Skipped: 0, Time elapsed: 2.618 sec - in org.apache.phoenix.end2end.AutoCommitIT
Running org.apache.phoenix.end2end.CbrtFunctionEnd2EndIT
Tests run: 2, Failures: 0, Errors: 0, Skipped: 0, Time elapsed: 0.607 sec - in org.apache.phoenix.end2end.CbrtFunctionEnd2EndIT
Running org.apache.phoenix.end2end.ConvertTimezoneFunctionIT
Tests run: 26, Failures: 0, Errors: 0, Skipped: 0, Time elapsed: 30.178 sec - in org.apache.phoenix.end2end.ArrayFillFunctionIT
Running org.apache.phoenix.end2end.DecodeFunctionIT
Tests run: 36, Failures: 0, Errors: 0, Skipped: 0, Time elapsed: 39.167 sec - in org.apache.phoenix.end2end.ArrayToStringFunctionIT
Tests run: 7, Failures: 0, Errors: 0, Skipped: 0, Time elapsed: 26.985 sec - in org.apache.phoenix.end2end.ConvertTimezoneFunctionIT
Running org.apache.phoenix.end2end.DynamicFamilyIT
Running org.apache.phoenix.end2end.FirstValueFunctionIT
Tests run: 4, Failures: 0, Errors: 0, Skipped: 0, Time elapsed: 9.347 sec - in org.apache.phoenix.end2end.DynamicFamilyIT
Tests run: 6, Failures: 0, Errors: 0, Skipped: 0, Time elapsed: 28.03 sec - in org.apache.phoenix.end2end.DecodeFunctionIT
Running org.apache.phoenix.end2end.GetSetByteBitFunctionEnd2EndIT
Tests run: 1, Failures: 0, Errors: 0, Skipped: 0, Time elapsed: 0.205 sec - in org.apache.phoenix.end2end.GetSetByteBitFunctionEnd2EndIT
Running org.apache.phoenix.end2end.MD5FunctionIT
Running org.apache.phoenix.end2end.LikeExpressionIT
Tests run: 3, Failures: 0, Errors: 0, Skipped: 0, Time elapsed: 9.811 sec - in org.apache.phoenix.end2end.MD5FunctionIT
Tests run: 16, Failures: 0, Errors: 0, Skipped: 0, Time elapsed: 67.688 sec - in org.apache.phoenix.end2end.ArraysWithNullsIT
Running org.apache.phoenix.end2end.MinMaxAggregateFunctionIT
Running org.apache.phoenix.end2end.NthValueFunctionIT
Tests run: 3, Failures: 0, Errors: 0, Skipped: 0, Time elapsed: 7.102 sec - in org.apache.phoenix.end2end.LikeExpressionIT
Running org.apache.phoenix.end2end.OctetLengthFunctionEnd2EndIT
Tests run: 7, Failures: 0, Errors: 0, Skipped: 0, Time elapsed: 33.347 sec - in org.apache.phoenix.end2end.FirstValueFunctionIT
Tests run: 1, Failures: 0, Errors: 0, Skipped: 0, Time elapsed: 4.493 sec - in org.apache.phoenix.end2end.MinMaxAggregateFunctionIT
Tests run: 1, Failures: 0, Errors: 0, Skipped: 0, Time elapsed: 5.045 sec - in org.apache.phoenix.end2end.OctetLengthFunctionEnd2EndIT
Running org.apache.phoenix.end2end.QueryMoreIT
Running org.apache.phoenix.end2end.PrimitiveTypeIT
Tests run: 9, Failures: 0, Errors: 0, Skipped: 0, Time elapsed: 0.301 sec - in org.apache.phoenix.end2end.PrimitiveTypeIT
Running org.apache.phoenix.end2end.RTrimFunctionIT
Running org.apache.phoenix.end2end.PowerFunctionEnd2EndIT
Tests run: 1, Failures: 0, Errors: 0, Skipped: 0, Time elapsed: 0.775 sec - in org.apache.phoenix.end2end.PowerFunctionEnd2EndIT
Running org.apache.phoenix.end2end.ReadOnlyIT
Tests run: 2, Failures: 0, Errors: 0, Skipped: 0, Time elapsed: 7.014 sec - in org.apache.phoenix.end2end.RTrimFunctionIT
Running org.apache.phoenix.end2end.RegexpSplitFunctionIT
Tests run: 11, Failures: 0, Errors: 0, Skipped: 0, Time elapsed: 0.467 sec - in org.apache.phoenix.end2end.RegexpSplitFunctionIT
Running org.apache.phoenix.end2end.ReverseFunctionIT
Tests run: 26, Failures: 0, Errors: 0, Skipped: 0, Time elapsed: 96.454 sec - in org.apache.phoenix.end2end.ArithmeticQueryIT
Running org.apache.phoenix.end2end.RoundFloorCeilFunctionsEnd2EndIT
Tests run: 1, Failures: 0, Errors: 0, Skipped: 0, Time elapsed: 11.202 sec - in org.apache.phoenix.end2end.ReadOnlyIT
Running org.apache.phoenix.end2end.SerialIteratorsIT
Tests run: 1, Failures: 0, Errors: 0, Skipped: 0, Time elapsed: 4.607 sec - in org.apache.phoenix.end2end.SerialIteratorsIT
Running org.apache.phoenix.end2end.ServerExceptionIT
Tests run: 33, Failures: 0, Errors: 0, Skipped: 0, Time elapsed: 12.927 sec - in org.apache.phoenix.end2end.RoundFloorCeilFunctionsEnd2EndIT
Tests run: 1, Failures: 0, Errors: 0, Skipped: 0, Time elapsed: 5.104 sec - in org.apache.phoenix.end2end.ServerExceptionIT
Running org.apache.phoenix.end2end.SortOrderIT
Tests run: 5, Failures: 0, Errors: 0, Skipped: 0, Time elapsed: 18.412 sec - in org.apache.phoenix.end2end.ReverseFunctionIT
Running org.apache.phoenix.end2end.StatementHintsIT
Running org.apache.phoenix.end2end.SignFunctionEnd2EndIT
Tests run: 11, Failures: 0, Errors: 0, Skipped: 0, Time elapsed: 44.418 sec - in org.apache.phoenix.end2end.NthValueFunctionIT
Tests run: 2, Failures: 0, Errors: 0, Skipped: 0, Time elapsed: 0.589 sec - in org.apache.phoenix.end2end.SignFunctionEnd2EndIT
Tests run: 2, Failures: 0, Errors: 0, Skipped: 0, Time elapsed: 4.848 sec - in org.apache.phoenix.end2end.StatementHintsIT
Running org.apache.phoenix.end2end.TimezoneOffsetFunctionIT
Running org.apache.phoenix.end2end.StringToArrayFunctionIT
Running org.apache.phoenix.end2end.StoreNullsIT
Tests run: 6, Failures: 0, Errors: 0, Skipped: 0, Time elapsed: 64.056 sec - in org.apache.phoenix.end2end.QueryMoreIT
Running org.apache.phoenix.end2end.UpsertSelectAutoCommitIT
Tests run: 7, Failures: 0, Errors: 0, Skipped: 0, Time elapsed: 25.862 sec - in org.apache.phoenix.end2end.TimezoneOffsetFunctionIT
Tests run: 3, Failures: 0, Errors: 0, Skipped: 0, Time elapsed: 18.716 sec - in org.apache.phoenix.end2end.StoreNullsIT
Running org.apache.phoenix.end2end.salted.SaltedTableUpsertSelectIT
Running org.apache.phoenix.end2end.salted.SaltedTableVarLengthRowKeyIT
Tests run: 22, Failures: 0, Errors: 0, Skipped: 0, Time elapsed: 25.139 sec - in org.apache.phoenix.end2end.StringToArrayFunctionIT
Tests run: 1, Failures: 0, Errors: 0, Skipped: 0, Time elapsed: 4.895 sec - in org.apache.phoenix.end2end.salted.SaltedTableVarLengthRowKeyIT
Running org.apache.phoenix.iterate.PhoenixQueryTimeoutIT
Tests run: 2, Failures: 0, Errors: 0, Skipped: 0, Time elapsed: 0.187 sec - in org.apache.phoenix.iterate.PhoenixQueryTimeoutIT
Tests run: 3, Failures: 0, Errors: 0, Skipped: 0, Time elapsed: 20.258 sec - in org.apache.phoenix.end2end.UpsertSelectAutoCommitIT
Tests run: 6, Failures: 0, Errors: 0, Skipped: 0, Time elapsed: 57.822 sec - in org.apache.phoenix.end2end.salted.SaltedTableUpsertSelectIT
Tests run: 45, Failures: 0, Errors: 0, Skipped: 0, Time elapsed: 274.419 sec - in org.apache.phoenix.end2end.SortOrderIT

Results :

Tests run: 317, Failures: 0, Errors: 0, Skipped: 0

[INFO] 
[INFO] --- maven-failsafe-plugin:2.19.1:integration-test (NeedTheirOwnClusterTests) @ phoenix-core
---

-------------------------------------------------------
 T E S T S
-------------------------------------------------------
Running org.apache.hadoop.hbase.regionserver.wal.WALReplayWithIndexWritesAndUncompressedWALInHBase_094_9_IT
Running org.apache.hadoop.hbase.regionserver.wal.WALReplayWithIndexWritesAndCompressedWALIT
Tests run: 1, Failures: 0, Errors: 0, Skipped: 0, Time elapsed: 31.6 sec - in org.apache.hadoop.hbase.regionserver.wal.WALReplayWithIndexWritesAndUncompressedWALInHBase_094_9_IT
Tests run: 1, Failures: 0, Errors: 0, Skipped: 0, Time elapsed: 36.028 sec - in org.apache.hadoop.hbase.regionserver.wal.WALReplayWithIndexWritesAndCompressedWALIT
Running org.apache.phoenix.end2end.ConnectionUtilIT
Running org.apache.phoenix.coprocessor.StatisticsCollectionRunTrackerIT
Running org.apache.phoenix.end2end.AlterTableIT
Running org.apache.phoenix.end2end.CountDistinctCompressionIT
Tests run: 1, Failures: 0, Errors: 0, Skipped: 0, Time elapsed: 8.188 sec - in org.apache.phoenix.end2end.CountDistinctCompressionIT
Tests run: 4, Failures: 0, Errors: 0, Skipped: 0, Time elapsed: 38.568 sec - in org.apache.phoenix.coprocessor.StatisticsCollectionRunTrackerIT
Running org.apache.phoenix.end2end.ContextClassloaderIT
Tests run: 1, Failures: 0, Errors: 0, Skipped: 0, Time elapsed: 46.593 sec - in org.apache.phoenix.end2end.ConnectionUtilIT
Tests run: 3, Failures: 0, Errors: 0, Skipped: 0, Time elapsed: 11.454 sec - in org.apache.phoenix.end2end.ContextClassloaderIT
Running org.apache.phoenix.end2end.IndexToolIT
Running org.apache.phoenix.end2end.CsvBulkLoadToolIT
Running org.apache.phoenix.end2end.KeyOnlyIT
Running org.apache.phoenix.end2end.MultiCfQueryExecIT
Tests run: 3, Failures: 0, Errors: 0, Skipped: 0, Time elapsed: 18.302 sec - in org.apache.phoenix.end2end.KeyOnlyIT
Tests run: 9, Failures: 0, Errors: 0, Skipped: 0, Time elapsed: 35.501 sec - in org.apache.phoenix.end2end.MultiCfQueryExecIT
Running org.apache.phoenix.end2end.MutableIndexToolIT
Running org.apache.phoenix.end2end.ParallelIteratorsIT
Tests run: 3, Failures: 0, Errors: 0, Skipped: 0, Time elapsed: 66.399 sec - in org.apache.phoenix.end2end.ParallelIteratorsIT
Tests run: 1, Failures: 0, Errors: 0, Skipped: 0, Time elapsed: 119.711 sec - in org.apache.phoenix.end2end.MutableIndexToolIT
Running org.apache.phoenix.end2end.QueryWithLimitIT
Running org.apache.phoenix.end2end.QueryTimeoutIT
Tests run: 1, Failures: 0, Errors: 0, Skipped: 0, Time elapsed: 17.015 sec - in org.apache.phoenix.end2end.QueryTimeoutIT
Tests run: 2, Failures: 0, Errors: 0, Skipped: 0, Time elapsed: 31.964 sec - in org.apache.phoenix.end2end.QueryWithLimitIT
Running org.apache.phoenix.end2end.QueryWithOffsetIT
Running org.apache.phoenix.end2end.SaltedViewIT
Tests run: 8, Failures: 0, Errors: 0, Skipped: 0, Time elapsed: 27.434 sec - in org.apache.phoenix.end2end.QueryWithOffsetIT
Running org.apache.phoenix.end2end.SpillableGroupByIT
Tests run: 4, Failures: 0, Errors: 0, Skipped: 0, Time elapsed: 65.216 sec - in org.apache.phoenix.end2end.SaltedViewIT
Tests run: 1, Failures: 0, Errors: 0, Skipped: 0, Time elapsed: 14.938 sec - in org.apache.phoenix.end2end.SpillableGroupByIT
Running org.apache.phoenix.end2end.StatsCollectorIT
Running org.apache.phoenix.end2end.StatsCollectionDisabledIT
Tests run: 1, Failures: 0, Errors: 0, Skipped: 0, Time elapsed: 9.129 sec - in org.apache.phoenix.end2end.StatsCollectionDisabledIT
Tests run: 56, Failures: 0, Errors: 0, Skipped: 0, Time elapsed: 578.096 sec - in org.apache.phoenix.end2end.AlterTableIT
Running org.apache.phoenix.end2end.StatsCollectorWithSplitsAndMultiCFIT
Tests run: 2, Failures: 0, Errors: 0, Skipped: 0, Time elapsed: 19.205 sec - in org.apache.phoenix.end2end.StatsCollectorWithSplitsAndMultiCFIT
Running org.apache.phoenix.end2end.TenantSpecificTablesDDLIT
Tests run: 10, Failures: 0, Errors: 0, Skipped: 0, Time elapsed: 539.069 sec - in org.apache.phoenix.end2end.CsvBulkLoadToolIT
Running org.apache.phoenix.end2end.TenantSpecificTablesDMLIT
Tests run: 16, Failures: 0, Errors: 0, Skipped: 0, Time elapsed: 38.674 sec - in org.apache.phoenix.end2end.TenantSpecificTablesDMLIT
Tests run: 17, Failures: 0, Errors: 0, Skipped: 0, Time elapsed: 64.858 sec - in org.apache.phoenix.end2end.TenantSpecificTablesDDLIT
Running org.apache.phoenix.end2end.TransactionalViewIT
Tests run: 16, Failures: 0, Errors: 0, Skipped: 0, Time elapsed: 160.731 sec - in org.apache.phoenix.end2end.StatsCollectorIT
Running org.apache.phoenix.end2end.UnionAllIT
Running org.apache.phoenix.end2end.UserDefinedFunctionsIT
Running org.apache.phoenix.end2end.ViewIT
Tests run: 2, Failures: 0, Errors: 0, Skipped: 0, Time elapsed: 71.311 sec - in org.apache.phoenix.end2end.TransactionalViewIT
Tests run: 13, Failures: 0, Errors: 0, Skipped: 0, Time elapsed: 45.759 sec - in org.apache.phoenix.end2end.UnionAllIT
Running org.apache.phoenix.end2end.index.ImmutableIndexWithStatsIT
Running org.apache.phoenix.end2end.index.MutableIndexFailureIT
Tests run: 1, Failures: 0, Errors: 0, Skipped: 0, Time elapsed: 15.37 sec - in org.apache.phoenix.end2end.index.ImmutableIndexWithStatsIT
Tests run: 14, Failures: 0, Errors: 0, Skipped: 0, Time elapsed: 80.419 sec - in org.apache.phoenix.end2end.UserDefinedFunctionsIT
Running org.apache.phoenix.end2end.index.MutableIndexReplicationIT
Running org.apache.phoenix.end2end.index.ReadOnlyIndexFailureIT
Tests run: 2, Failures: 0, Errors: 0, Skipped: 0, Time elapsed: 32.345 sec - in org.apache.phoenix.end2end.index.ReadOnlyIndexFailureIT
Tests run: 1, Failures: 0, Errors: 0, Skipped: 0, Time elapsed: 41.925 sec - in org.apache.phoenix.end2end.index.MutableIndexReplicationIT
Tests run: 8, Failures: 0, Errors: 0, Skipped: 0, Time elapsed: 128.666 sec - in org.apache.phoenix.end2end.index.MutableIndexFailureIT
Running org.apache.phoenix.hbase.index.FailForUnsupportedHBaseVersionsIT
Running org.apache.phoenix.end2end.index.txn.TxWriteFailureIT
Tests run: 48, Failures: 0, Errors: 0, Skipped: 0, Time elapsed: 221.586 sec - in org.apache.phoenix.end2end.ViewIT
Tests run: 2, Failures: 0, Errors: 0, Skipped: 0, Time elapsed: 20.653 sec - in org.apache.phoenix.hbase.index.FailForUnsupportedHBaseVersionsIT
Running org.apache.phoenix.execute.PartialCommitIT
Tests run: 12, Failures: 0, Errors: 0, Skipped: 0, Time elapsed: 7.668 sec - in org.apache.phoenix.execute.PartialCommitIT
Running org.apache.phoenix.hbase.index.balancer.IndexLoadBalancerIT
Running org.apache.phoenix.hbase.index.covered.EndToEndCoveredColumnsIndexBuilderIT
Tests run: 8, Failures: 0, Errors: 0, Skipped: 0, Time elapsed: 49.746 sec - in org.apache.phoenix.end2end.index.txn.TxWriteFailureIT
Tests run: 2, Failures: 0, Errors: 0, Skipped: 0, Time elapsed: 27.855 sec - in org.apache.phoenix.hbase.index.covered.EndToEndCoveredColumnsIndexBuilderIT
Running org.apache.phoenix.hbase.index.covered.example.EndToEndCoveredIndexingIT
Running org.apache.phoenix.hbase.index.covered.example.FailWithoutRetriesIT
Tests run: 1, Failures: 0, Errors: 0, Skipped: 0, Time elapsed: 7.805 sec - in org.apache.phoenix.hbase.index.covered.example.FailWithoutRetriesIT
Running org.apache.phoenix.hbase.index.covered.example.EndtoEndIndexingWithCompressionIT
Running org.apache.phoenix.iterate.RoundRobinResultIteratorWithStatsIT
Tests run: 1, Failures: 0, Errors: 0, Skipped: 0, Time elapsed: 17.351 sec - in org.apache.phoenix.iterate.RoundRobinResultIteratorWithStatsIT
Tests run: 16, Failures: 0, Errors: 0, Skipped: 0, Time elapsed: 1,007.409 sec - in org.apache.phoenix.end2end.IndexToolIT
Tests run: 9, Failures: 0, Errors: 0, Skipped: 1, Time elapsed: 132.097 sec - in org.apache.phoenix.hbase.index.balancer.IndexLoadBalancerIT
Running org.apache.phoenix.iterate.ScannerLeaseRenewalIT
Running org.apache.phoenix.monitoring.PhoenixMetricsIT
Running org.apache.phoenix.rpc.PhoenixClientRpcIT
Tests run: 2, Failures: 0, Errors: 0, Skipped: 0, Time elapsed: 16.626 sec - in org.apache.phoenix.rpc.PhoenixClientRpcIT
Running org.apache.phoenix.rpc.PhoenixServerRpcIT
Tests run: 18, Failures: 0, Errors: 0, Skipped: 0, Time elapsed: 109.986 sec - in org.apache.phoenix.monitoring.PhoenixMetricsIT
Tests run: 11, Failures: 0, Errors: 0, Skipped: 0, Time elapsed: 237.53 sec - in org.apache.phoenix.hbase.index.covered.example.EndToEndCoveredIndexingIT
Tests run: 11, Failures: 0, Errors: 0, Skipped: 0, Time elapsed: 213.488 sec - in org.apache.phoenix.hbase.index.covered.example.EndtoEndIndexingWithCompressionIT
Tests run: 2, Failures: 0, Errors: 0, Skipped: 0, Time elapsed: 21.698 sec - in org.apache.phoenix.rpc.PhoenixServerRpcIT
Tests run: 2, Failures: 0, Errors: 0, Skipped: 0, Time elapsed: 176.853 sec - in org.apache.phoenix.iterate.ScannerLeaseRenewalIT

Results :

Tests run: 347, Failures: 0, Errors: 0, Skipped: 1

[INFO] 
[INFO] --- maven-failsafe-plugin:2.19.1:verify (ClientManagedTimeTests) @ phoenix-core ---
[INFO] ------------------------------------------------------------------------
[INFO] Reactor Summary:
[INFO] 
[INFO] Apache Phoenix .................................... SUCCESS [5.595s]
[INFO] Phoenix Core ...................................... FAILURE [1:18:18.654s]
[INFO] Phoenix - Flume ................................... SKIPPED
[INFO] Phoenix - Pig ..................................... SKIPPED
[INFO] Phoenix Query Server Client ....................... SKIPPED
[INFO] Phoenix Query Server .............................. SKIPPED
[INFO] Phoenix - Pherf ................................... SKIPPED
[INFO] Phoenix - Spark ................................... SKIPPED
[INFO] Phoenix - Hive .................................... SKIPPED
[INFO] Phoenix Assembly .................................. SKIPPED
[INFO] Phoenix - Tracing Web Application ................. SKIPPED
[INFO] ------------------------------------------------------------------------
[INFO] BUILD FAILURE
[INFO] ------------------------------------------------------------------------
[INFO] Total time: 1:18:24.822s
[INFO] Finished at: Thu Apr 28 00:30:39 UTC 2016
[INFO] Final Memory: 51M/976M
[INFO] ------------------------------------------------------------------------
[ERROR] Failed to execute goal org.apache.maven.plugins:maven-failsafe-plugin:2.19.1:verify
(ClientManagedTimeTests) on project phoenix-core: There was a timeout or other error in the
fork -> [Help 1]
[ERROR] 
[ERROR] To see the full stack trace of the errors, re-run Maven with the -e switch.
[ERROR] Re-run Maven using the -X switch to enable full debug logging.
[ERROR] 
[ERROR] For more information about the errors and possible solutions, please read the following
articles:
[ERROR] [Help 1] http://cwiki.apache.org/confluence/display/MAVEN/MojoExecutionException
[ERROR] 
[ERROR] After correcting the problems, you can resume the build with the command
[ERROR]   mvn <goals> -rf :phoenix-core
Build step 'Invoke top-level Maven targets' marked build as failure
Archiving artifacts
Compressed 1.56 GB of artifacts by 24.2% relative to #1192
Updating PHOENIX-2852
Recording test results

Mime
View raw message