phoenix-commits mailing list archives

Site index · List index
Message view « Date » · « Thread »
Top « Date » · « Thread »
From Apache Jenkins Server <jenk...@builds.apache.org>
Subject Build failed in Jenkins: Phoenix | 4.x-HBase-0.98 #1092
Date Wed, 02 Mar 2016 23:27:20 GMT
See <https://builds.apache.org/job/Phoenix-4.x-HBase-0.98/1092/changes>

Changes:

[jtaylor] PHOENIX-2733 Minor cleanup for improvements to CSV Bulk Loader

------------------------------------------
[...truncated 6111 lines...]
Tests run: 8, Failures: 0, Errors: 0, Skipped: 0, Time elapsed: 41.022 sec - in org.apache.phoenix.end2end.index.txn.RollbackIT
Running org.apache.phoenix.iterate.PhoenixQueryTimeoutIT
Tests run: 1, Failures: 0, Errors: 0, Skipped: 0, Time elapsed: 3.273 sec - in org.apache.phoenix.end2end.salted.SaltedTableVarLengthRowKeyIT
Running org.apache.phoenix.iterate.RoundRobinResultIteratorIT
Tests run: 2, Failures: 0, Errors: 0, Skipped: 0, Time elapsed: 3.316 sec - in org.apache.phoenix.iterate.PhoenixQueryTimeoutIT
Running org.apache.phoenix.rpc.UpdateCacheIT
Tests run: 6, Failures: 0, Errors: 0, Skipped: 0, Time elapsed: 18.071 sec - in org.apache.phoenix.end2end.salted.SaltedTableUpsertSelectIT
Running org.apache.phoenix.trace.PhoenixTableMetricsWriterIT
Tests run: 2, Failures: 0, Errors: 0, Skipped: 0, Time elapsed: 1.847 sec - in org.apache.phoenix.trace.PhoenixTableMetricsWriterIT
Running org.apache.phoenix.trace.PhoenixTraceReaderIT
Tests run: 2, Failures: 0, Errors: 0, Skipped: 0, Time elapsed: 0.473 sec - in org.apache.phoenix.trace.PhoenixTraceReaderIT
Running org.apache.phoenix.trace.PhoenixTracingEndToEndIT
Tests run: 20, Failures: 0, Errors: 0, Skipped: 0, Time elapsed: 194.105 sec - in org.apache.phoenix.end2end.index.LocalIndexIT
Running org.apache.phoenix.tx.TransactionIT
Tests run: 7, Failures: 0, Errors: 0, Skipped: 0, Time elapsed: 18.329 sec - in org.apache.phoenix.rpc.UpdateCacheIT
Running org.apache.phoenix.tx.TxCheckpointIT
Tests run: 9, Failures: 0, Errors: 0, Skipped: 0, Time elapsed: 62.959 sec - in org.apache.phoenix.iterate.RoundRobinResultIteratorIT
Tests run: 6, Failures: 0, Errors: 0, Skipped: 0, Time elapsed: 87.114 sec - in org.apache.phoenix.trace.PhoenixTracingEndToEndIT
Tests run: 16, Failures: 0, Errors: 0, Skipped: 0, Time elapsed: 86.036 sec - in org.apache.phoenix.tx.TxCheckpointIT
Tests run: 19, Failures: 0, Errors: 0, Skipped: 1, Time elapsed: 125.937 sec - in org.apache.phoenix.tx.TransactionIT
Tests run: 128, Failures: 0, Errors: 0, Skipped: 0, Time elapsed: 477.034 sec - in org.apache.phoenix.end2end.index.IndexIT

Results :

Tests run: 1358, Failures: 0, Errors: 0, Skipped: 5

[INFO] 
[INFO] --- maven-failsafe-plugin:2.19.1:integration-test (NeedTheirOwnClusterTests) @ phoenix-core
---

-------------------------------------------------------
 T E S T S
-------------------------------------------------------
Running org.apache.hadoop.hbase.regionserver.wal.WALReplayWithIndexWritesAndCompressedWALIT
Running org.apache.hadoop.hbase.regionserver.wal.WALReplayWithIndexWritesAndUncompressedWALInHBase_094_9_IT
Tests run: 1, Failures: 0, Errors: 0, Skipped: 0, Time elapsed: 18.137 sec - in org.apache.hadoop.hbase.regionserver.wal.WALReplayWithIndexWritesAndUncompressedWALInHBase_094_9_IT
Tests run: 1, Failures: 0, Errors: 0, Skipped: 0, Time elapsed: 20.873 sec - in org.apache.hadoop.hbase.regionserver.wal.WALReplayWithIndexWritesAndCompressedWALIT
Running org.apache.phoenix.end2end.AlterTableIT
Running org.apache.phoenix.coprocessor.StatisticsCollectionRunTrackerIT
Running org.apache.phoenix.end2end.ConnectionUtilIT
Running org.apache.phoenix.end2end.ContextClassloaderIT
Tests run: 1, Failures: 0, Errors: 0, Skipped: 0, Time elapsed: 17.54 sec - in org.apache.phoenix.end2end.ConnectionUtilIT
Running org.apache.phoenix.end2end.CountDistinctCompressionIT
Tests run: 3, Failures: 0, Errors: 0, Skipped: 0, Time elapsed: 4.152 sec - in org.apache.phoenix.end2end.ContextClassloaderIT
Tests run: 4, Failures: 0, Errors: 0, Skipped: 0, Time elapsed: 23.169 sec - in org.apache.phoenix.coprocessor.StatisticsCollectionRunTrackerIT
Tests run: 1, Failures: 0, Errors: 0, Skipped: 0, Time elapsed: 5.921 sec - in org.apache.phoenix.end2end.CountDistinctCompressionIT
Running org.apache.phoenix.end2end.IndexToolIT
Running org.apache.phoenix.end2end.CsvBulkLoadToolIT
Running org.apache.phoenix.end2end.KeyOnlyIT
Running org.apache.phoenix.end2end.MultiCfQueryExecIT
Tests run: 3, Failures: 0, Errors: 0, Skipped: 0, Time elapsed: 14.152 sec - in org.apache.phoenix.end2end.KeyOnlyIT
Tests run: 9, Failures: 0, Errors: 0, Skipped: 0, Time elapsed: 19.653 sec - in org.apache.phoenix.end2end.MultiCfQueryExecIT
Running org.apache.phoenix.end2end.MutableIndexToolIT
Tests run: 1, Failures: 1, Errors: 0, Skipped: 0, Time elapsed: 21.054 sec <<< FAILURE!
- in org.apache.phoenix.end2end.MutableIndexToolIT
testMutableIndexWithUpdates(org.apache.phoenix.end2end.MutableIndexToolIT)  Time elapsed:
18.597 sec  <<< FAILURE!
org.junit.ComparisonFailure: expected:<...HUNK PARALLEL 1-WAY []FULL SCAN OVER DATA_...>
but was:<...HUNK PARALLEL 1-WAY [ROUND ROBIN ]FULL SCAN OVER DATA_...>
	at org.apache.phoenix.end2end.MutableIndexToolIT.testMutableIndexWithUpdates(MutableIndexToolIT.java:94)

Running org.apache.phoenix.end2end.ParallelIteratorsIT
Tests run: 3, Failures: 0, Errors: 0, Skipped: 0, Time elapsed: 25.447 sec - in org.apache.phoenix.end2end.ParallelIteratorsIT
Running org.apache.phoenix.end2end.QueryTimeoutIT
Running org.apache.phoenix.end2end.QueryWithLimitIT
Tests run: 1, Failures: 0, Errors: 0, Skipped: 0, Time elapsed: 15.114 sec - in org.apache.phoenix.end2end.QueryTimeoutIT
Tests run: 16, Failures: 16, Errors: 0, Skipped: 0, Time elapsed: 110.505 sec <<<
FAILURE! - in org.apache.phoenix.end2end.IndexToolIT
testSecondaryIndex[transactional = false , mutable = false , localIndex = false, directApi
= false](org.apache.phoenix.end2end.IndexToolIT)  Time elapsed: 18.176 sec  <<< FAILURE!
org.junit.ComparisonFailure: expected:<...HUNK PARALLEL 1-WAY []FULL SCAN OVER S.T>
but was:<...HUNK PARALLEL 1-WAY [ROUND ROBIN ]FULL SCAN OVER S.T>
	at org.apache.phoenix.end2end.IndexToolIT.testSecondaryIndex(IndexToolIT.java:147)

testSecondaryIndex[transactional = false , mutable = false , localIndex = false, directApi
= true](org.apache.phoenix.end2end.IndexToolIT)  Time elapsed: 5.328 sec  <<< FAILURE!
org.junit.ComparisonFailure: expected:<...HUNK PARALLEL 1-WAY []FULL SCAN OVER S.T>
but was:<...HUNK PARALLEL 1-WAY [ROUND ROBIN ]FULL SCAN OVER S.T>
	at org.apache.phoenix.end2end.IndexToolIT.testSecondaryIndex(IndexToolIT.java:147)

testSecondaryIndex[transactional = false , mutable = false , localIndex = true, directApi
= false](org.apache.phoenix.end2end.IndexToolIT)  Time elapsed: 5.422 sec  <<< FAILURE!
org.junit.ComparisonFailure: expected:<...HUNK PARALLEL 1-WAY []FULL SCAN OVER S.T>
but was:<...HUNK PARALLEL 1-WAY [ROUND ROBIN ]FULL SCAN OVER S.T>
	at org.apache.phoenix.end2end.IndexToolIT.testSecondaryIndex(IndexToolIT.java:147)

testSecondaryIndex[transactional = false , mutable = false , localIndex = true, directApi
= true](org.apache.phoenix.end2end.IndexToolIT)  Time elapsed: 4.642 sec  <<< FAILURE!
org.junit.ComparisonFailure: expected:<...HUNK PARALLEL 1-WAY []FULL SCAN OVER S.T>
but was:<...HUNK PARALLEL 1-WAY [ROUND ROBIN ]FULL SCAN OVER S.T>
	at org.apache.phoenix.end2end.IndexToolIT.testSecondaryIndex(IndexToolIT.java:147)

testSecondaryIndex[transactional = false , mutable = true , localIndex = false, directApi
= false](org.apache.phoenix.end2end.IndexToolIT)  Time elapsed: 5.293 sec  <<< FAILURE!
org.junit.ComparisonFailure: expected:<...HUNK PARALLEL 1-WAY []FULL SCAN OVER S.T>
but was:<...HUNK PARALLEL 1-WAY [ROUND ROBIN ]FULL SCAN OVER S.T>
	at org.apache.phoenix.end2end.IndexToolIT.testSecondaryIndex(IndexToolIT.java:147)

testSecondaryIndex[transactional = false , mutable = true , localIndex = false, directApi
= true](org.apache.phoenix.end2end.IndexToolIT)  Time elapsed: 5.095 sec  <<< FAILURE!
org.junit.ComparisonFailure: expected:<...HUNK PARALLEL 1-WAY []FULL SCAN OVER S.T>
but was:<...HUNK PARALLEL 1-WAY [ROUND ROBIN ]FULL SCAN OVER S.T>
	at org.apache.phoenix.end2end.IndexToolIT.testSecondaryIndex(IndexToolIT.java:147)

testSecondaryIndex[transactional = false , mutable = true , localIndex = true, directApi =
false](org.apache.phoenix.end2end.IndexToolIT)  Time elapsed: 5.762 sec  <<< FAILURE!
org.junit.ComparisonFailure: expected:<...HUNK PARALLEL 1-WAY []FULL SCAN OVER S.T>
but was:<...HUNK PARALLEL 1-WAY [ROUND ROBIN ]FULL SCAN OVER S.T>
	at org.apache.phoenix.end2end.IndexToolIT.testSecondaryIndex(IndexToolIT.java:147)

testSecondaryIndex[transactional = false , mutable = true , localIndex = true, directApi =
true](org.apache.phoenix.end2end.IndexToolIT)  Time elapsed: 4.616 sec  <<< FAILURE!
org.junit.ComparisonFailure: expected:<...HUNK PARALLEL 1-WAY []FULL SCAN OVER S.T>
but was:<...HUNK PARALLEL 1-WAY [ROUND ROBIN ]FULL SCAN OVER S.T>
	at org.apache.phoenix.end2end.IndexToolIT.testSecondaryIndex(IndexToolIT.java:147)

testSecondaryIndex[transactional = true , mutable = false , localIndex = false, directApi
= false](org.apache.phoenix.end2end.IndexToolIT)  Time elapsed: 5.775 sec  <<< FAILURE!
org.junit.ComparisonFailure: expected:<...HUNK PARALLEL 1-WAY []FULL SCAN OVER S.T_T...>
but was:<...HUNK PARALLEL 1-WAY [ROUND ROBIN ]FULL SCAN OVER S.T_T...>
	at org.apache.phoenix.end2end.IndexToolIT.testSecondaryIndex(IndexToolIT.java:147)

testSecondaryIndex[transactional = true , mutable = false , localIndex = false, directApi
= true](org.apache.phoenix.end2end.IndexToolIT)  Time elapsed: 5.668 sec  <<< FAILURE!
org.junit.ComparisonFailure: expected:<...HUNK PARALLEL 1-WAY []FULL SCAN OVER S.T_T...>
but was:<...HUNK PARALLEL 1-WAY [ROUND ROBIN ]FULL SCAN OVER S.T_T...>
	at org.apache.phoenix.end2end.IndexToolIT.testSecondaryIndex(IndexToolIT.java:147)

testSecondaryIndex[transactional = true , mutable = false , localIndex = true, directApi =
false](org.apache.phoenix.end2end.IndexToolIT)  Time elapsed: 6.414 sec  <<< FAILURE!
org.junit.ComparisonFailure: expected:<...HUNK PARALLEL 1-WAY []FULL SCAN OVER S.T_T...>
but was:<...HUNK PARALLEL 1-WAY [ROUND ROBIN ]FULL SCAN OVER S.T_T...>
	at org.apache.phoenix.end2end.IndexToolIT.testSecondaryIndex(IndexToolIT.java:147)

testSecondaryIndex[transactional = true , mutable = false , localIndex = true, directApi =
true](org.apache.phoenix.end2end.IndexToolIT)  Time elapsed: 6.485 sec  <<< FAILURE!
org.junit.ComparisonFailure: expected:<...HUNK PARALLEL 1-WAY []FULL SCAN OVER S.T_T...>
but was:<...HUNK PARALLEL 1-WAY [ROUND ROBIN ]FULL SCAN OVER S.T_T...>
	at org.apache.phoenix.end2end.IndexToolIT.testSecondaryIndex(IndexToolIT.java:147)

testSecondaryIndex[transactional = true , mutable = true , localIndex = false, directApi =
false](org.apache.phoenix.end2end.IndexToolIT)  Time elapsed: 5.876 sec  <<< FAILURE!
org.junit.ComparisonFailure: expected:<...HUNK PARALLEL 1-WAY []FULL SCAN OVER S.T_T...>
but was:<...HUNK PARALLEL 1-WAY [ROUND ROBIN ]FULL SCAN OVER S.T_T...>
	at org.apache.phoenix.end2end.IndexToolIT.testSecondaryIndex(IndexToolIT.java:147)

testSecondaryIndex[transactional = true , mutable = true , localIndex = false, directApi =
true](org.apache.phoenix.end2end.IndexToolIT)  Time elapsed: 6.339 sec  <<< FAILURE!
org.junit.ComparisonFailure: expected:<...HUNK PARALLEL 1-WAY []FULL SCAN OVER S.T_T...>
but was:<...HUNK PARALLEL 1-WAY [ROUND ROBIN ]FULL SCAN OVER S.T_T...>
	at org.apache.phoenix.end2end.IndexToolIT.testSecondaryIndex(IndexToolIT.java:147)

testSecondaryIndex[transactional = true , mutable = true , localIndex = true, directApi =
false](org.apache.phoenix.end2end.IndexToolIT)  Time elapsed: 5.376 sec  <<< FAILURE!
org.junit.ComparisonFailure: expected:<...HUNK PARALLEL 1-WAY []FULL SCAN OVER S.T_T...>
but was:<...HUNK PARALLEL 1-WAY [ROUND ROBIN ]FULL SCAN OVER S.T_T...>
	at org.apache.phoenix.end2end.IndexToolIT.testSecondaryIndex(IndexToolIT.java:147)

testSecondaryIndex[transactional = true , mutable = true , localIndex = true, directApi =
true](org.apache.phoenix.end2end.IndexToolIT)  Time elapsed: 4.903 sec  <<< FAILURE!
org.junit.ComparisonFailure: expected:<...HUNK PARALLEL 1-WAY []FULL SCAN OVER S.T_T...>
but was:<...HUNK PARALLEL 1-WAY [ROUND ROBIN ]FULL SCAN OVER S.T_T...>
	at org.apache.phoenix.end2end.IndexToolIT.testSecondaryIndex(IndexToolIT.java:147)

Tests run: 2, Failures: 0, Errors: 0, Skipped: 0, Time elapsed: 15.225 sec - in org.apache.phoenix.end2end.QueryWithLimitIT
Running org.apache.phoenix.end2end.SaltedViewIT
Running org.apache.phoenix.end2end.SpillableGroupByIT
Tests run: 1, Failures: 0, Errors: 0, Skipped: 0, Time elapsed: 6.138 sec - in org.apache.phoenix.end2end.SpillableGroupByIT
Running org.apache.phoenix.end2end.StatsCollectionDisabledIT
Tests run: 1, Failures: 0, Errors: 0, Skipped: 0, Time elapsed: 3.633 sec - in org.apache.phoenix.end2end.StatsCollectionDisabledIT
Tests run: 4, Failures: 0, Errors: 0, Skipped: 0, Time elapsed: 33.968 sec - in org.apache.phoenix.end2end.SaltedViewIT
Running org.apache.phoenix.end2end.StatsCollectorIT
Running org.apache.phoenix.end2end.StatsCollectorWithSplitsAndMultiCFIT
Tests run: 2, Failures: 0, Errors: 0, Skipped: 0, Time elapsed: 14.673 sec - in org.apache.phoenix.end2end.StatsCollectorWithSplitsAndMultiCFIT
Running org.apache.phoenix.end2end.TenantSpecificTablesDDLIT
Running org.apache.phoenix.end2end.TenantSpecificTablesDMLIT
Tests run: 17, Failures: 0, Errors: 0, Skipped: 0, Time elapsed: 25.062 sec - in org.apache.phoenix.end2end.TenantSpecificTablesDDLIT
Tests run: 56, Failures: 0, Errors: 0, Skipped: 0, Time elapsed: 293.503 sec - in org.apache.phoenix.end2end.AlterTableIT
Tests run: 16, Failures: 0, Errors: 0, Skipped: 0, Time elapsed: 24.828 sec - in org.apache.phoenix.end2end.TenantSpecificTablesDMLIT
Running org.apache.phoenix.end2end.TransactionalViewIT
Running org.apache.phoenix.end2end.UnionAllIT
Tests run: 13, Failures: 0, Errors: 0, Skipped: 0, Time elapsed: 15.322 sec - in org.apache.phoenix.end2end.UnionAllIT
Running org.apache.phoenix.end2end.UserDefinedFunctionsIT
Tests run: 13, Failures: 0, Errors: 0, Skipped: 0, Time elapsed: 18.092 sec - in org.apache.phoenix.end2end.UserDefinedFunctionsIT
Running org.apache.phoenix.end2end.ViewIT
Tests run: 16, Failures: 0, Errors: 0, Skipped: 0, Time elapsed: 124.218 sec - in org.apache.phoenix.end2end.StatsCollectorIT
Tests run: 2, Failures: 0, Errors: 0, Skipped: 0, Time elapsed: 65.035 sec - in org.apache.phoenix.end2end.TransactionalViewIT
Tests run: 9, Failures: 0, Errors: 0, Skipped: 0, Time elapsed: 328.317 sec - in org.apache.phoenix.end2end.CsvBulkLoadToolIT
Running org.apache.phoenix.end2end.index.ImmutableIndexWithStatsIT
Running org.apache.phoenix.end2end.index.MutableIndexFailureIT
Tests run: 1, Failures: 0, Errors: 0, Skipped: 0, Time elapsed: 5.382 sec - in org.apache.phoenix.end2end.index.ImmutableIndexWithStatsIT
Running org.apache.phoenix.end2end.index.ReadOnlyIndexFailureIT
Running org.apache.phoenix.end2end.index.MutableIndexReplicationIT
Running org.apache.phoenix.end2end.index.txn.TxWriteFailureIT
Tests run: 1, Failures: 0, Errors: 0, Skipped: 0, Time elapsed: 19.289 sec - in org.apache.phoenix.end2end.index.MutableIndexReplicationIT
Tests run: 2, Failures: 0, Errors: 0, Skipped: 0, Time elapsed: 26.797 sec - in org.apache.phoenix.end2end.index.ReadOnlyIndexFailureIT
Running org.apache.phoenix.hbase.index.FailForUnsupportedHBaseVersionsIT
Tests run: 8, Failures: 0, Errors: 0, Skipped: 0, Time elapsed: 26.035 sec - in org.apache.phoenix.end2end.index.txn.TxWriteFailureIT
Tests run: 4, Failures: 0, Errors: 0, Skipped: 0, Time elapsed: 56.189 sec - in org.apache.phoenix.end2end.index.MutableIndexFailureIT
Tests run: 2, Failures: 0, Errors: 0, Skipped: 0, Time elapsed: 18.354 sec - in org.apache.phoenix.hbase.index.FailForUnsupportedHBaseVersionsIT
Running org.apache.phoenix.hbase.index.balancer.IndexLoadBalancerIT
Running org.apache.phoenix.hbase.index.covered.EndToEndCoveredColumnsIndexBuilderIT
Tests run: 2, Failures: 0, Errors: 0, Skipped: 0, Time elapsed: 7.55 sec - in org.apache.phoenix.hbase.index.covered.EndToEndCoveredColumnsIndexBuilderIT
Running org.apache.phoenix.execute.PartialCommitIT
Tests run: 12, Failures: 0, Errors: 0, Skipped: 0, Time elapsed: 6.447 sec - in org.apache.phoenix.execute.PartialCommitIT
Tests run: 46, Failures: 0, Errors: 0, Skipped: 0, Time elapsed: 114.497 sec - in org.apache.phoenix.end2end.ViewIT
Running org.apache.phoenix.hbase.index.covered.example.EndToEndCoveredIndexingIT
Running org.apache.phoenix.hbase.index.covered.example.FailWithoutRetriesIT
Running org.apache.phoenix.hbase.index.covered.example.EndtoEndIndexingWithCompressionIT
Tests run: 1, Failures: 0, Errors: 0, Skipped: 0, Time elapsed: 7.878 sec - in org.apache.phoenix.hbase.index.covered.example.FailWithoutRetriesIT
Running org.apache.phoenix.iterate.RoundRobinResultIteratorWithStatsIT
Tests run: 9, Failures: 0, Errors: 0, Skipped: 1, Time elapsed: 59.47 sec - in org.apache.phoenix.hbase.index.balancer.IndexLoadBalancerIT
Tests run: 1, Failures: 0, Errors: 0, Skipped: 0, Time elapsed: 14.799 sec - in org.apache.phoenix.iterate.RoundRobinResultIteratorWithStatsIT
Running org.apache.phoenix.iterate.ScannerLeaseRenewalIT
Tests run: 11, Failures: 0, Errors: 0, Skipped: 0, Time elapsed: 54.67 sec - in org.apache.phoenix.hbase.index.covered.example.EndToEndCoveredIndexingIT
Running org.apache.phoenix.monitoring.PhoenixMetricsIT
Tests run: 11, Failures: 0, Errors: 0, Skipped: 0, Time elapsed: 63.751 sec - in org.apache.phoenix.hbase.index.covered.example.EndtoEndIndexingWithCompressionIT
Running org.apache.phoenix.rpc.PhoenixClientRpcIT
Tests run: 2, Failures: 0, Errors: 0, Skipped: 0, Time elapsed: 5.941 sec - in org.apache.phoenix.rpc.PhoenixClientRpcIT
Running org.apache.phoenix.rpc.PhoenixServerRpcIT
Tests run: 2, Failures: 0, Errors: 0, Skipped: 0, Time elapsed: 16.058 sec - in org.apache.phoenix.rpc.PhoenixServerRpcIT
Tests run: 18, Failures: 0, Errors: 0, Skipped: 0, Time elapsed: 43.391 sec - in org.apache.phoenix.monitoring.PhoenixMetricsIT
Tests run: 2, Failures: 0, Errors: 0, Skipped: 0, Time elapsed: 164.693 sec - in org.apache.phoenix.iterate.ScannerLeaseRenewalIT

Results :

Failed tests: 
  IndexToolIT.testSecondaryIndex:147 expected:<...HUNK PARALLEL 1-WAY []FULL SCAN OVER
S.T> but was:<...HUNK PARALLEL 1-WAY [ROUND ROBIN ]FULL SCAN OVER S.T>
  IndexToolIT.testSecondaryIndex:147 expected:<...HUNK PARALLEL 1-WAY []FULL SCAN OVER
S.T> but was:<...HUNK PARALLEL 1-WAY [ROUND ROBIN ]FULL SCAN OVER S.T>
  IndexToolIT.testSecondaryIndex:147 expected:<...HUNK PARALLEL 1-WAY []FULL SCAN OVER
S.T> but was:<...HUNK PARALLEL 1-WAY [ROUND ROBIN ]FULL SCAN OVER S.T>
  IndexToolIT.testSecondaryIndex:147 expected:<...HUNK PARALLEL 1-WAY []FULL SCAN OVER
S.T> but was:<...HUNK PARALLEL 1-WAY [ROUND ROBIN ]FULL SCAN OVER S.T>
  IndexToolIT.testSecondaryIndex:147 expected:<...HUNK PARALLEL 1-WAY []FULL SCAN OVER
S.T> but was:<...HUNK PARALLEL 1-WAY [ROUND ROBIN ]FULL SCAN OVER S.T>
  IndexToolIT.testSecondaryIndex:147 expected:<...HUNK PARALLEL 1-WAY []FULL SCAN OVER
S.T> but was:<...HUNK PARALLEL 1-WAY [ROUND ROBIN ]FULL SCAN OVER S.T>
  IndexToolIT.testSecondaryIndex:147 expected:<...HUNK PARALLEL 1-WAY []FULL SCAN OVER
S.T> but was:<...HUNK PARALLEL 1-WAY [ROUND ROBIN ]FULL SCAN OVER S.T>
  IndexToolIT.testSecondaryIndex:147 expected:<...HUNK PARALLEL 1-WAY []FULL SCAN OVER
S.T> but was:<...HUNK PARALLEL 1-WAY [ROUND ROBIN ]FULL SCAN OVER S.T>
  IndexToolIT.testSecondaryIndex:147 expected:<...HUNK PARALLEL 1-WAY []FULL SCAN OVER
S.T_T...> but was:<...HUNK PARALLEL 1-WAY [ROUND ROBIN ]FULL SCAN OVER S.T_T...>
  IndexToolIT.testSecondaryIndex:147 expected:<...HUNK PARALLEL 1-WAY []FULL SCAN OVER
S.T_T...> but was:<...HUNK PARALLEL 1-WAY [ROUND ROBIN ]FULL SCAN OVER S.T_T...>
  IndexToolIT.testSecondaryIndex:147 expected:<...HUNK PARALLEL 1-WAY []FULL SCAN OVER
S.T_T...> but was:<...HUNK PARALLEL 1-WAY [ROUND ROBIN ]FULL SCAN OVER S.T_T...>
  IndexToolIT.testSecondaryIndex:147 expected:<...HUNK PARALLEL 1-WAY []FULL SCAN OVER
S.T_T...> but was:<...HUNK PARALLEL 1-WAY [ROUND ROBIN ]FULL SCAN OVER S.T_T...>
  IndexToolIT.testSecondaryIndex:147 expected:<...HUNK PARALLEL 1-WAY []FULL SCAN OVER
S.T_T...> but was:<...HUNK PARALLEL 1-WAY [ROUND ROBIN ]FULL SCAN OVER S.T_T...>
  IndexToolIT.testSecondaryIndex:147 expected:<...HUNK PARALLEL 1-WAY []FULL SCAN OVER
S.T_T...> but was:<...HUNK PARALLEL 1-WAY [ROUND ROBIN ]FULL SCAN OVER S.T_T...>
  IndexToolIT.testSecondaryIndex:147 expected:<...HUNK PARALLEL 1-WAY []FULL SCAN OVER
S.T_T...> but was:<...HUNK PARALLEL 1-WAY [ROUND ROBIN ]FULL SCAN OVER S.T_T...>
  IndexToolIT.testSecondaryIndex:147 expected:<...HUNK PARALLEL 1-WAY []FULL SCAN OVER
S.T_T...> but was:<...HUNK PARALLEL 1-WAY [ROUND ROBIN ]FULL SCAN OVER S.T_T...>
  MutableIndexToolIT.testMutableIndexWithUpdates:94 expected:<...HUNK PARALLEL 1-WAY []FULL
SCAN OVER DATA_...> but was:<...HUNK PARALLEL 1-WAY [ROUND ROBIN ]FULL SCAN OVER DATA_...>

Tests run: 331, Failures: 17, Errors: 0, Skipped: 1

[INFO] 
[INFO] --- maven-failsafe-plugin:2.19.1:verify (ClientManagedTimeTests) @ phoenix-core ---
[INFO] ------------------------------------------------------------------------
[INFO] Reactor Summary:
[INFO] 
[INFO] Apache Phoenix .................................... SUCCESS [6.511s]
[INFO] Phoenix Core ...................................... FAILURE [33:29.304s]
[INFO] Phoenix - Flume ................................... SKIPPED
[INFO] Phoenix - Pig ..................................... SKIPPED
[INFO] Phoenix Query Server Client ....................... SKIPPED
[INFO] Phoenix Query Server .............................. SKIPPED
[INFO] Phoenix - Pherf ................................... SKIPPED
[INFO] Phoenix - Spark ................................... SKIPPED
[INFO] Phoenix Assembly .................................. SKIPPED
[INFO] Phoenix - Tracing Web Application ................. SKIPPED
[INFO] ------------------------------------------------------------------------
[INFO] BUILD FAILURE
[INFO] ------------------------------------------------------------------------
[INFO] Total time: 33:36.431s
[INFO] Finished at: Wed Mar 02 23:24:34 UTC 2016
[INFO] Final Memory: 62M/1262M
[INFO] ------------------------------------------------------------------------
[ERROR] Failed to execute goal org.apache.maven.plugins:maven-failsafe-plugin:2.19.1:verify
(ClientManagedTimeTests) on project phoenix-core: There are test failures.
[ERROR] 
[ERROR] Please refer to <https://builds.apache.org/job/Phoenix-4.x-HBase-0.98/ws/phoenix-core/target/failsafe-reports>
for the individual test results.
[ERROR] -> [Help 1]
[ERROR] 
[ERROR] To see the full stack trace of the errors, re-run Maven with the -e switch.
[ERROR] Re-run Maven using the -X switch to enable full debug logging.
[ERROR] 
[ERROR] For more information about the errors and possible solutions, please read the following
articles:
[ERROR] [Help 1] http://cwiki.apache.org/confluence/display/MAVEN/MojoFailureException
[ERROR] 
[ERROR] After correcting the problems, you can resume the build with the command
[ERROR]   mvn <goals> -rf :phoenix-core
Build step 'Invoke top-level Maven targets' marked build as failure
Archiving artifacts
Compressed 682.49 MB of artifacts by 27.2% relative to #1090
Recording test results

Mime
View raw message