phoenix-commits mailing list archives

Site index · List index
Message view « Date » · « Thread »
Top « Date » · « Thread »
From Apache Jenkins Server <jenk...@builds.apache.org>
Subject Build failed in Jenkins: Phoenix-4.x-HBase-1.0 #384
Date Mon, 15 Feb 2016 06:42:55 GMT
See <https://builds.apache.org/job/Phoenix-4.x-HBase-1.0/384/changes>

Changes:

[ankitsinghal59] PHOENIX-2671 System.STATS table getting truncated every time on new

------------------------------------------
Started by an SCM change
[EnvInject] - Loading node environment variables.
Building remotely on ubuntu-6 (docker Ubuntu ubuntu yahoo-not-h2) in workspace <https://builds.apache.org/job/Phoenix-4.x-HBase-1.0/ws/>
 > git rev-parse --is-inside-work-tree # timeout=10
Fetching changes from the remote Git repository
 > git config remote.origin.url https://git-wip-us.apache.org/repos/asf/phoenix.git # timeout=10
Fetching upstream changes from https://git-wip-us.apache.org/repos/asf/phoenix.git
 > git --version # timeout=10
 > git -c core.askpass=true fetch --tags --progress https://git-wip-us.apache.org/repos/asf/phoenix.git
+refs/heads/*:refs/remotes/origin/*
 > git rev-parse origin/4.x-HBase-1.0^{commit} # timeout=10
Checking out Revision 19012c0265d37cd0ae7655648810b275659b8d6e (origin/4.x-HBase-1.0)
 > git config core.sparsecheckout # timeout=10
 > git checkout -f 19012c0265d37cd0ae7655648810b275659b8d6e
 > git rev-list 6a6b64b23b661b7fd544c356f00c0f9ff692cd02 # timeout=10
No emails were triggered.
[EnvInject] - Executing scripts and injecting environment variables after the SCM step.
[EnvInject] - Injecting as environment variables the properties content 
MAVEN_OPTS=-Xmx3G

[EnvInject] - Variables injected successfully.
[Phoenix-4.x-HBase-1.0] $ /bin/bash -xe /tmp/hudson8153816094444919023.sh
+ echo 'DELETING ~/.m2/repository/org/apache/htrace. See https://issues.apache.org/jira/browse/PHOENIX-1802'
DELETING ~/.m2/repository/org/apache/htrace. See https://issues.apache.org/jira/browse/PHOENIX-1802
+ echo 'CURRENT CONTENT:'
CURRENT CONTENT:
+ ls /home/jenkins/.m2/repository/org/apache/htrace
htrace
htrace-core
[Phoenix-4.x-HBase-1.0] $ /home/jenkins/tools/maven/apache-maven-3.0.4/bin/mvn -U clean install
-Dcheckstyle.skip=true
[INFO] Scanning for projects...
[INFO] ------------------------------------------------------------------------
[INFO] Reactor Build Order:
[INFO] 
[INFO] Apache Phoenix
[INFO] Phoenix Core
[INFO] Phoenix - Flume
[INFO] Phoenix - Pig
[INFO] Phoenix Query Server Client
[INFO] Phoenix Query Server
[INFO] Phoenix - Pherf
[INFO] Phoenix - Spark
[INFO] Phoenix Assembly
[INFO] Phoenix - Tracing Web Application
[INFO]                                                                         
[INFO] ------------------------------------------------------------------------
[INFO] Building Apache Phoenix 4.7.0-HBase-1.0
[INFO] ------------------------------------------------------------------------
[INFO] 
[INFO] --- maven-clean-plugin:2.5:clean (default-clean) @ phoenix ---
[INFO] Deleting <https://builds.apache.org/job/Phoenix-4.x-HBase-1.0/ws/target>
[INFO] 
[INFO] --- maven-checkstyle-plugin:2.13:check (validate) @ phoenix ---
[INFO] 
[INFO] --- maven-remote-resources-plugin:1.5:process (default) @ phoenix ---
[INFO] 
[INFO] --- maven-source-plugin:2.2.1:jar-no-fork (attach-sources) @ phoenix ---
[INFO] 
[INFO] --- maven-jar-plugin:2.4:test-jar (default) @ phoenix ---
[WARNING] JAR will be empty - no content was marked for inclusion!
[INFO] Building jar: <https://builds.apache.org/job/Phoenix-4.x-HBase-1.0/384/artifact/target/phoenix-4.7.0-HBase-1.0-tests.jar>
[INFO] 
[INFO] --- maven-site-plugin:3.2:attach-descriptor (attach-descriptor) @ phoenix ---
[INFO] 
[INFO] --- maven-install-plugin:2.5.1:install (default-install) @ phoenix ---
[INFO] Installing <https://builds.apache.org/job/Phoenix-4.x-HBase-1.0/ws/pom.xml> to
/home/jenkins/.m2/repository/org/apache/phoenix/phoenix/4.7.0-HBase-1.0/phoenix-4.7.0-HBase-1.0.pom
[INFO] Installing <https://builds.apache.org/job/Phoenix-4.x-HBase-1.0/384/artifact/target/phoenix-4.7.0-HBase-1.0-tests.jar>
to /home/jenkins/.m2/repository/org/apache/phoenix/phoenix/4.7.0-HBase-1.0/phoenix-4.7.0-HBase-1.0-tests.jar
[INFO]                                                                         
[INFO] ------------------------------------------------------------------------
[INFO] Building Phoenix Core 4.7.0-HBase-1.0
[INFO] ------------------------------------------------------------------------
[INFO] 
[INFO] --- maven-clean-plugin:2.5:clean (default-clean) @ phoenix-core ---
[INFO] Deleting <https://builds.apache.org/job/Phoenix-4.x-HBase-1.0/ws/phoenix-core/target>
[INFO] 
[INFO] --- maven-checkstyle-plugin:2.13:check (validate) @ phoenix-core ---
[INFO] 
[INFO] --- build-helper-maven-plugin:1.9.1:add-test-source (add-test-source) @ phoenix-core
---
[INFO] Test Source directory: <https://builds.apache.org/job/Phoenix-4.x-HBase-1.0/ws/phoenix-core/src/it/java>
added.
[INFO] 
[INFO] --- build-helper-maven-plugin:1.9.1:add-test-resource (add-test-resource) @ phoenix-core
---
[INFO] 
[INFO] --- build-helper-maven-plugin:1.9.1:add-source (add-source) @ phoenix-core ---
[INFO] Source directory: <https://builds.apache.org/job/Phoenix-4.x-HBase-1.0/ws/phoenix-core/target/generated-sources/antlr3>
added.
[INFO] Source directory: <https://builds.apache.org/job/Phoenix-4.x-HBase-1.0/ws/phoenix-core/src/main/antlr3>
added.
[INFO] 
[INFO] --- antlr3-maven-plugin:3.5.2:antlr (default) @ phoenix-core ---
[INFO] ANTLR: Processing source directory <https://builds.apache.org/job/Phoenix-4.x-HBase-1.0/ws/phoenix-core/src/main/antlr3>
ANTLR Parser Generator  Version 3.5.2
Output file <https://builds.apache.org/job/Phoenix-4.x-HBase-1.0/ws/phoenix-core/target/generated-sources/antlr3/org/apache/phoenix/parse/PhoenixSQLParser.java>
does not exist: must build <https://builds.apache.org/job/Phoenix-4.x-HBase-1.0/ws/phoenix-core/src/main/antlr3/PhoenixSQL.g>
PhoenixSQL.g
warning(200): PhoenixSQL.g:1218:5: 
Decision can match input such as "'\\''"'" using multiple alternatives: 1, 2

As a result, alternative(s) 2 were disabled for that input
warning(200): PhoenixSQL.g:1218:5: 
Decision can match input such as "'\\''b'" using multiple alternatives: 1, 2

As a result, alternative(s) 2 were disabled for that input
warning(200): PhoenixSQL.g:1218:5: 
Decision can match input such as "'\\''r'" using multiple alternatives: 1, 2

As a result, alternative(s) 2 were disabled for that input
warning(200): PhoenixSQL.g:1218:5: 
Decision can match input such as "'\\''\'''\'''\''{'\u0000'..'&', '('..'\uFFFF'}" using
multiple alternatives: 1, 2

As a result, alternative(s) 2 were disabled for that input
warning(200): PhoenixSQL.g:1218:5: 
Decision can match input such as "'\\''f'" using multiple alternatives: 1, 2

As a result, alternative(s) 2 were disabled for that input
warning(200): PhoenixSQL.g:1218:5: 
Decision can match input such as "'\\''t'" using multiple alternatives: 1, 2

As a result, alternative(s) 2 were disabled for that input
warning(200): PhoenixSQL.g:1218:5: 
Decision can match input such as "'\\''\\'" using multiple alternatives: 1, 2

As a result, alternative(s) 2 were disabled for that input
warning(200): PhoenixSQL.g:1218:5: 
Decision can match input such as "'\\''n'" using multiple alternatives: 1, 2

As a result, alternative(s) 2 were disabled for that input
warning(200): PhoenixSQL.g:1218:5: 
Decision can match input such as "'\\''_'" using multiple alternatives: 1, 2

As a result, alternative(s) 2 were disabled for that input
[INFO] 
[INFO] --- maven-dependency-plugin:2.1:build-classpath (create-phoenix-generated-classpath)
@ phoenix-core ---
[INFO] Wrote classpath file '<https://builds.apache.org/job/Phoenix-4.x-HBase-1.0/ws/phoenix-core/target/cached_classpath.txt'.>
[INFO] 
[INFO] --- maven-remote-resources-plugin:1.5:process (default) @ phoenix-core ---
[INFO] 
[INFO] --- maven-resources-plugin:2.6:resources (default-resources) @ phoenix-core ---
[INFO] Using 'UTF-8' encoding to copy filtered resources.
[INFO] Copying 1 resource to META-INF/services
[INFO] Copying 3 resources
[INFO] 
[INFO] --- maven-compiler-plugin:3.0:compile (default-compile) @ phoenix-core ---
[INFO] Changes detected - recompiling the module!
[INFO] Compiling 926 source files to <https://builds.apache.org/job/Phoenix-4.x-HBase-1.0/ws/phoenix-core/target/classes>
[INFO] -------------------------------------------------------------
[ERROR] COMPILATION ERROR : 
[INFO] -------------------------------------------------------------
[ERROR] <https://builds.apache.org/job/Phoenix-4.x-HBase-1.0/ws/phoenix-core/src/main/java/org/apache/phoenix/query/ConnectionQueryServicesImpl.java>:[252,1]
illegal start of type
[ERROR] <https://builds.apache.org/job/Phoenix-4.x-HBase-1.0/ws/phoenix-core/src/main/java/org/apache/phoenix/query/ConnectionQueryServicesImpl.java>:[252,7]
';' expected
[ERROR] <https://builds.apache.org/job/Phoenix-4.x-HBase-1.0/ws/phoenix-core/src/main/java/org/apache/phoenix/query/ConnectionQueryServicesImpl.java>:[252,10]
illegal start of type
[ERROR] <https://builds.apache.org/job/Phoenix-4.x-HBase-1.0/ws/phoenix-core/src/main/java/org/apache/phoenix/query/ConnectionQueryServicesImpl.java>:[252,15]
';' expected
[ERROR] <https://builds.apache.org/job/Phoenix-4.x-HBase-1.0/ws/phoenix-core/src/main/java/org/apache/phoenix/query/ConnectionQueryServicesImpl.java>:[252,46]
<identifier> expected
[ERROR] <https://builds.apache.org/job/Phoenix-4.x-HBase-1.0/ws/phoenix-core/src/main/java/org/apache/phoenix/query/ConnectionQueryServicesImpl.java>:[253,1]
illegal start of type
[ERROR] <https://builds.apache.org/job/Phoenix-4.x-HBase-1.0/ws/phoenix-core/src/main/java/org/apache/phoenix/query/ConnectionQueryServicesImpl.java>:[253,7]
';' expected
[ERROR] <https://builds.apache.org/job/Phoenix-4.x-HBase-1.0/ws/phoenix-core/src/main/java/org/apache/phoenix/query/ConnectionQueryServicesImpl.java>:[253,10]
illegal start of type
[ERROR] <https://builds.apache.org/job/Phoenix-4.x-HBase-1.0/ws/phoenix-core/src/main/java/org/apache/phoenix/query/ConnectionQueryServicesImpl.java>:[253,15]
';' expected
[ERROR] <https://builds.apache.org/job/Phoenix-4.x-HBase-1.0/ws/phoenix-core/src/main/java/org/apache/phoenix/query/ConnectionQueryServicesImpl.java>:[253,34]
<identifier> expected
[ERROR] <https://builds.apache.org/job/Phoenix-4.x-HBase-1.0/ws/phoenix-core/src/main/java/org/apache/phoenix/query/ConnectionQueryServicesImpl.java>:[254,1]
illegal start of type
[ERROR] <https://builds.apache.org/job/Phoenix-4.x-HBase-1.0/ws/phoenix-core/src/main/java/org/apache/phoenix/query/ConnectionQueryServicesImpl.java>:[254,7]
';' expected
[ERROR] <https://builds.apache.org/job/Phoenix-4.x-HBase-1.0/ws/phoenix-core/src/main/java/org/apache/phoenix/query/ConnectionQueryServicesImpl.java>:[254,10]
illegal start of type
[ERROR] <https://builds.apache.org/job/Phoenix-4.x-HBase-1.0/ws/phoenix-core/src/main/java/org/apache/phoenix/query/ConnectionQueryServicesImpl.java>:[254,15]
';' expected
[ERROR] <https://builds.apache.org/job/Phoenix-4.x-HBase-1.0/ws/phoenix-core/src/main/java/org/apache/phoenix/query/ConnectionQueryServicesImpl.java>:[254,55]
<identifier> expected
[ERROR] <https://builds.apache.org/job/Phoenix-4.x-HBase-1.0/ws/phoenix-core/src/main/java/org/apache/phoenix/query/ConnectionQueryServicesImpl.java>:[255,1]
illegal start of type
[ERROR] <https://builds.apache.org/job/Phoenix-4.x-HBase-1.0/ws/phoenix-core/src/main/java/org/apache/phoenix/query/ConnectionQueryServicesImpl.java>:[255,7]
';' expected
[ERROR] <https://builds.apache.org/job/Phoenix-4.x-HBase-1.0/ws/phoenix-core/src/main/java/org/apache/phoenix/query/ConnectionQueryServicesImpl.java>:[255,10]
illegal start of type
[ERROR] <https://builds.apache.org/job/Phoenix-4.x-HBase-1.0/ws/phoenix-core/src/main/java/org/apache/phoenix/query/ConnectionQueryServicesImpl.java>:[255,15]
';' expected
[ERROR] <https://builds.apache.org/job/Phoenix-4.x-HBase-1.0/ws/phoenix-core/src/main/java/org/apache/phoenix/query/ConnectionQueryServicesImpl.java>:[255,59]
<identifier> expected
[INFO] 20 errors 
[INFO] -------------------------------------------------------------
[INFO] ------------------------------------------------------------------------
[INFO] Reactor Summary:
[INFO] 
[INFO] Apache Phoenix .................................... SUCCESS [6.479s]
[INFO] Phoenix Core ...................................... FAILURE [33.806s]
[INFO] Phoenix - Flume ................................... SKIPPED
[INFO] Phoenix - Pig ..................................... SKIPPED
[INFO] Phoenix Query Server Client ....................... SKIPPED
[INFO] Phoenix Query Server .............................. SKIPPED
[INFO] Phoenix - Pherf ................................... SKIPPED
[INFO] Phoenix - Spark ................................... SKIPPED
[INFO] Phoenix Assembly .................................. SKIPPED
[INFO] Phoenix - Tracing Web Application ................. SKIPPED
[INFO] ------------------------------------------------------------------------
[INFO] BUILD FAILURE
[INFO] ------------------------------------------------------------------------
[INFO] Total time: 41.549s
[INFO] Finished at: Mon Feb 15 06:41:46 UTC 2016
[INFO] Final Memory: 45M/1292M
[INFO] ------------------------------------------------------------------------
[ERROR] Failed to execute goal org.apache.maven.plugins:maven-compiler-plugin:3.0:compile
(default-compile) on project phoenix-core: Compilation failure: Compilation failure:
[ERROR] <https://builds.apache.org/job/Phoenix-4.x-HBase-1.0/ws/phoenix-core/src/main/java/org/apache/phoenix/query/ConnectionQueryServicesImpl.java>:[252,1]
illegal start of type
[ERROR] <https://builds.apache.org/job/Phoenix-4.x-HBase-1.0/ws/phoenix-core/src/main/java/org/apache/phoenix/query/ConnectionQueryServicesImpl.java>:[252,7]
';' expected
[ERROR] <https://builds.apache.org/job/Phoenix-4.x-HBase-1.0/ws/phoenix-core/src/main/java/org/apache/phoenix/query/ConnectionQueryServicesImpl.java>:[252,10]
illegal start of type
[ERROR] <https://builds.apache.org/job/Phoenix-4.x-HBase-1.0/ws/phoenix-core/src/main/java/org/apache/phoenix/query/ConnectionQueryServicesImpl.java>:[252,15]
';' expected
[ERROR] <https://builds.apache.org/job/Phoenix-4.x-HBase-1.0/ws/phoenix-core/src/main/java/org/apache/phoenix/query/ConnectionQueryServicesImpl.java>:[252,46]
<identifier> expected
[ERROR] <https://builds.apache.org/job/Phoenix-4.x-HBase-1.0/ws/phoenix-core/src/main/java/org/apache/phoenix/query/ConnectionQueryServicesImpl.java>:[253,1]
illegal start of type
[ERROR] <https://builds.apache.org/job/Phoenix-4.x-HBase-1.0/ws/phoenix-core/src/main/java/org/apache/phoenix/query/ConnectionQueryServicesImpl.java>:[253,7]
';' expected
[ERROR] <https://builds.apache.org/job/Phoenix-4.x-HBase-1.0/ws/phoenix-core/src/main/java/org/apache/phoenix/query/ConnectionQueryServicesImpl.java>:[253,10]
illegal start of type
[ERROR] <https://builds.apache.org/job/Phoenix-4.x-HBase-1.0/ws/phoenix-core/src/main/java/org/apache/phoenix/query/ConnectionQueryServicesImpl.java>:[253,15]
';' expected
[ERROR] <https://builds.apache.org/job/Phoenix-4.x-HBase-1.0/ws/phoenix-core/src/main/java/org/apache/phoenix/query/ConnectionQueryServicesImpl.java>:[253,34]
<identifier> expected
[ERROR] <https://builds.apache.org/job/Phoenix-4.x-HBase-1.0/ws/phoenix-core/src/main/java/org/apache/phoenix/query/ConnectionQueryServicesImpl.java>:[254,1]
illegal start of type
[ERROR] <https://builds.apache.org/job/Phoenix-4.x-HBase-1.0/ws/phoenix-core/src/main/java/org/apache/phoenix/query/ConnectionQueryServicesImpl.java>:[254,7]
';' expected
[ERROR] <https://builds.apache.org/job/Phoenix-4.x-HBase-1.0/ws/phoenix-core/src/main/java/org/apache/phoenix/query/ConnectionQueryServicesImpl.java>:[254,10]
illegal start of type
[ERROR] <https://builds.apache.org/job/Phoenix-4.x-HBase-1.0/ws/phoenix-core/src/main/java/org/apache/phoenix/query/ConnectionQueryServicesImpl.java>:[254,15]
';' expected
[ERROR] <https://builds.apache.org/job/Phoenix-4.x-HBase-1.0/ws/phoenix-core/src/main/java/org/apache/phoenix/query/ConnectionQueryServicesImpl.java>:[254,55]
<identifier> expected
[ERROR] <https://builds.apache.org/job/Phoenix-4.x-HBase-1.0/ws/phoenix-core/src/main/java/org/apache/phoenix/query/ConnectionQueryServicesImpl.java>:[255,1]
illegal start of type
[ERROR] <https://builds.apache.org/job/Phoenix-4.x-HBase-1.0/ws/phoenix-core/src/main/java/org/apache/phoenix/query/ConnectionQueryServicesImpl.java>:[255,7]
';' expected
[ERROR] <https://builds.apache.org/job/Phoenix-4.x-HBase-1.0/ws/phoenix-core/src/main/java/org/apache/phoenix/query/ConnectionQueryServicesImpl.java>:[255,10]
illegal start of type
[ERROR] <https://builds.apache.org/job/Phoenix-4.x-HBase-1.0/ws/phoenix-core/src/main/java/org/apache/phoenix/query/ConnectionQueryServicesImpl.java>:[255,15]
';' expected
[ERROR] <https://builds.apache.org/job/Phoenix-4.x-HBase-1.0/ws/phoenix-core/src/main/java/org/apache/phoenix/query/ConnectionQueryServicesImpl.java>:[255,59]
<identifier> expected
[ERROR] -> [Help 1]
[ERROR] 
[ERROR] To see the full stack trace of the errors, re-run Maven with the -e switch.
[ERROR] Re-run Maven using the -X switch to enable full debug logging.
[ERROR] 
[ERROR] For more information about the errors and possible solutions, please read the following
articles:
[ERROR] [Help 1] http://cwiki.apache.org/confluence/display/MAVEN/MojoFailureException
[ERROR] 
[ERROR] After correcting the problems, you can resume the build with the command
[ERROR]   mvn <goals> -rf :phoenix-core
Build step 'Invoke top-level Maven targets' marked build as failure
Archiving artifacts
Compressed 211.99 MB of artifacts by 99.9% relative to #383
Recording test results
ERROR: Publisher 'Publish JUnit test result report' failed: Test reports were found but none
of them are new. Did tests run? 
For example, <https://builds.apache.org/job/Phoenix-4.x-HBase-1.0/384/artifact/phoenix-flume/target/failsafe-reports/TEST-org.apache.phoenix.flume.PhoenixSinkIT.xml>
is 1 day 4 hr old



Mime
View raw message