phoenix-commits mailing list archives

Site index · List index
Message view « Date » · « Thread »
Top « Date » · « Thread »
From Apache Jenkins Server <jenk...@builds.apache.org>
Subject Build failed in Jenkins: Phoenix | Master #1132
Date Fri, 12 Feb 2016 21:39:18 GMT
See <https://builds.apache.org/job/Phoenix-master/1132/changes>

Changes:

[jyates] PHOENIX-2674 PhoenixMapReduceUtil#setInput doesn't honor condition

------------------------------------------
[...truncated 886 lines...]
testSecondaryIndex[transactional = false , mutable = true , localIndex = false, directApi
= true](org.apache.phoenix.end2end.IndexToolIT)  Time elapsed: 20.347 sec  <<< FAILURE!
java.lang.AssertionError: expected:<0> but was:<-1>
	at org.apache.phoenix.end2end.IndexToolIT.testSecondaryIndex(IndexToolIT.java:162)

testSecondaryIndex[transactional = false , mutable = true , localIndex = true, directApi =
false](org.apache.phoenix.end2end.IndexToolIT)  Time elapsed: 24.066 sec  <<< FAILURE!
java.lang.AssertionError: expected:<0> but was:<-1>
	at org.apache.phoenix.end2end.IndexToolIT.testSecondaryIndex(IndexToolIT.java:162)

testSecondaryIndex[transactional = false , mutable = true , localIndex = true, directApi =
true](org.apache.phoenix.end2end.IndexToolIT)  Time elapsed: 23.802 sec  <<< FAILURE!
java.lang.AssertionError: expected:<0> but was:<-1>
	at org.apache.phoenix.end2end.IndexToolIT.testSecondaryIndex(IndexToolIT.java:162)

testSecondaryIndex[transactional = true , mutable = false , localIndex = false, directApi
= false](org.apache.phoenix.end2end.IndexToolIT)  Time elapsed: 22.112 sec  <<< FAILURE!
java.lang.AssertionError: expected:<0> but was:<-1>
	at org.apache.phoenix.end2end.IndexToolIT.testSecondaryIndex(IndexToolIT.java:162)

testSecondaryIndex[transactional = true , mutable = false , localIndex = false, directApi
= true](org.apache.phoenix.end2end.IndexToolIT)  Time elapsed: 21.618 sec  <<< FAILURE!
java.lang.AssertionError: expected:<0> but was:<-1>
	at org.apache.phoenix.end2end.IndexToolIT.testSecondaryIndex(IndexToolIT.java:162)

testSecondaryIndex[transactional = true , mutable = false , localIndex = true, directApi =
false](org.apache.phoenix.end2end.IndexToolIT)  Time elapsed: 21.983 sec  <<< FAILURE!
java.lang.AssertionError: expected:<0> but was:<-1>
	at org.apache.phoenix.end2end.IndexToolIT.testSecondaryIndex(IndexToolIT.java:162)

testSecondaryIndex[transactional = true , mutable = false , localIndex = true, directApi =
true](org.apache.phoenix.end2end.IndexToolIT)  Time elapsed: 21.25 sec  <<< FAILURE!
java.lang.AssertionError: expected:<0> but was:<-1>
	at org.apache.phoenix.end2end.IndexToolIT.testSecondaryIndex(IndexToolIT.java:162)

testSecondaryIndex[transactional = true , mutable = true , localIndex = false, directApi =
false](org.apache.phoenix.end2end.IndexToolIT)  Time elapsed: 18.331 sec  <<< FAILURE!
java.lang.AssertionError: expected:<0> but was:<-1>
	at org.apache.phoenix.end2end.IndexToolIT.testSecondaryIndex(IndexToolIT.java:162)

testSecondaryIndex[transactional = true , mutable = true , localIndex = false, directApi =
true](org.apache.phoenix.end2end.IndexToolIT)  Time elapsed: 21.687 sec  <<< FAILURE!
java.lang.AssertionError: expected:<0> but was:<-1>
	at org.apache.phoenix.end2end.IndexToolIT.testSecondaryIndex(IndexToolIT.java:162)

testSecondaryIndex[transactional = true , mutable = true , localIndex = true, directApi =
false](org.apache.phoenix.end2end.IndexToolIT)  Time elapsed: 19.46 sec  <<< FAILURE!
java.lang.AssertionError: expected:<0> but was:<-1>
	at org.apache.phoenix.end2end.IndexToolIT.testSecondaryIndex(IndexToolIT.java:162)

testSecondaryIndex[transactional = true , mutable = true , localIndex = true, directApi =
true](org.apache.phoenix.end2end.IndexToolIT)  Time elapsed: 19.944 sec  <<< FAILURE!
java.lang.AssertionError: expected:<0> but was:<-1>
	at org.apache.phoenix.end2end.IndexToolIT.testSecondaryIndex(IndexToolIT.java:162)

Tests run: 9, Failures: 0, Errors: 0, Skipped: 0, Time elapsed: 386.762 sec - in org.apache.phoenix.end2end.CsvBulkLoadToolIT
Running org.apache.phoenix.end2end.TenantSpecificTablesDMLIT
Tests run: 17, Failures: 0, Errors: 0, Skipped: 0, Time elapsed: 55.091 sec - in org.apache.phoenix.end2end.TenantSpecificTablesDDLIT
Tests run: 12, Failures: 0, Errors: 0, Skipped: 0, Time elapsed: 137.585 sec - in org.apache.phoenix.end2end.StatsCollectorIT
Running org.apache.phoenix.end2end.TransactionalViewIT
Running org.apache.phoenix.end2end.UnionAllIT
Tests run: 16, Failures: 0, Errors: 0, Skipped: 0, Time elapsed: 39.613 sec - in org.apache.phoenix.end2end.TenantSpecificTablesDMLIT
Running org.apache.phoenix.end2end.ViewIT
Running org.apache.phoenix.end2end.UserDefinedFunctionsIT
Tests run: 13, Failures: 0, Errors: 0, Skipped: 0, Time elapsed: 36.766 sec - in org.apache.phoenix.end2end.UnionAllIT
Running org.apache.phoenix.end2end.index.ImmutableIndexWithStatsIT
Tests run: 2, Failures: 0, Errors: 0, Skipped: 0, Time elapsed: 75.058 sec - in org.apache.phoenix.end2end.TransactionalViewIT
Running org.apache.phoenix.end2end.index.MutableIndexFailureIT
Tests run: 1, Failures: 0, Errors: 0, Skipped: 0, Time elapsed: 16.45 sec - in org.apache.phoenix.end2end.index.ImmutableIndexWithStatsIT
Tests run: 13, Failures: 0, Errors: 0, Skipped: 0, Time elapsed: 55.93 sec - in org.apache.phoenix.end2end.UserDefinedFunctionsIT
Running org.apache.phoenix.end2end.index.MutableIndexReplicationIT
Running org.apache.phoenix.end2end.index.txn.TxWriteFailureIT
Tests run: 1, Failures: 0, Errors: 0, Skipped: 0, Time elapsed: 32.944 sec - in org.apache.phoenix.end2end.index.MutableIndexReplicationIT
Running org.apache.phoenix.hbase.index.FailForUnsupportedHBaseVersionsIT
Running org.apache.phoenix.execute.PartialCommitIT
Tests run: 12, Failures: 0, Errors: 0, Skipped: 0, Time elapsed: 10.813 sec - in org.apache.phoenix.execute.PartialCommitIT
Tests run: 2, Failures: 0, Errors: 0, Skipped: 0, Time elapsed: 24.875 sec - in org.apache.phoenix.hbase.index.FailForUnsupportedHBaseVersionsIT
Tests run: 8, Failures: 0, Errors: 0, Skipped: 0, Time elapsed: 55.367 sec - in org.apache.phoenix.end2end.index.txn.TxWriteFailureIT
Running org.apache.phoenix.hbase.index.balancer.IndexLoadBalancerIT
Running org.apache.phoenix.hbase.index.covered.EndToEndCoveredColumnsIndexBuilderIT
Tests run: 2, Failures: 0, Errors: 0, Skipped: 0, Time elapsed: 27.496 sec - in org.apache.phoenix.hbase.index.covered.EndToEndCoveredColumnsIndexBuilderIT
Running org.apache.phoenix.hbase.index.covered.example.EndToEndCoveredIndexingIT
Tests run: 7, Failures: 0, Errors: 2, Skipped: 2, Time elapsed: 167.945 sec <<< FAILURE!
- in org.apache.phoenix.end2end.index.MutableIndexFailureIT
testWriteFailureDisablesLocalIndex[transactional = false](org.apache.phoenix.end2end.index.MutableIndexFailureIT)
 Time elapsed: 16.736 sec  <<< ERROR!
org.apache.phoenix.execute.CommitException: 
org.apache.hadoop.hbase.client.RetriesExhaustedWithDetailsException: Failed 1 action: org.apache.hadoop.hbase.DoNotRetryIOException:
Failed 2 actions: Table '_LOCAL_IDX_T' was not found, got: T.: 2 times, 
	at org.apache.phoenix.util.ServerUtil.createIOException(ServerUtil.java:71)
	at org.apache.phoenix.index.PhoenixIndexFailurePolicy.handleFailure(PhoenixIndexFailurePolicy.java:113)
	at org.apache.phoenix.hbase.index.write.IndexWriter.writeAndKillYourselfOnFailure(IndexWriter.java:149)
	at org.apache.phoenix.hbase.index.write.IndexWriter.writeAndKillYourselfOnFailure(IndexWriter.java:134)
	at org.apache.phoenix.hbase.index.Indexer.doPostWithExceptions(Indexer.java:404)
	at org.apache.phoenix.hbase.index.Indexer.doPost(Indexer.java:353)
	at org.apache.phoenix.hbase.index.Indexer.postBatchMutate(Indexer.java:348)
	at org.apache.hadoop.hbase.regionserver.RegionCoprocessorHost$36.call(RegionCoprocessorHost.java:1006)
	at org.apache.hadoop.hbase.regionserver.RegionCoprocessorHost$RegionOperation.call(RegionCoprocessorHost.java:1673)
	at org.apache.hadoop.hbase.regionserver.RegionCoprocessorHost.execOperation(RegionCoprocessorHost.java:1748)
	at org.apache.hadoop.hbase.regionserver.RegionCoprocessorHost.execOperation(RegionCoprocessorHost.java:1705)
	at org.apache.hadoop.hbase.regionserver.RegionCoprocessorHost.postBatchMutate(RegionCoprocessorHost.java:1002)
	at org.apache.hadoop.hbase.regionserver.HRegion.doMiniBatchMutation(HRegion.java:3162)
	at org.apache.hadoop.hbase.regionserver.HRegion.batchMutate(HRegion.java:2801)
	at org.apache.hadoop.hbase.regionserver.HRegion.batchMutate(HRegion.java:2743)
	at org.apache.hadoop.hbase.regionserver.RSRpcServices.doBatchOp(RSRpcServices.java:692)
	at org.apache.hadoop.hbase.regionserver.RSRpcServices.doNonAtomicRegionMutation(RSRpcServices.java:654)
	at org.apache.hadoop.hbase.regionserver.RSRpcServices.multi(RSRpcServices.java:2031)
	at org.apache.hadoop.hbase.protobuf.generated.ClientProtos$ClientService$2.callBlockingMethod(ClientProtos.java:32213)
	at org.apache.hadoop.hbase.ipc.RpcServer.call(RpcServer.java:2114)
	at org.apache.hadoop.hbase.ipc.CallRunner.run(CallRunner.java:101)
	at org.apache.hadoop.hbase.ipc.RpcExecutor.consumerLoop(RpcExecutor.java:130)
	at org.apache.hadoop.hbase.ipc.RpcExecutor$1.run(RpcExecutor.java:107)
	at java.lang.Thread.run(Thread.java:745)
Caused by: org.apache.hadoop.hbase.client.RetriesExhaustedWithDetailsException: Failed 2 actions:
Table '_LOCAL_IDX_T' was not found, got: T.: 2 times, 
	at org.apache.hadoop.hbase.client.AsyncProcess$BatchErrors.makeException(AsyncProcess.java:228)
	at org.apache.hadoop.hbase.client.AsyncProcess$BatchErrors.access$1700(AsyncProcess.java:208)
	at org.apache.hadoop.hbase.client.AsyncProcess$AsyncRequestFutureImpl.getErrors(AsyncProcess.java:1594)
	at org.apache.hadoop.hbase.client.HTable.batch(HTable.java:936)
	at org.apache.hadoop.hbase.client.HTable.batch(HTable.java:950)
	at org.apache.hadoop.hbase.client.HTableWrapper.batch(HTableWrapper.java:255)
	at org.apache.phoenix.hbase.index.write.ParallelWriterIndexCommitter$1.call(ParallelWriterIndexCommitter.java:171)
	at org.apache.phoenix.hbase.index.write.ParallelWriterIndexCommitter$1.call(ParallelWriterIndexCommitter.java:129)
	at java.util.concurrent.FutureTask.run(FutureTask.java:262)
	at java.util.concurrent.ThreadPoolExecutor.runWorker(ThreadPoolExecutor.java:1145)
	at java.util.concurrent.ThreadPoolExecutor$Worker.run(ThreadPoolExecutor.java:615)
	... 1 more
: 1 time, 
	at org.apache.phoenix.end2end.index.MutableIndexFailureIT.helpTestWriteFailureDisablesIndex(MutableIndexFailureIT.java:230)
	at org.apache.phoenix.end2end.index.MutableIndexFailureIT.testWriteFailureDisablesLocalIndex(MutableIndexFailureIT.java:123)
Caused by: org.apache.hadoop.hbase.client.RetriesExhaustedWithDetailsException: 
Failed 1 action: org.apache.hadoop.hbase.DoNotRetryIOException: Failed 2 actions: Table '_LOCAL_IDX_T'
was not found, got: T.: 2 times, 
	at org.apache.phoenix.util.ServerUtil.createIOException(ServerUtil.java:71)
	at org.apache.phoenix.index.PhoenixIndexFailurePolicy.handleFailure(PhoenixIndexFailurePolicy.java:113)
	at org.apache.phoenix.hbase.index.write.IndexWriter.writeAndKillYourselfOnFailure(IndexWriter.java:149)
	at org.apache.phoenix.hbase.index.write.IndexWriter.writeAndKillYourselfOnFailure(IndexWriter.java:134)
	at org.apache.phoenix.hbase.index.Indexer.doPostWithExceptions(Indexer.java:404)
	at org.apache.phoenix.hbase.index.Indexer.doPost(Indexer.java:353)
	at org.apache.phoenix.hbase.index.Indexer.postBatchMutate(Indexer.java:348)
	at org.apache.hadoop.hbase.regionserver.RegionCoprocessorHost$36.call(RegionCoprocessorHost.java:1006)
	at org.apache.hadoop.hbase.regionserver.RegionCoprocessorHost$RegionOperation.call(RegionCoprocessorHost.java:1673)
	at org.apache.hadoop.hbase.regionserver.RegionCoprocessorHost.execOperation(RegionCoprocessorHost.java:1748)
	at org.apache.hadoop.hbase.regionserver.RegionCoprocessorHost.execOperation(RegionCoprocessorHost.java:1705)
	at org.apache.hadoop.hbase.regionserver.RegionCoprocessorHost.postBatchMutate(RegionCoprocessorHost.java:1002)
	at org.apache.hadoop.hbase.regionserver.HRegion.doMiniBatchMutation(HRegion.java:3162)
	at org.apache.hadoop.hbase.regionserver.HRegion.batchMutate(HRegion.java:2801)
	at org.apache.hadoop.hbase.regionserver.HRegion.batchMutate(HRegion.java:2743)
	at org.apache.hadoop.hbase.regionserver.RSRpcServices.doBatchOp(RSRpcServices.java:692)
	at org.apache.hadoop.hbase.regionserver.RSRpcServices.doNonAtomicRegionMutation(RSRpcServices.java:654)
	at org.apache.hadoop.hbase.regionserver.RSRpcServices.multi(RSRpcServices.java:2031)
	at org.apache.hadoop.hbase.protobuf.generated.ClientProtos$ClientService$2.callBlockingMethod(ClientProtos.java:32213)
	at org.apache.hadoop.hbase.ipc.RpcServer.call(RpcServer.java:2114)
	at org.apache.hadoop.hbase.ipc.CallRunner.run(CallRunner.java:101)
	at org.apache.hadoop.hbase.ipc.RpcExecutor.consumerLoop(RpcExecutor.java:130)
	at org.apache.hadoop.hbase.ipc.RpcExecutor$1.run(RpcExecutor.java:107)
	at java.lang.Thread.run(Thread.java:745)
Caused by: org.apache.hadoop.hbase.client.RetriesExhaustedWithDetailsException: Failed 2 actions:
Table '_LOCAL_IDX_T' was not found, got: T.: 2 times, 
	at org.apache.hadoop.hbase.client.AsyncProcess$BatchErrors.makeException(AsyncProcess.java:228)
	at org.apache.hadoop.hbase.client.AsyncProcess$BatchErrors.access$1700(AsyncProcess.java:208)
	at org.apache.hadoop.hbase.client.AsyncProcess$AsyncRequestFutureImpl.getErrors(AsyncProcess.java:1594)
	at org.apache.hadoop.hbase.client.HTable.batch(HTable.java:936)
	at org.apache.hadoop.hbase.client.HTable.batch(HTable.java:950)
	at org.apache.hadoop.hbase.client.HTableWrapper.batch(HTableWrapper.java:255)
	at org.apache.phoenix.hbase.index.write.ParallelWriterIndexCommitter$1.call(ParallelWriterIndexCommitter.java:171)
	at org.apache.phoenix.hbase.index.write.ParallelWriterIndexCommitter$1.call(ParallelWriterIndexCommitter.java:129)
	at java.util.concurrent.FutureTask.run(FutureTask.java:262)
	at java.util.concurrent.ThreadPoolExecutor.runWorker(ThreadPoolExecutor.java:1145)
	at java.util.concurrent.ThreadPoolExecutor$Worker.run(ThreadPoolExecutor.java:615)
	... 1 more
: 1 time, 
	at org.apache.phoenix.end2end.index.MutableIndexFailureIT.helpTestWriteFailureDisablesIndex(MutableIndexFailureIT.java:230)
	at org.apache.phoenix.end2end.index.MutableIndexFailureIT.testWriteFailureDisablesLocalIndex(MutableIndexFailureIT.java:123)

testWriteFailureDisablesLocalIndex[transactional = false](org.apache.phoenix.end2end.index.MutableIndexFailureIT)
 Time elapsed: 16.736 sec  <<< ERROR!
org.apache.phoenix.exception.PhoenixIOException: org.apache.phoenix.exception.PhoenixIOException:
Table '_LOCAL_IDX_T' was not found, got: T.
Caused by: java.util.concurrent.ExecutionException: org.apache.phoenix.exception.PhoenixIOException:
Table '_LOCAL_IDX_T' was not found, got: T.
Caused by: org.apache.phoenix.exception.PhoenixIOException: Table '_LOCAL_IDX_T' was not found,
got: T.
Caused by: org.apache.hadoop.hbase.TableNotFoundException: Table '_LOCAL_IDX_T' was not found,
got: T.

Tests run: 46, Failures: 0, Errors: 0, Skipped: 0, Time elapsed: 220.08 sec - in org.apache.phoenix.end2end.ViewIT
Running org.apache.phoenix.hbase.index.covered.example.EndtoEndIndexingWithCompressionIT
Running org.apache.phoenix.hbase.index.covered.example.FailWithoutRetriesIT
Tests run: 1, Failures: 0, Errors: 0, Skipped: 0, Time elapsed: 6.943 sec - in org.apache.phoenix.hbase.index.covered.example.FailWithoutRetriesIT
Running org.apache.phoenix.iterate.RoundRobinResultIteratorWithStatsIT
Tests run: 1, Failures: 0, Errors: 0, Skipped: 0, Time elapsed: 13.576 sec - in org.apache.phoenix.iterate.RoundRobinResultIteratorWithStatsIT
Tests run: 1, Failures: 0, Errors: 0, Skipped: 1, Time elapsed: 0 sec - in org.apache.phoenix.iterate.ScannerLeaseRenewalIT
Tests run: 9, Failures: 0, Errors: 0, Skipped: 1, Time elapsed: 139.177 sec - in org.apache.phoenix.hbase.index.balancer.IndexLoadBalancerIT
Running org.apache.phoenix.monitoring.PhoenixMetricsIT
Running org.apache.phoenix.rpc.PhoenixClientRpcIT
Tests run: 2, Failures: 0, Errors: 0, Skipped: 0, Time elapsed: 18.009 sec - in org.apache.phoenix.rpc.PhoenixClientRpcIT
Running org.apache.phoenix.rpc.PhoenixServerRpcIT
Tests run: 2, Failures: 0, Errors: 0, Skipped: 0, Time elapsed: 28.209 sec - in org.apache.phoenix.rpc.PhoenixServerRpcIT
Tests run: 11, Failures: 0, Errors: 0, Skipped: 0, Time elapsed: 209.075 sec - in org.apache.phoenix.hbase.index.covered.example.EndToEndCoveredIndexingIT
Tests run: 18, Failures: 0, Errors: 0, Skipped: 0, Time elapsed: 108.021 sec - in org.apache.phoenix.monitoring.PhoenixMetricsIT
Tests run: 11, Failures: 0, Errors: 0, Skipped: 0, Time elapsed: 212.945 sec - in org.apache.phoenix.hbase.index.covered.example.EndtoEndIndexingWithCompressionIT

Results :

Failed tests: 
  IndexToolIT.testSecondaryIndex:162 expected:<0> but was:<-1>
  IndexToolIT.testSecondaryIndex:162 expected:<0> but was:<-1>
  IndexToolIT.testSecondaryIndex:162 expected:<0> but was:<-1>
  IndexToolIT.testSecondaryIndex:162 expected:<0> but was:<-1>
  IndexToolIT.testSecondaryIndex:162 expected:<0> but was:<-1>
  IndexToolIT.testSecondaryIndex:162 expected:<0> but was:<-1>
  IndexToolIT.testSecondaryIndex:162 expected:<0> but was:<-1>
  IndexToolIT.testSecondaryIndex:162 expected:<0> but was:<-1>
  IndexToolIT.testSecondaryIndex:162 expected:<0> but was:<-1>
  IndexToolIT.testSecondaryIndex:162 expected:<0> but was:<-1>
  IndexToolIT.testSecondaryIndex:162 expected:<0> but was:<-1>
  IndexToolIT.testSecondaryIndex:162 expected:<0> but was:<-1>
  IndexToolIT.testSecondaryIndex:162 expected:<0> but was:<-1>
  IndexToolIT.testSecondaryIndex:162 expected:<0> but was:<-1>
  IndexToolIT.testSecondaryIndex:162 expected:<0> but was:<-1>
  IndexToolIT.testSecondaryIndex:162 expected:<0> but was:<-1>
  MutableIndexToolIT.testMutableIndexWithUpdates:107 expected:<0> but was:<-1>
Tests in error: 
org.apache.phoenix.end2end.index.MutableIndexFailureIT.testWriteFailureDisablesLocalIndex[transactional
= false](org.apache.phoenix.end2end.index.MutableIndexFailureIT)
  Run 1: MutableIndexFailureIT.testWriteFailureDisablesLocalIndex:123->helpTestWriteFailureDisablesIndex:230
? Commit
  Run 2: MutableIndexFailureIT>BaseOwnClusterHBaseManagedTimeIT.cleanUpAfterTest:29->BaseTest.deletePriorTables:884->BaseTest.deletePriorTables:895->BaseTest.deletePriorTables:929
? PhoenixIO


Tests run: 324, Failures: 17, Errors: 1, Skipped: 4

[INFO] 
[INFO] --- maven-failsafe-plugin:2.19.1:verify (ClientManagedTimeTests) @ phoenix-core ---
[INFO] ------------------------------------------------------------------------
[INFO] Reactor Summary:
[INFO] 
[INFO] Apache Phoenix .................................... SUCCESS [9.379s]
[INFO] Phoenix Core ...................................... FAILURE [1:08:37.344s]
[INFO] Phoenix - Flume ................................... SKIPPED
[INFO] Phoenix - Pig ..................................... SKIPPED
[INFO] Phoenix Query Server Client ....................... SKIPPED
[INFO] Phoenix Query Server .............................. SKIPPED
[INFO] Phoenix - Pherf ................................... SKIPPED
[INFO] Phoenix - Spark ................................... SKIPPED
[INFO] Phoenix Assembly .................................. SKIPPED
[INFO] Phoenix - Tracing Web Application ................. SKIPPED
[INFO] ------------------------------------------------------------------------
[INFO] BUILD FAILURE
[INFO] ------------------------------------------------------------------------
[INFO] Total time: 1:08:47.343s
[INFO] Finished at: Fri Feb 12 21:36:14 UTC 2016
[INFO] Final Memory: 49M/999M
[INFO] ------------------------------------------------------------------------
[ERROR] Failed to execute goal org.apache.maven.plugins:maven-failsafe-plugin:2.19.1:verify
(ClientManagedTimeTests) on project phoenix-core: There are test failures.
[ERROR] 
[ERROR] Please refer to /x1/jenkins/jenkins-slave/workspace/Phoenix-master/phoenix-core/target/failsafe-reports
for the individual test results.
[ERROR] -> [Help 1]
[ERROR] 
[ERROR] To see the full stack trace of the errors, re-run Maven with the -e switch.
[ERROR] Re-run Maven using the -X switch to enable full debug logging.
[ERROR] 
[ERROR] For more information about the errors and possible solutions, please read the following
articles:
[ERROR] [Help 1] http://cwiki.apache.org/confluence/display/MAVEN/MojoFailureException
[ERROR] 
[ERROR] After correcting the problems, you can resume the build with the command
[ERROR]   mvn <goals> -rf :phoenix-core
Build step 'Invoke top-level Maven targets' marked build as failure
Archiving artifacts
Compressed 942.37 MB of artifacts by 43.9% relative to #1130
Updating PHOENIX-2674
Recording test results

Mime
View raw message