phoenix-commits mailing list archives

Site index · List index
Message view « Date » · « Thread »
Top « Date » · « Thread »
From Apache Jenkins Server <jenk...@builds.apache.org>
Subject Build failed in Jenkins: Phoenix-4.x-HBase-1.0 #380
Date Fri, 12 Feb 2016 21:22:25 GMT
See <https://builds.apache.org/job/Phoenix-4.x-HBase-1.0/380/changes>

Changes:

[jyates] PHOENIX-2674 PhoenixMapReduceUtil#setInput doesn't honor condition

------------------------------------------
[...truncated 908 lines...]
org.apache.phoenix.exception.PhoenixIOException: 
org.apache.phoenix.exception.PhoenixIOException: org.apache.hadoop.hbase.regionserver.NoSuchColumnFamilyException:
Column family CF does not exist in region NEWCFTTLTEST,\x05\x00\x00,1455311213805.031577b087e9f5e6f8c97bda603660fa.
in table 'NEWCFTTLTEST', {TABLE_ATTRIBUTES => {coprocessor$1 => '|org.apache.phoenix.coprocessor.ScanRegionObserver|805306366|',
coprocessor$2 => '|org.apache.phoenix.coprocessor.UngroupedAggregateRegionObserver|805306366|',
coprocessor$3 => '|org.apache.phoenix.coprocessor.GroupedAggregateRegionObserver|805306366|',
coprocessor$4 => '|org.apache.phoenix.coprocessor.ServerCachingEndpointImpl|805306366|',
coprocessor$5 => '|org.apache.phoenix.hbase.index.Indexer|805306366|index.builder=org.apache.phoenix.index.PhoenixIndexBuilder,org.apache.hadoop.hbase.index.codec.class=org.apache.phoenix.index.PhoenixIndexCodec',
coprocessor$6 => '|org.apache.hadoop.hbase.regionserver.LocalIndexSplitter|805306366|'},
{NAME => '0', DATA_BLOCK_ENCODING => 'FAST_DIFF', BLOOMFILTER => 'ROW', REPLICATION_SCOPE
=> '0', COMPRESSION => 'NONE', VERSIONS => '1', TTL => '1000 SECONDS (16 MINUTES
40 SECONDS)', MIN_VERSIONS => '0', KEEP_DELETED_CELLS => 'FALSE', BLOCKSIZE => '65536',
IN_MEMORY => 'false', BLOCKCACHE => 'true'}
	at org.apache.hadoop.hbase.regionserver.HRegion.checkFamily(HRegion.java:6093)
	at org.apache.hadoop.hbase.regionserver.HRegion.getScanner(HRegion.java:2176)
	at org.apache.hadoop.hbase.regionserver.HRegion.getScanner(HRegion.java:2156)
	at org.apache.hadoop.hbase.regionserver.RSRpcServices.scan(RSRpcServices.java:2064)
	at org.apache.hadoop.hbase.protobuf.generated.ClientProtos$ClientService$2.callBlockingMethod(ClientProtos.java:31443)
	at org.apache.hadoop.hbase.ipc.RpcServer.call(RpcServer.java:2033)
	at org.apache.hadoop.hbase.ipc.CallRunner.run(CallRunner.java:107)
	at org.apache.hadoop.hbase.ipc.RpcExecutor.consumerLoop(RpcExecutor.java:130)
	at org.apache.hadoop.hbase.ipc.RpcExecutor$1.run(RpcExecutor.java:107)
	at java.lang.Thread.run(Thread.java:745)

Caused by: java.util.concurrent.ExecutionException: 
org.apache.phoenix.exception.PhoenixIOException: org.apache.hadoop.hbase.regionserver.NoSuchColumnFamilyException:
Column family CF does not exist in region NEWCFTTLTEST,\x05\x00\x00,1455311213805.031577b087e9f5e6f8c97bda603660fa.
in table 'NEWCFTTLTEST', {TABLE_ATTRIBUTES => {coprocessor$1 => '|org.apache.phoenix.coprocessor.ScanRegionObserver|805306366|',
coprocessor$2 => '|org.apache.phoenix.coprocessor.UngroupedAggregateRegionObserver|805306366|',
coprocessor$3 => '|org.apache.phoenix.coprocessor.GroupedAggregateRegionObserver|805306366|',
coprocessor$4 => '|org.apache.phoenix.coprocessor.ServerCachingEndpointImpl|805306366|',
coprocessor$5 => '|org.apache.phoenix.hbase.index.Indexer|805306366|index.builder=org.apache.phoenix.index.PhoenixIndexBuilder,org.apache.hadoop.hbase.index.codec.class=org.apache.phoenix.index.PhoenixIndexCodec',
coprocessor$6 => '|org.apache.hadoop.hbase.regionserver.LocalIndexSplitter|805306366|'},
{NAME => '0', DATA_BLOCK_ENCODING => 'FAST_DIFF', BLOOMFILTER => 'ROW', REPLICATION_SCOPE
=> '0', COMPRESSION => 'NONE', VERSIONS => '1', TTL => '1000 SECONDS (16 MINUTES
40 SECONDS)', MIN_VERSIONS => '0', KEEP_DELETED_CELLS => 'FALSE', BLOCKSIZE => '65536',
IN_MEMORY => 'false', BLOCKCACHE => 'true'}
	at org.apache.hadoop.hbase.regionserver.HRegion.checkFamily(HRegion.java:6093)
	at org.apache.hadoop.hbase.regionserver.HRegion.getScanner(HRegion.java:2176)
	at org.apache.hadoop.hbase.regionserver.HRegion.getScanner(HRegion.java:2156)
	at org.apache.hadoop.hbase.regionserver.RSRpcServices.scan(RSRpcServices.java:2064)
	at org.apache.hadoop.hbase.protobuf.generated.ClientProtos$ClientService$2.callBlockingMethod(ClientProtos.java:31443)
	at org.apache.hadoop.hbase.ipc.RpcServer.call(RpcServer.java:2033)
	at org.apache.hadoop.hbase.ipc.CallRunner.run(CallRunner.java:107)
	at org.apache.hadoop.hbase.ipc.RpcExecutor.consumerLoop(RpcExecutor.java:130)
	at org.apache.hadoop.hbase.ipc.RpcExecutor$1.run(RpcExecutor.java:107)
	at java.lang.Thread.run(Thread.java:745)

Caused by: org.apache.phoenix.exception.PhoenixIOException: 
org.apache.hadoop.hbase.regionserver.NoSuchColumnFamilyException: Column family CF does not
exist in region NEWCFTTLTEST,\x05\x00\x00,1455311213805.031577b087e9f5e6f8c97bda603660fa.
in table 'NEWCFTTLTEST', {TABLE_ATTRIBUTES => {coprocessor$1 => '|org.apache.phoenix.coprocessor.ScanRegionObserver|805306366|',
coprocessor$2 => '|org.apache.phoenix.coprocessor.UngroupedAggregateRegionObserver|805306366|',
coprocessor$3 => '|org.apache.phoenix.coprocessor.GroupedAggregateRegionObserver|805306366|',
coprocessor$4 => '|org.apache.phoenix.coprocessor.ServerCachingEndpointImpl|805306366|',
coprocessor$5 => '|org.apache.phoenix.hbase.index.Indexer|805306366|index.builder=org.apache.phoenix.index.PhoenixIndexBuilder,org.apache.hadoop.hbase.index.codec.class=org.apache.phoenix.index.PhoenixIndexCodec',
coprocessor$6 => '|org.apache.hadoop.hbase.regionserver.LocalIndexSplitter|805306366|'},
{NAME => '0', DATA_BLOCK_ENCODING => 'FAST_DIFF', BLOOMFILTER => 'ROW', REPLICATION_SCOPE
=> '0', COMPRESSION => 'NONE', VERSIONS => '1', TTL => '1000 SECONDS (16 MINUTES
40 SECONDS)', MIN_VERSIONS => '0', KEEP_DELETED_CELLS => 'FALSE', BLOCKSIZE => '65536',
IN_MEMORY => 'false', BLOCKCACHE => 'true'}
	at org.apache.hadoop.hbase.regionserver.HRegion.checkFamily(HRegion.java:6093)
	at org.apache.hadoop.hbase.regionserver.HRegion.getScanner(HRegion.java:2176)
	at org.apache.hadoop.hbase.regionserver.HRegion.getScanner(HRegion.java:2156)
	at org.apache.hadoop.hbase.regionserver.RSRpcServices.scan(RSRpcServices.java:2064)
	at org.apache.hadoop.hbase.protobuf.generated.ClientProtos$ClientService$2.callBlockingMethod(ClientProtos.java:31443)
	at org.apache.hadoop.hbase.ipc.RpcServer.call(RpcServer.java:2033)
	at org.apache.hadoop.hbase.ipc.CallRunner.run(CallRunner.java:107)
	at org.apache.hadoop.hbase.ipc.RpcExecutor.consumerLoop(RpcExecutor.java:130)
	at org.apache.hadoop.hbase.ipc.RpcExecutor$1.run(RpcExecutor.java:107)
	at java.lang.Thread.run(Thread.java:745)

Caused by: org.apache.hadoop.hbase.regionserver.NoSuchColumnFamilyException: 
org.apache.hadoop.hbase.regionserver.NoSuchColumnFamilyException: Column family CF does not
exist in region NEWCFTTLTEST,\x05\x00\x00,1455311213805.031577b087e9f5e6f8c97bda603660fa.
in table 'NEWCFTTLTEST', {TABLE_ATTRIBUTES => {coprocessor$1 => '|org.apache.phoenix.coprocessor.ScanRegionObserver|805306366|',
coprocessor$2 => '|org.apache.phoenix.coprocessor.UngroupedAggregateRegionObserver|805306366|',
coprocessor$3 => '|org.apache.phoenix.coprocessor.GroupedAggregateRegionObserver|805306366|',
coprocessor$4 => '|org.apache.phoenix.coprocessor.ServerCachingEndpointImpl|805306366|',
coprocessor$5 => '|org.apache.phoenix.hbase.index.Indexer|805306366|index.builder=org.apache.phoenix.index.PhoenixIndexBuilder,org.apache.hadoop.hbase.index.codec.class=org.apache.phoenix.index.PhoenixIndexCodec',
coprocessor$6 => '|org.apache.hadoop.hbase.regionserver.LocalIndexSplitter|805306366|'},
{NAME => '0', DATA_BLOCK_ENCODING => 'FAST_DIFF', BLOOMFILTER => 'ROW', REPLICATION_SCOPE
=> '0', COMPRESSION => 'NONE', VERSIONS => '1', TTL => '1000 SECONDS (16 MINUTES
40 SECONDS)', MIN_VERSIONS => '0', KEEP_DELETED_CELLS => 'FALSE', BLOCKSIZE => '65536',
IN_MEMORY => 'false', BLOCKCACHE => 'true'}
	at org.apache.hadoop.hbase.regionserver.HRegion.checkFamily(HRegion.java:6093)
	at org.apache.hadoop.hbase.regionserver.HRegion.getScanner(HRegion.java:2176)
	at org.apache.hadoop.hbase.regionserver.HRegion.getScanner(HRegion.java:2156)
	at org.apache.hadoop.hbase.regionserver.RSRpcServices.scan(RSRpcServices.java:2064)
	at org.apache.hadoop.hbase.protobuf.generated.ClientProtos$ClientService$2.callBlockingMethod(ClientProtos.java:31443)
	at org.apache.hadoop.hbase.ipc.RpcServer.call(RpcServer.java:2033)
	at org.apache.hadoop.hbase.ipc.CallRunner.run(CallRunner.java:107)
	at org.apache.hadoop.hbase.ipc.RpcExecutor.consumerLoop(RpcExecutor.java:130)
	at org.apache.hadoop.hbase.ipc.RpcExecutor$1.run(RpcExecutor.java:107)
	at java.lang.Thread.run(Thread.java:745)

Caused by: org.apache.hadoop.hbase.ipc.RemoteWithExtrasException: 
org.apache.hadoop.hbase.regionserver.NoSuchColumnFamilyException: Column family CF does not
exist in region NEWCFTTLTEST,\x05\x00\x00,1455311213805.031577b087e9f5e6f8c97bda603660fa.
in table 'NEWCFTTLTEST', {TABLE_ATTRIBUTES => {coprocessor$1 => '|org.apache.phoenix.coprocessor.ScanRegionObserver|805306366|',
coprocessor$2 => '|org.apache.phoenix.coprocessor.UngroupedAggregateRegionObserver|805306366|',
coprocessor$3 => '|org.apache.phoenix.coprocessor.GroupedAggregateRegionObserver|805306366|',
coprocessor$4 => '|org.apache.phoenix.coprocessor.ServerCachingEndpointImpl|805306366|',
coprocessor$5 => '|org.apache.phoenix.hbase.index.Indexer|805306366|index.builder=org.apache.phoenix.index.PhoenixIndexBuilder,org.apache.hadoop.hbase.index.codec.class=org.apache.phoenix.index.PhoenixIndexCodec',
coprocessor$6 => '|org.apache.hadoop.hbase.regionserver.LocalIndexSplitter|805306366|'},
{NAME => '0', DATA_BLOCK_ENCODING => 'FAST_DIFF', BLOOMFILTER => 'ROW', REPLICATION_SCOPE
=> '0', COMPRESSION => 'NONE', VERSIONS => '1', TTL => '1000 SECONDS (16 MINUTES
40 SECONDS)', MIN_VERSIONS => '0', KEEP_DELETED_CELLS => 'FALSE', BLOCKSIZE => '65536',
IN_MEMORY => 'false', BLOCKCACHE => 'true'}
	at org.apache.hadoop.hbase.regionserver.HRegion.checkFamily(HRegion.java:6093)
	at org.apache.hadoop.hbase.regionserver.HRegion.getScanner(HRegion.java:2176)
	at org.apache.hadoop.hbase.regionserver.HRegion.getScanner(HRegion.java:2156)
	at org.apache.hadoop.hbase.regionserver.RSRpcServices.scan(RSRpcServices.java:2064)
	at org.apache.hadoop.hbase.protobuf.generated.ClientProtos$ClientService$2.callBlockingMethod(ClientProtos.java:31443)
	at org.apache.hadoop.hbase.ipc.RpcServer.call(RpcServer.java:2033)
	at org.apache.hadoop.hbase.ipc.CallRunner.run(CallRunner.java:107)
	at org.apache.hadoop.hbase.ipc.RpcExecutor.consumerLoop(RpcExecutor.java:130)
	at org.apache.hadoop.hbase.ipc.RpcExecutor$1.run(RpcExecutor.java:107)
	at java.lang.Thread.run(Thread.java:745)


Tests run: 1, Failures: 0, Errors: 0, Skipped: 0, Time elapsed: 9.853 sec - in org.apache.phoenix.end2end.SpillableGroupByIT
Tests run: 4, Failures: 0, Errors: 0, Skipped: 0, Time elapsed: 50.973 sec - in org.apache.phoenix.end2end.SaltedViewIT
Tests run: 16, Failures: 16, Errors: 0, Skipped: 0, Time elapsed: 260.846 sec <<<
FAILURE! - in org.apache.phoenix.end2end.IndexToolIT
testSecondaryIndex[transactional = false , mutable = false , localIndex = false, directApi
= false](org.apache.phoenix.end2end.IndexToolIT)  Time elapsed: 60.724 sec  <<< FAILURE!
java.lang.AssertionError: expected:<0> but was:<-1>
	at org.apache.phoenix.end2end.IndexToolIT.testSecondaryIndex(IndexToolIT.java:162)

testSecondaryIndex[transactional = false , mutable = false , localIndex = false, directApi
= true](org.apache.phoenix.end2end.IndexToolIT)  Time elapsed: 12.652 sec  <<< FAILURE!
java.lang.AssertionError: expected:<0> but was:<-1>
	at org.apache.phoenix.end2end.IndexToolIT.testSecondaryIndex(IndexToolIT.java:162)

testSecondaryIndex[transactional = false , mutable = false , localIndex = true, directApi
= false](org.apache.phoenix.end2end.IndexToolIT)  Time elapsed: 12.683 sec  <<< FAILURE!
java.lang.AssertionError: expected:<0> but was:<-1>
	at org.apache.phoenix.end2end.IndexToolIT.testSecondaryIndex(IndexToolIT.java:162)

testSecondaryIndex[transactional = false , mutable = false , localIndex = true, directApi
= true](org.apache.phoenix.end2end.IndexToolIT)  Time elapsed: 16.806 sec  <<< FAILURE!
java.lang.AssertionError: expected:<0> but was:<-1>
	at org.apache.phoenix.end2end.IndexToolIT.testSecondaryIndex(IndexToolIT.java:162)

testSecondaryIndex[transactional = false , mutable = true , localIndex = false, directApi
= false](org.apache.phoenix.end2end.IndexToolIT)  Time elapsed: 12.398 sec  <<< FAILURE!
java.lang.AssertionError: expected:<0> but was:<-1>
	at org.apache.phoenix.end2end.IndexToolIT.testSecondaryIndex(IndexToolIT.java:162)

testSecondaryIndex[transactional = false , mutable = true , localIndex = false, directApi
= true](org.apache.phoenix.end2end.IndexToolIT)  Time elapsed: 13.218 sec  <<< FAILURE!
java.lang.AssertionError: expected:<0> but was:<-1>
	at org.apache.phoenix.end2end.IndexToolIT.testSecondaryIndex(IndexToolIT.java:162)

testSecondaryIndex[transactional = false , mutable = true , localIndex = true, directApi =
false](org.apache.phoenix.end2end.IndexToolIT)  Time elapsed: 11.208 sec  <<< FAILURE!
java.lang.AssertionError: expected:<0> but was:<-1>
	at org.apache.phoenix.end2end.IndexToolIT.testSecondaryIndex(IndexToolIT.java:162)

testSecondaryIndex[transactional = false , mutable = true , localIndex = true, directApi =
true](org.apache.phoenix.end2end.IndexToolIT)  Time elapsed: 12.211 sec  <<< FAILURE!
java.lang.AssertionError: expected:<0> but was:<-1>
	at org.apache.phoenix.end2end.IndexToolIT.testSecondaryIndex(IndexToolIT.java:162)

testSecondaryIndex[transactional = true , mutable = false , localIndex = false, directApi
= false](org.apache.phoenix.end2end.IndexToolIT)  Time elapsed: 8.826 sec  <<< FAILURE!
java.lang.AssertionError: expected:<0> but was:<-1>
	at org.apache.phoenix.end2end.IndexToolIT.testSecondaryIndex(IndexToolIT.java:162)

testSecondaryIndex[transactional = true , mutable = false , localIndex = false, directApi
= true](org.apache.phoenix.end2end.IndexToolIT)  Time elapsed: 12.437 sec  <<< FAILURE!
java.lang.AssertionError: expected:<0> but was:<-1>
	at org.apache.phoenix.end2end.IndexToolIT.testSecondaryIndex(IndexToolIT.java:162)

testSecondaryIndex[transactional = true , mutable = false , localIndex = true, directApi =
false](org.apache.phoenix.end2end.IndexToolIT)  Time elapsed: 12.654 sec  <<< FAILURE!
java.lang.AssertionError: expected:<0> but was:<-1>
	at org.apache.phoenix.end2end.IndexToolIT.testSecondaryIndex(IndexToolIT.java:162)

testSecondaryIndex[transactional = true , mutable = false , localIndex = true, directApi =
true](org.apache.phoenix.end2end.IndexToolIT)  Time elapsed: 18.075 sec  <<< FAILURE!
java.lang.AssertionError: expected:<0> but was:<-1>
	at org.apache.phoenix.end2end.IndexToolIT.testSecondaryIndex(IndexToolIT.java:162)

testSecondaryIndex[transactional = true , mutable = true , localIndex = false, directApi =
false](org.apache.phoenix.end2end.IndexToolIT)  Time elapsed: 9.565 sec  <<< FAILURE!
java.lang.AssertionError: expected:<0> but was:<-1>
	at org.apache.phoenix.end2end.IndexToolIT.testSecondaryIndex(IndexToolIT.java:162)

testSecondaryIndex[transactional = true , mutable = true , localIndex = false, directApi =
true](org.apache.phoenix.end2end.IndexToolIT)  Time elapsed: 10.899 sec  <<< FAILURE!
java.lang.AssertionError: expected:<0> but was:<-1>
	at org.apache.phoenix.end2end.IndexToolIT.testSecondaryIndex(IndexToolIT.java:162)

testSecondaryIndex[transactional = true , mutable = true , localIndex = true, directApi =
false](org.apache.phoenix.end2end.IndexToolIT)  Time elapsed: 14.267 sec  <<< FAILURE!
java.lang.AssertionError: expected:<0> but was:<-1>
	at org.apache.phoenix.end2end.IndexToolIT.testSecondaryIndex(IndexToolIT.java:162)

testSecondaryIndex[transactional = true , mutable = true , localIndex = true, directApi =
true](org.apache.phoenix.end2end.IndexToolIT)  Time elapsed: 12.596 sec  <<< FAILURE!
java.lang.AssertionError: expected:<0> but was:<-1>
	at org.apache.phoenix.end2end.IndexToolIT.testSecondaryIndex(IndexToolIT.java:162)

Running org.apache.phoenix.end2end.StatsCollectorWithSplitsAndMultiCFIT
Running org.apache.phoenix.end2end.StatsCollectorIT
Tests run: 1, Failures: 0, Errors: 0, Skipped: 0, Time elapsed: 11.835 sec - in org.apache.phoenix.end2end.StatsCollectorWithSplitsAndMultiCFIT
Running org.apache.phoenix.end2end.TenantSpecificTablesDDLIT
Running org.apache.phoenix.end2end.TenantSpecificTablesDMLIT
Running org.apache.phoenix.end2end.TransactionalViewIT
Tests run: 17, Failures: 0, Errors: 0, Skipped: 0, Time elapsed: 43.238 sec - in org.apache.phoenix.end2end.TenantSpecificTablesDDLIT
Tests run: 16, Failures: 0, Errors: 0, Skipped: 0, Time elapsed: 35.147 sec - in org.apache.phoenix.end2end.TenantSpecificTablesDMLIT
Running org.apache.phoenix.end2end.UnionAllIT
Running org.apache.phoenix.end2end.UserDefinedFunctionsIT
Tests run: 13, Failures: 0, Errors: 0, Skipped: 0, Time elapsed: 24.254 sec - in org.apache.phoenix.end2end.UnionAllIT
Tests run: 9, Failures: 0, Errors: 0, Skipped: 0, Time elapsed: 375.452 sec - in org.apache.phoenix.end2end.CsvBulkLoadToolIT
Tests run: 2, Failures: 0, Errors: 0, Skipped: 0, Time elapsed: 70.035 sec - in org.apache.phoenix.end2end.TransactionalViewIT
Tests run: 13, Failures: 0, Errors: 0, Skipped: 0, Time elapsed: 24.325 sec - in org.apache.phoenix.end2end.UserDefinedFunctionsIT
Tests run: 12, Failures: 0, Errors: 0, Skipped: 0, Time elapsed: 137.639 sec - in org.apache.phoenix.end2end.StatsCollectorIT
Running org.apache.phoenix.end2end.ViewIT
Running org.apache.phoenix.end2end.index.MutableIndexFailureIT
Running org.apache.phoenix.end2end.index.ImmutableIndexWithStatsIT
Running org.apache.phoenix.end2end.index.MutableIndexReplicationIT
Tests run: 1, Failures: 0, Errors: 0, Skipped: 0, Time elapsed: 13.24 sec - in org.apache.phoenix.end2end.index.ImmutableIndexWithStatsIT
Running org.apache.phoenix.end2end.index.txn.TxWriteFailureIT
Tests run: 1, Failures: 0, Errors: 0, Skipped: 0, Time elapsed: 22.496 sec - in org.apache.phoenix.end2end.index.MutableIndexReplicationIT
Running org.apache.phoenix.hbase.index.FailForUnsupportedHBaseVersionsIT
Tests run: 2, Failures: 0, Errors: 0, Skipped: 0, Time elapsed: 20.371 sec - in org.apache.phoenix.hbase.index.FailForUnsupportedHBaseVersionsIT
Running org.apache.phoenix.execute.PartialCommitIT
Tests run: 12, Failures: 0, Errors: 0, Skipped: 0, Time elapsed: 4.041 sec - in org.apache.phoenix.execute.PartialCommitIT
Tests run: 8, Failures: 0, Errors: 0, Skipped: 0, Time elapsed: 42.707 sec - in org.apache.phoenix.end2end.index.txn.TxWriteFailureIT
Running org.apache.phoenix.hbase.index.balancer.IndexLoadBalancerIT
Running org.apache.phoenix.hbase.index.covered.EndToEndCoveredColumnsIndexBuilderIT
Tests run: 2, Failures: 0, Errors: 0, Skipped: 0, Time elapsed: 18.039 sec - in org.apache.phoenix.hbase.index.covered.EndToEndCoveredColumnsIndexBuilderIT
Running org.apache.phoenix.hbase.index.covered.example.EndToEndCoveredIndexingIT
Running org.apache.phoenix.hbase.index.covered.example.EndtoEndIndexingWithCompressionIT
Tests run: 46, Failures: 0, Errors: 0, Skipped: 0, Time elapsed: 143.657 sec - in org.apache.phoenix.end2end.ViewIT
Running org.apache.phoenix.hbase.index.covered.example.FailWithoutRetriesIT
Tests run: 1, Failures: 0, Errors: 0, Skipped: 0, Time elapsed: 8.355 sec - in org.apache.phoenix.hbase.index.covered.example.FailWithoutRetriesIT
Tests run: 9, Failures: 0, Errors: 0, Skipped: 1, Time elapsed: 89.598 sec - in org.apache.phoenix.hbase.index.balancer.IndexLoadBalancerIT
Tests run: 11, Failures: 0, Errors: 0, Skipped: 0, Time elapsed: 71.509 sec - in org.apache.phoenix.hbase.index.covered.example.EndToEndCoveredIndexingIT
Tests run: 6, Failures: 0, Errors: 0, Skipped: 2, Time elapsed: 175.679 sec - in org.apache.phoenix.end2end.index.MutableIndexFailureIT
Running org.apache.phoenix.iterate.RoundRobinResultIteratorWithStatsIT
Tests run: 1, Failures: 0, Errors: 0, Skipped: 0, Time elapsed: 16.295 sec - in org.apache.phoenix.iterate.RoundRobinResultIteratorWithStatsIT
Tests run: 11, Failures: 0, Errors: 0, Skipped: 0, Time elapsed: 77.111 sec - in org.apache.phoenix.hbase.index.covered.example.EndtoEndIndexingWithCompressionIT
Running org.apache.phoenix.rpc.PhoenixClientRpcIT
Running org.apache.phoenix.monitoring.PhoenixMetricsIT
Tests run: 2, Failures: 0, Errors: 0, Skipped: 0, Time elapsed: 6.196 sec - in org.apache.phoenix.rpc.PhoenixClientRpcIT
Running org.apache.phoenix.rpc.PhoenixServerRpcIT
Tests run: 1, Failures: 0, Errors: 0, Skipped: 1, Time elapsed: 0 sec - in org.apache.phoenix.iterate.ScannerLeaseRenewalIT
Tests run: 2, Failures: 0, Errors: 0, Skipped: 0, Time elapsed: 16.268 sec - in org.apache.phoenix.rpc.PhoenixServerRpcIT
Tests run: 18, Failures: 0, Errors: 0, Skipped: 0, Time elapsed: 49.896 sec - in org.apache.phoenix.monitoring.PhoenixMetricsIT

Results :

Failed tests: 
  IndexToolIT.testSecondaryIndex:162 expected:<0> but was:<-1>
  IndexToolIT.testSecondaryIndex:162 expected:<0> but was:<-1>
  IndexToolIT.testSecondaryIndex:162 expected:<0> but was:<-1>
  IndexToolIT.testSecondaryIndex:162 expected:<0> but was:<-1>
  IndexToolIT.testSecondaryIndex:162 expected:<0> but was:<-1>
  IndexToolIT.testSecondaryIndex:162 expected:<0> but was:<-1>
  IndexToolIT.testSecondaryIndex:162 expected:<0> but was:<-1>
  IndexToolIT.testSecondaryIndex:162 expected:<0> but was:<-1>
  IndexToolIT.testSecondaryIndex:162 expected:<0> but was:<-1>
  IndexToolIT.testSecondaryIndex:162 expected:<0> but was:<-1>
  IndexToolIT.testSecondaryIndex:162 expected:<0> but was:<-1>
  IndexToolIT.testSecondaryIndex:162 expected:<0> but was:<-1>
  IndexToolIT.testSecondaryIndex:162 expected:<0> but was:<-1>
  IndexToolIT.testSecondaryIndex:162 expected:<0> but was:<-1>
  IndexToolIT.testSecondaryIndex:162 expected:<0> but was:<-1>
  IndexToolIT.testSecondaryIndex:162 expected:<0> but was:<-1>
  MutableIndexToolIT.testMutableIndexWithUpdates:107 expected:<0> but was:<-1>
Tests in error: 
org.apache.phoenix.end2end.AlterTableIT.testNewColumnFamilyInheritsTTLOfEmptyCF(org.apache.phoenix.end2end.AlterTableIT)
  Run 1: AlterTableIT.testNewColumnFamilyInheritsTTLOfEmptyCF:1429 ? PhoenixIO org.apac...
  Run 2: AlterTableIT>BaseOwnClusterHBaseManagedTimeIT.cleanUpAfterTest:29->BaseTest.deletePriorTables:884->BaseTest.deletePriorTables:895->BaseTest.deletePriorTables:929
? PhoenixIO


Tests run: 324, Failures: 17, Errors: 1, Skipped: 4

[INFO] 
[INFO] --- maven-failsafe-plugin:2.19.1:verify (ClientManagedTimeTests) @ phoenix-core ---
[INFO] ------------------------------------------------------------------------
[INFO] Reactor Summary:
[INFO] 
[INFO] Apache Phoenix .................................... SUCCESS [3.240s]
[INFO] Phoenix Core ...................................... FAILURE [42:47.246s]
[INFO] Phoenix - Flume ................................... SKIPPED
[INFO] Phoenix - Pig ..................................... SKIPPED
[INFO] Phoenix Query Server Client ....................... SKIPPED
[INFO] Phoenix Query Server .............................. SKIPPED
[INFO] Phoenix - Pherf ................................... SKIPPED
[INFO] Phoenix - Spark ................................... SKIPPED
[INFO] Phoenix Assembly .................................. SKIPPED
[INFO] Phoenix - Tracing Web Application ................. SKIPPED
[INFO] ------------------------------------------------------------------------
[INFO] BUILD FAILURE
[INFO] ------------------------------------------------------------------------
[INFO] Total time: 42:51.597s
[INFO] Finished at: Fri Feb 12 21:18:27 UTC 2016
[INFO] Final Memory: 60M/365M
[INFO] ------------------------------------------------------------------------
[ERROR] Failed to execute goal org.apache.maven.plugins:maven-failsafe-plugin:2.19.1:verify
(ClientManagedTimeTests) on project phoenix-core: There are test failures.
[ERROR] 
[ERROR] Please refer to /x1/jenkins/jenkins-slave/workspace/Phoenix-4.x-HBase-1.0/phoenix-core/target/failsafe-reports
for the individual test results.
[ERROR] -> [Help 1]
[ERROR] 
[ERROR] To see the full stack trace of the errors, re-run Maven with the -e switch.
[ERROR] Re-run Maven using the -X switch to enable full debug logging.
[ERROR] 
[ERROR] For more information about the errors and possible solutions, please read the following
articles:
[ERROR] [Help 1] http://cwiki.apache.org/confluence/display/MAVEN/MojoFailureException
[ERROR] 
[ERROR] After correcting the problems, you can resume the build with the command
[ERROR]   mvn <goals> -rf :phoenix-core
Build step 'Invoke top-level Maven targets' marked build as failure
Archiving artifacts
Compressed 1.01 GB of artifacts by 38.6% relative to #379
Recording test results

Mime
View raw message