phoenix-commits mailing list archives

Site index · List index
Message view « Date » · « Thread »
Top « Date » · « Thread »
From Apache Jenkins Server <jenk...@builds.apache.org>
Subject Build failed in Jenkins: Phoenix | Master #1053
Date Wed, 06 Jan 2016 20:16:15 GMT
See <https://builds.apache.org/job/Phoenix-master/1053/changes>

Changes:

[cmarcel] PHOENIX-2529 Fixed date generation pattern

[cmarcel] PHOENIX-2299 Added support for current date generation

------------------------------------------
[...truncated 7456 lines...]
Downloading: http://repo.maven.apache.org/maven2/commons-io/commons-io/maven-metadata.xml
            
Downloaded: http://repository.apache.org/snapshots/commons-io/commons-io/maven-metadata.xml
(350 B at 13.7 KB/sec)
725/725 B   
            
            
Downloaded: http://repo.maven.apache.org/maven2/commons-io/commons-io/maven-metadata.xml (725
B at 10.3 KB/sec)
            
Downloading: https://repository.apache.org/content/repositories/releases/commons-io/commons-io/2.5-SNAPSHOT/maven-metadata.xml
Downloading: http://conjars.org/repo/commons-io/commons-io/2.5-SNAPSHOT/maven-metadata.xml
Downloading: https://oss.sonatype.org/content/repositories/snapshots/commons-io/commons-io/2.5-SNAPSHOT/maven-metadata.xml
Downloading: https://repository.apache.org/content/repositories/snapshots/commons-io/commons-io/2.5-SNAPSHOT/maven-metadata.xml
            
3/3 KB      
Downloading: http://repository.apache.org/snapshots/commons-io/commons-io/2.5-SNAPSHOT/maven-metadata.xml
3/3 KB   3/3 KB   
                  
Downloaded: http://repository.apache.org/snapshots/commons-io/commons-io/2.5-SNAPSHOT/maven-metadata.xml
(3 KB at 53.7 KB/sec)
                  
Downloaded: https://repository.apache.org/content/repositories/snapshots/commons-io/commons-io/2.5-SNAPSHOT/maven-metadata.xml
(3 KB at 25.7 KB/sec)
                  
                  
Downloading: http://conjars.org/repo/commons-io/commons-io/2.6-SNAPSHOT/maven-metadata.xml
Downloading: https://repository.apache.org/content/repositories/snapshots/commons-io/commons-io/2.6-SNAPSHOT/maven-metadata.xml
Downloading: https://oss.sonatype.org/content/repositories/snapshots/commons-io/commons-io/2.6-SNAPSHOT/maven-metadata.xml
Downloading: https://repository.apache.org/content/repositories/releases/commons-io/commons-io/2.6-SNAPSHOT/maven-metadata.xml
3/3 KB            
         
Downloading: http://repository.apache.org/snapshots/commons-io/commons-io/2.6-SNAPSHOT/maven-metadata.xml
2/3 KB   3/3 KB   
3/3 KB   3/3 KB   
                  
Downloaded: http://repository.apache.org/snapshots/commons-io/commons-io/2.6-SNAPSHOT/maven-metadata.xml
(3 KB at 56.0 KB/sec)
                  
Downloaded: https://repository.apache.org/content/repositories/snapshots/commons-io/commons-io/2.6-SNAPSHOT/maven-metadata.xml
(3 KB at 23.6 KB/sec)
                  
                  
[INFO] 
[INFO] --- maven-clean-plugin:2.5:clean (default-clean) @ phoenix-pherf ---
[INFO] Deleting /x1/jenkins/jenkins-slave/workspace/Phoenix-master/phoenix-pherf/target
[INFO] 
[INFO] --- maven-checkstyle-plugin:2.13:check (validate) @ phoenix-pherf ---
[INFO] 
[INFO] --- build-helper-maven-plugin:1.9.1:add-test-source (add-test-source) @ phoenix-pherf
---
[INFO] Test Source directory: /x1/jenkins/jenkins-slave/workspace/Phoenix-master/phoenix-pherf/src/it/java
added.
[INFO] 
[INFO] --- build-helper-maven-plugin:1.9.1:add-test-resource (add-test-resource) @ phoenix-pherf
---
[INFO] 
[INFO] --- maven-remote-resources-plugin:1.5:process (default) @ phoenix-pherf ---
[INFO] artifact junit:junit-dep: checking for updates from apache release
[INFO] artifact junit:junit-dep: checking for updates from conjars.org
[INFO] artifact junit:junit-dep: checking for updates from apache snapshot
[INFO] artifact junit:junit-dep: checking for updates from sonatype-nexus-snapshots
[INFO] artifact junit:junit-dep: checking for updates from central
[INFO] artifact junit:junit: checking for updates from apache release
[INFO] artifact junit:junit: checking for updates from conjars.org
[INFO] artifact junit:junit: checking for updates from apache snapshot
[INFO] artifact junit:junit: checking for updates from sonatype-nexus-snapshots
[INFO] artifact junit:junit: checking for updates from central
[INFO] artifact commons-io:commons-io: checking for updates from apache release
[INFO] artifact commons-io:commons-io: checking for updates from conjars.org
[INFO] artifact commons-io:commons-io: checking for updates from apache snapshot
[INFO] artifact commons-io:commons-io: checking for updates from sonatype-nexus-snapshots
[INFO] artifact commons-io:commons-io: checking for updates from central
[INFO] 
[INFO] --- maven-resources-plugin:2.6:resources (default-resources) @ phoenix-pherf ---
[INFO] Using 'UTF-8' encoding to copy filtered resources.
[INFO] Copying 3 resources
[INFO] Copying 3 resources
[INFO] Copying 3 resources
[INFO] 
[INFO] --- maven-compiler-plugin:3.0:compile (default-compile) @ phoenix-pherf ---
[INFO] Changes detected - recompiling the module!
[INFO] Compiling 65 source files to /x1/jenkins/jenkins-slave/workspace/Phoenix-master/phoenix-pherf/target/classes
[WARNING] /x1/jenkins/jenkins-slave/workspace/Phoenix-master/phoenix-pherf/src/main/java/org/apache/phoenix/pherf/result/ThreadTime.java:
Some input files use unchecked or unsafe operations.
[WARNING] /x1/jenkins/jenkins-slave/workspace/Phoenix-master/phoenix-pherf/src/main/java/org/apache/phoenix/pherf/result/ThreadTime.java:
Recompile with -Xlint:unchecked for details.
[INFO] 
[INFO] --- maven-dependency-plugin:2.1:build-classpath (create-mrapp-generated-classpath)
@ phoenix-pherf ---
[INFO] Wrote classpath file '/x1/jenkins/jenkins-slave/workspace/Phoenix-master/phoenix-pherf/target/classes/mrapp-generated-classpath'.
[INFO] 
[INFO] --- maven-resources-plugin:2.6:testResources (default-testResources) @ phoenix-pherf
---
[INFO] Using 'UTF-8' encoding to copy filtered resources.
[INFO] Copying 5 resources
[INFO] Copying 5 resources
[INFO] skip non existing resourceDirectory /x1/jenkins/jenkins-slave/workspace/Phoenix-master/phoenix-pherf/src/it/resources
[INFO] Copying 3 resources
[INFO] 
[INFO] --- maven-compiler-plugin:3.0:testCompile (default-testCompile) @ phoenix-pherf ---
[INFO] Changes detected - recompiling the module!
[INFO] Compiling 13 source files to /x1/jenkins/jenkins-slave/workspace/Phoenix-master/phoenix-pherf/target/test-classes
[WARNING] /x1/jenkins/jenkins-slave/workspace/Phoenix-master/phoenix-pherf/src/test/java/org/apache/phoenix/pherf/RowCalculatorTest.java:
/x1/jenkins/jenkins-slave/workspace/Phoenix-master/phoenix-pherf/src/test/java/org/apache/phoenix/pherf/RowCalculatorTest.java
uses or overrides a deprecated API.
[WARNING] /x1/jenkins/jenkins-slave/workspace/Phoenix-master/phoenix-pherf/src/test/java/org/apache/phoenix/pherf/RowCalculatorTest.java:
Recompile with -Xlint:deprecation for details.
[WARNING] /x1/jenkins/jenkins-slave/workspace/Phoenix-master/phoenix-pherf/src/test/java/org/apache/phoenix/pherf/RuleGeneratorTest.java:
Some input files use unchecked or unsafe operations.
[WARNING] /x1/jenkins/jenkins-slave/workspace/Phoenix-master/phoenix-pherf/src/test/java/org/apache/phoenix/pherf/RuleGeneratorTest.java:
Recompile with -Xlint:unchecked for details.
[INFO] 
[INFO] --- maven-surefire-plugin:2.19:test (default-test) @ phoenix-pherf ---

-------------------------------------------------------
 T E S T S
-------------------------------------------------------
Running org.apache.phoenix.pherf.RowCalculatorTest
Tests run: 4, Failures: 0, Errors: 0, Skipped: 0, Time elapsed: 0.01 sec - in org.apache.phoenix.pherf.RowCalculatorTest
Running org.apache.phoenix.pherf.ResultTest
Tests run: 4, Failures: 0, Errors: 0, Skipped: 0, Time elapsed: 4.809 sec - in org.apache.phoenix.pherf.ResultTest
Running org.apache.phoenix.pherf.RuleGeneratorTest
Tests run: 6, Failures: 0, Errors: 0, Skipped: 0, Time elapsed: 2.267 sec - in org.apache.phoenix.pherf.RuleGeneratorTest
Running org.apache.phoenix.pherf.ResourceTest
Tests run: 3, Failures: 0, Errors: 0, Skipped: 0, Time elapsed: 0.316 sec - in org.apache.phoenix.pherf.ResourceTest
Running org.apache.phoenix.pherf.PherfTest
Tests run: 2, Failures: 0, Errors: 0, Skipped: 0, Time elapsed: 0.519 sec - in org.apache.phoenix.pherf.PherfTest
Running org.apache.phoenix.pherf.ColumnTest
Tests run: 1, Failures: 0, Errors: 0, Skipped: 0, Time elapsed: 0 sec - in org.apache.phoenix.pherf.ColumnTest
Running org.apache.phoenix.pherf.TestHBaseProps
Tests run: 1, Failures: 0, Errors: 0, Skipped: 0, Time elapsed: 0.1 sec - in org.apache.phoenix.pherf.TestHBaseProps
Running org.apache.phoenix.pherf.ConfigurationParserTest
Tests run: 2, Failures: 0, Errors: 0, Skipped: 0, Time elapsed: 0.138 sec - in org.apache.phoenix.pherf.ConfigurationParserTest

Results :

Tests run: 23, Failures: 0, Errors: 0, Skipped: 0

[INFO] 
[INFO] --- maven-source-plugin:2.2.1:jar-no-fork (attach-sources) @ phoenix-pherf ---
[INFO] Building jar: /x1/jenkins/jenkins-slave/workspace/Phoenix-master/phoenix-pherf/target/phoenix-pherf-4.7.0-HBase-1.1-SNAPSHOT-sources.jar
[INFO] 
[INFO] --- maven-jar-plugin:2.4:test-jar (default) @ phoenix-pherf ---
[INFO] Building jar: /x1/jenkins/jenkins-slave/workspace/Phoenix-master/phoenix-pherf/target/phoenix-pherf-4.7.0-HBase-1.1-SNAPSHOT-tests.jar
[INFO] 
[INFO] --- maven-jar-plugin:2.4:jar (default-jar) @ phoenix-pherf ---
[INFO] Building jar: /x1/jenkins/jenkins-slave/workspace/Phoenix-master/phoenix-pherf/target/phoenix-pherf-4.7.0-HBase-1.1-SNAPSHOT.jar
[INFO] 
[INFO] --- maven-site-plugin:3.2:attach-descriptor (attach-descriptor) @ phoenix-pherf ---
[INFO] 
[INFO] --- maven-assembly-plugin:2.5.2:single (make-assembly) @ phoenix-pherf ---
[INFO] Reading assembly descriptor: src/main/assembly/minimal.xml
[INFO] artifact junit:junit-dep: checking for updates from apache release
[INFO] artifact junit:junit-dep: checking for updates from conjars.org
[INFO] artifact junit:junit-dep: checking for updates from apache snapshot
[INFO] artifact junit:junit-dep: checking for updates from sonatype-nexus-snapshots
[INFO] artifact junit:junit-dep: checking for updates from central
[INFO] artifact junit:junit: checking for updates from apache release
[INFO] artifact junit:junit: checking for updates from conjars.org
[INFO] artifact junit:junit: checking for updates from apache snapshot
[INFO] artifact junit:junit: checking for updates from sonatype-nexus-snapshots
[INFO] artifact junit:junit: checking for updates from central
[INFO] artifact commons-io:commons-io: checking for updates from apache release
[INFO] artifact commons-io:commons-io: checking for updates from conjars.org
[INFO] artifact commons-io:commons-io: checking for updates from apache snapshot
[INFO] artifact commons-io:commons-io: checking for updates from sonatype-nexus-snapshots
[INFO] artifact commons-io:commons-io: checking for updates from central
[INFO] Building jar: /x1/jenkins/jenkins-slave/workspace/Phoenix-master/phoenix-pherf/target/phoenix-pherf-4.7.0-HBase-1.1-SNAPSHOT-minimal.jar
[INFO] 
[INFO] --- maven-failsafe-plugin:2.19:integration-test (ClientManagedTimeTests) @ phoenix-pherf
---

-------------------------------------------------------
 T E S T S
-------------------------------------------------------

Results :

Tests run: 0, Failures: 0, Errors: 0, Skipped: 0

[INFO] 
[INFO] --- maven-failsafe-plugin:2.19:integration-test (HBaseManagedTimeTests) @ phoenix-pherf
---

-------------------------------------------------------
 T E S T S
-------------------------------------------------------
Running org.apache.phoenix.pherf.SchemaReaderIT
Running org.apache.phoenix.pherf.PherfMainIT
Running org.apache.phoenix.pherf.DataIngestIT
Tests run: 1, Failures: 1, Errors: 0, Skipped: 0, Time elapsed: 29.28 sec <<< FAILURE!
- in org.apache.phoenix.pherf.SchemaReaderIT
testSchemaReader(org.apache.phoenix.pherf.SchemaReaderIT)  Time elapsed: 11.815 sec  <<<
FAILURE!
java.lang.AssertionError: Could not retrieve Metadata from Phoenix
	at org.apache.phoenix.pherf.SchemaReaderIT.assertApplySchemaTest(SchemaReaderIT.java:72)
	at org.apache.phoenix.pherf.SchemaReaderIT.testSchemaReader(SchemaReaderIT.java:44)

Tests run: 4, Failures: 2, Errors: 0, Skipped: 0, Time elapsed: 45.611 sec <<< FAILURE!
- in org.apache.phoenix.pherf.DataIngestIT
testRWWorkload(org.apache.phoenix.pherf.DataIngestIT)  Time elapsed: 9.781 sec  <<<
FAILURE!
java.lang.AssertionError: Failed to load data. An exception was thrown: org.apache.phoenix.schema.TableNotFoundException:
ERROR 1012 (42M03): Table undefined. tableName=PHERF.TEST_TABLE
	at org.apache.phoenix.pherf.DataIngestIT.testRWWorkload(DataIngestIT.java:152)

testColumnRulesApplied(org.apache.phoenix.pherf.DataIngestIT)  Time elapsed: 1.579 sec  <<<
FAILURE!
java.lang.AssertionError: Could not get phoenix columns.
	at org.apache.phoenix.pherf.DataIngestIT.testColumnRulesApplied(DataIngestIT.java:73)

Tests run: 1, Failures: 0, Errors: 0, Skipped: 0, Time elapsed: 53.539 sec - in org.apache.phoenix.pherf.PherfMainIT

Results :

Failed tests: 
  DataIngestIT.testColumnRulesApplied:73 Could not get phoenix columns.
  DataIngestIT.testRWWorkload:152 Failed to load data. An exception was thrown: org.apache.phoenix.schema.TableNotFoundException:
ERROR 1012 (42M03): Table undefined. tableName=PHERF.TEST_TABLE
  SchemaReaderIT.testSchemaReader:44->assertApplySchemaTest:72 Could not retrieve Metadata
from Phoenix

Tests run: 6, Failures: 3, Errors: 0, Skipped: 0

[INFO] 
[INFO] --- maven-failsafe-plugin:2.19:integration-test (NeedTheirOwnClusterTests) @ phoenix-pherf
---

-------------------------------------------------------
 T E S T S
-------------------------------------------------------

Results :

Tests run: 0, Failures: 0, Errors: 0, Skipped: 0

[INFO] 
[INFO] --- maven-failsafe-plugin:2.19:verify (ClientManagedTimeTests) @ phoenix-pherf ---
[INFO] ------------------------------------------------------------------------
[INFO] Reactor Summary:
[INFO] 
[INFO] Apache Phoenix .................................... SUCCESS [3.397s]
[INFO] Phoenix Core ...................................... SUCCESS [1:01:55.551s]
[INFO] Phoenix - Flume ................................... SUCCESS [1:25.906s]
[INFO] Phoenix - Pig ..................................... SUCCESS [3:09.048s]
[INFO] Phoenix Query Server Client ....................... SUCCESS [1.616s]
[INFO] Phoenix Query Server .............................. SUCCESS [1:55.481s]
[INFO] Phoenix - Pherf ................................... FAILURE [1:56.477s]
[INFO] Phoenix - Spark ................................... SKIPPED
[INFO] Phoenix Assembly .................................. SKIPPED
[INFO] Phoenix - Tracing Web Application ................. SKIPPED
[INFO] ------------------------------------------------------------------------
[INFO] BUILD FAILURE
[INFO] ------------------------------------------------------------------------
[INFO] Total time: 1:10:28.179s
[INFO] Finished at: Wed Jan 06 20:11:40 UTC 2016
[INFO] Final Memory: 69M/995M
[INFO] ------------------------------------------------------------------------
[ERROR] Failed to execute goal org.apache.maven.plugins:maven-failsafe-plugin:2.19:verify
(ClientManagedTimeTests) on project phoenix-pherf: There are test failures.
[ERROR] 
[ERROR] Please refer to /x1/jenkins/jenkins-slave/workspace/Phoenix-master/phoenix-pherf/target/failsafe-reports
for the individual test results.
[ERROR] -> [Help 1]
[ERROR] 
[ERROR] To see the full stack trace of the errors, re-run Maven with the -e switch.
[ERROR] Re-run Maven using the -X switch to enable full debug logging.
[ERROR] 
[ERROR] For more information about the errors and possible solutions, please read the following
articles:
[ERROR] [Help 1] http://cwiki.apache.org/confluence/display/MAVEN/MojoFailureException
[ERROR] 
[ERROR] After correcting the problems, you can resume the build with the command
[ERROR]   mvn <goals> -rf :phoenix-pherf
Build step 'Invoke top-level Maven targets' marked build as failure
Archiving artifacts
Compressed 1.24 GB of artifacts by 32.2% relative to #1051
Updating PHOENIX-2299
Updating PHOENIX-2529
Recording test results

Mime
View raw message