phoenix-commits mailing list archives

Site index · List index
Message view « Date » · « Thread »
Top « Date » · « Thread »
From Apache Jenkins Server <jenk...@builds.apache.org>
Subject Build failed in Jenkins: Phoenix | 4.x-HBase-0.98 #978
Date Thu, 07 Jan 2016 01:09:46 GMT
See <https://builds.apache.org/job/Phoenix-4.x-HBase-0.98/978/changes>

Changes:

[samarth] PHOENIX-2570 Start transaction manager only when needed and reduce

------------------------------------------
[...truncated 1185 lines...]
[INFO] 
[INFO] --- maven-site-plugin:3.2:attach-descriptor (attach-descriptor) @ phoenix-server ---
[INFO] 
[INFO] --- maven-assembly-plugin:2.5.2:single (runnable) @ phoenix-server ---
[INFO] Reading assembly descriptor: src/build/query-server-runnable.xml
[INFO] Building jar: <https://builds.apache.org/job/Phoenix-4.x-HBase-0.98/978/artifact/phoenix-server/target/phoenix-server-4.7.0-HBase-0.98-SNAPSHOT-runnable.jar>
[INFO] 
[INFO] --- maven-failsafe-plugin:2.19:integration-test (ClientManagedTimeTests) @ phoenix-server
---

-------------------------------------------------------
 T E S T S
-------------------------------------------------------

Results :

Tests run: 0, Failures: 0, Errors: 0, Skipped: 0

[INFO] 
[INFO] --- maven-failsafe-plugin:2.19:integration-test (HBaseManagedTimeTests) @ phoenix-server
---

-------------------------------------------------------
 T E S T S
-------------------------------------------------------
Running org.apache.phoenix.end2end.QueryServerBasicsIT
Tests run: 3, Failures: 0, Errors: 0, Skipped: 0, Time elapsed: 64.068 sec - in org.apache.phoenix.end2end.QueryServerBasicsIT

Results :

Tests run: 3, Failures: 0, Errors: 0, Skipped: 0

[INFO] 
[INFO] --- maven-failsafe-plugin:2.19:integration-test (NeedTheirOwnClusterTests) @ phoenix-server
---

-------------------------------------------------------
 T E S T S
-------------------------------------------------------

Results :

Tests run: 0, Failures: 0, Errors: 0, Skipped: 0

[INFO] 
[INFO] --- maven-failsafe-plugin:2.19:verify (ClientManagedTimeTests) @ phoenix-server ---
[INFO] 
[INFO] --- maven-failsafe-plugin:2.19:verify (HBaseManagedTimeTests) @ phoenix-server ---
[INFO] 
[INFO] --- maven-failsafe-plugin:2.19:verify (NeedTheirOwnClusterTests) @ phoenix-server ---
[INFO] 
[INFO] --- maven-install-plugin:2.5.1:install (default-install) @ phoenix-server ---
[INFO] Installing <https://builds.apache.org/job/Phoenix-4.x-HBase-0.98/978/artifact/phoenix-server/target/phoenix-server-4.7.0-HBase-0.98-SNAPSHOT.jar>
to /home/jenkins/.m2/repository/org/apache/phoenix/phoenix-server/4.7.0-HBase-0.98-SNAPSHOT/phoenix-server-4.7.0-HBase-0.98-SNAPSHOT.jar
[INFO] Installing <https://builds.apache.org/job/Phoenix-4.x-HBase-0.98/ws/phoenix-server/pom.xml>
to /home/jenkins/.m2/repository/org/apache/phoenix/phoenix-server/4.7.0-HBase-0.98-SNAPSHOT/phoenix-server-4.7.0-HBase-0.98-SNAPSHOT.pom
[INFO] Installing <https://builds.apache.org/job/Phoenix-4.x-HBase-0.98/978/artifact/phoenix-server/target/phoenix-server-4.7.0-HBase-0.98-SNAPSHOT-sources.jar>
to /home/jenkins/.m2/repository/org/apache/phoenix/phoenix-server/4.7.0-HBase-0.98-SNAPSHOT/phoenix-server-4.7.0-HBase-0.98-SNAPSHOT-sources.jar
[INFO] Installing <https://builds.apache.org/job/Phoenix-4.x-HBase-0.98/978/artifact/phoenix-server/target/phoenix-server-4.7.0-HBase-0.98-SNAPSHOT-tests.jar>
to /home/jenkins/.m2/repository/org/apache/phoenix/phoenix-server/4.7.0-HBase-0.98-SNAPSHOT/phoenix-server-4.7.0-HBase-0.98-SNAPSHOT-tests.jar
[INFO]                                                                         
[INFO] ------------------------------------------------------------------------
[INFO] Building Phoenix - Pherf 4.7.0-HBase-0.98-SNAPSHOT
[INFO] ------------------------------------------------------------------------
Downloading: http://conjars.org/repo/junit/junit-dep/maven-metadata.xml
Downloading: https://oss.sonatype.org/content/repositories/snapshots/junit/junit-dep/maven-metadata.xml
Downloading: https://repository.apache.org/content/repositories/snapshots/junit/junit-dep/maven-metadata.xml
Downloading: https://repository.apache.org/content/repositories/releases/junit/junit-dep/maven-metadata.xml

Downloading: http://repository.apache.org/snapshots/junit/junit-dep/maven-metadata.xml

Downloading: http://repo.maven.apache.org/maven2/junit/junit-dep/maven-metadata.xml
563/563 B   
            
            
            
Downloaded: http://repo.maven.apache.org/maven2/junit/junit-dep/maven-metadata.xml (563 B
at 4.5 KB/sec)
            
Downloading: https://oss.sonatype.org/content/repositories/snapshots/commons-io/commons-io/maven-metadata.xml
Downloading: http://conjars.org/repo/commons-io/commons-io/maven-metadata.xml
Downloading: https://repository.apache.org/content/repositories/snapshots/commons-io/commons-io/maven-metadata.xml
Downloading: https://repository.apache.org/content/repositories/releases/commons-io/commons-io/maven-metadata.xml
374/374 B   
725/725 B   374/374 B   
                        
Downloaded: https://repository.apache.org/content/repositories/snapshots/commons-io/commons-io/maven-metadata.xml
(374 B at 2.9 KB/sec)
Downloading: http://repository.apache.org/snapshots/commons-io/commons-io/maven-metadata.xml
                        
Downloaded: https://repository.apache.org/content/repositories/releases/commons-io/commons-io/maven-metadata.xml
(725 B at 5.4 KB/sec)
Downloading: http://repo.maven.apache.org/maven2/commons-io/commons-io/maven-metadata.xml
                        
725/725 B               
350/350 B   725/725 B   
                        
Downloaded: http://repo.maven.apache.org/maven2/commons-io/commons-io/maven-metadata.xml (725
B at 13.1 KB/sec)
                        
Downloaded: http://repository.apache.org/snapshots/commons-io/commons-io/maven-metadata.xml
(350 B at 5.2 KB/sec)
                        
Downloading: https://repository.apache.org/content/repositories/releases/commons-io/commons-io/2.5-SNAPSHOT/maven-metadata.xml
Downloading: http://conjars.org/repo/commons-io/commons-io/2.5-SNAPSHOT/maven-metadata.xml
Downloading: https://repository.apache.org/content/repositories/snapshots/commons-io/commons-io/2.5-SNAPSHOT/maven-metadata.xml
Downloading: https://oss.sonatype.org/content/repositories/snapshots/commons-io/commons-io/2.5-SNAPSHOT/maven-metadata.xml
                        
Downloading: http://repository.apache.org/snapshots/commons-io/commons-io/2.5-SNAPSHOT/maven-metadata.xml
3/3 KB                  
3/3 KB   3/3 KB   
                  
Downloaded: https://repository.apache.org/content/repositories/snapshots/commons-io/commons-io/2.5-SNAPSHOT/maven-metadata.xml
(3 KB at 21.4 KB/sec)
                  
Downloaded: http://repository.apache.org/snapshots/commons-io/commons-io/2.5-SNAPSHOT/maven-metadata.xml
(3 KB at 35.5 KB/sec)
                  
                  
Downloading: http://conjars.org/repo/commons-io/commons-io/2.6-SNAPSHOT/maven-metadata.xml
Downloading: https://repository.apache.org/content/repositories/releases/commons-io/commons-io/2.6-SNAPSHOT/maven-metadata.xml
Downloading: https://repository.apache.org/content/repositories/snapshots/commons-io/commons-io/2.6-SNAPSHOT/maven-metadata.xml
Downloading: https://oss.sonatype.org/content/repositories/snapshots/commons-io/commons-io/2.6-SNAPSHOT/maven-metadata.xml
3/3 KB            
         
Downloading: http://repository.apache.org/snapshots/commons-io/commons-io/2.6-SNAPSHOT/maven-metadata.xml
         
Downloaded: https://repository.apache.org/content/repositories/snapshots/commons-io/commons-io/2.6-SNAPSHOT/maven-metadata.xml
(3 KB at 23.4 KB/sec)
3/3 KB   
         
Downloaded: http://repository.apache.org/snapshots/commons-io/commons-io/2.6-SNAPSHOT/maven-metadata.xml
(3 KB at 31.7 KB/sec)
         
         
[INFO] 
[INFO] --- maven-clean-plugin:2.5:clean (default-clean) @ phoenix-pherf ---
[INFO] Deleting <https://builds.apache.org/job/Phoenix-4.x-HBase-0.98/ws/phoenix-pherf/target>
[INFO] 
[INFO] --- maven-checkstyle-plugin:2.13:check (validate) @ phoenix-pherf ---
[INFO] 
[INFO] --- build-helper-maven-plugin:1.9.1:add-test-source (add-test-source) @ phoenix-pherf
---
[INFO] Test Source directory: <https://builds.apache.org/job/Phoenix-4.x-HBase-0.98/ws/phoenix-pherf/src/it/java>
added.
[INFO] 
[INFO] --- build-helper-maven-plugin:1.9.1:add-test-resource (add-test-resource) @ phoenix-pherf
---
[INFO] 
[INFO] --- maven-remote-resources-plugin:1.5:process (default) @ phoenix-pherf ---
[INFO] artifact junit:junit-dep: checking for updates from apache release
[INFO] artifact junit:junit-dep: checking for updates from conjars.org
[INFO] artifact junit:junit-dep: checking for updates from apache snapshot
[INFO] artifact junit:junit-dep: checking for updates from sonatype-nexus-snapshots
[INFO] artifact junit:junit-dep: checking for updates from central
[INFO] artifact junit:junit: checking for updates from apache release
[INFO] artifact junit:junit: checking for updates from conjars.org
[INFO] artifact junit:junit: checking for updates from apache snapshot
[INFO] artifact junit:junit: checking for updates from sonatype-nexus-snapshots
[INFO] artifact junit:junit: checking for updates from central
[INFO] artifact commons-io:commons-io: checking for updates from apache release
[INFO] artifact commons-io:commons-io: checking for updates from conjars.org
[INFO] artifact commons-io:commons-io: checking for updates from apache snapshot
[INFO] artifact commons-io:commons-io: checking for updates from sonatype-nexus-snapshots
[INFO] artifact commons-io:commons-io: checking for updates from central
[INFO] 
[INFO] --- maven-resources-plugin:2.6:resources (default-resources) @ phoenix-pherf ---
[INFO] Using 'UTF-8' encoding to copy filtered resources.
[INFO] Copying 3 resources
[INFO] Copying 3 resources
[INFO] Copying 3 resources
[INFO] 
[INFO] --- maven-compiler-plugin:3.0:compile (default-compile) @ phoenix-pherf ---
[INFO] Changes detected - recompiling the module!
[INFO] Compiling 65 source files to <https://builds.apache.org/job/Phoenix-4.x-HBase-0.98/ws/phoenix-pherf/target/classes>
[WARNING] <https://builds.apache.org/job/Phoenix-4.x-HBase-0.98/ws/phoenix-pherf/src/main/java/org/apache/phoenix/pherf/result/ResultUtil.java>:
Some input files use unchecked or unsafe operations.
[WARNING] <https://builds.apache.org/job/Phoenix-4.x-HBase-0.98/ws/phoenix-pherf/src/main/java/org/apache/phoenix/pherf/result/ResultUtil.java>:
Recompile with -Xlint:unchecked for details.
[INFO] 
[INFO] --- maven-dependency-plugin:2.1:build-classpath (create-mrapp-generated-classpath)
@ phoenix-pherf ---
[INFO] Wrote classpath file '<https://builds.apache.org/job/Phoenix-4.x-HBase-0.98/ws/phoenix-pherf/target/classes/mrapp-generated-classpath'.>
[INFO] 
[INFO] --- maven-resources-plugin:2.6:testResources (default-testResources) @ phoenix-pherf
---
[INFO] Using 'UTF-8' encoding to copy filtered resources.
[INFO] Copying 5 resources
[INFO] Copying 5 resources
[INFO] skip non existing resourceDirectory <https://builds.apache.org/job/Phoenix-4.x-HBase-0.98/ws/phoenix-pherf/src/it/resources>
[INFO] Copying 3 resources
[INFO] 
[INFO] --- maven-compiler-plugin:3.0:testCompile (default-testCompile) @ phoenix-pherf ---
[INFO] Changes detected - recompiling the module!
[INFO] Compiling 13 source files to <https://builds.apache.org/job/Phoenix-4.x-HBase-0.98/ws/phoenix-pherf/target/test-classes>
[WARNING] <https://builds.apache.org/job/Phoenix-4.x-HBase-0.98/ws/phoenix-pherf/src/test/java/org/apache/phoenix/pherf/RowCalculatorTest.java>:
<https://builds.apache.org/job/Phoenix-4.x-HBase-0.98/ws/phoenix-pherf/src/test/java/org/apache/phoenix/pherf/RowCalculatorTest.java>
uses or overrides a deprecated API.
[WARNING] <https://builds.apache.org/job/Phoenix-4.x-HBase-0.98/ws/phoenix-pherf/src/test/java/org/apache/phoenix/pherf/RowCalculatorTest.java>:
Recompile with -Xlint:deprecation for details.
[WARNING] <https://builds.apache.org/job/Phoenix-4.x-HBase-0.98/ws/phoenix-pherf/src/test/java/org/apache/phoenix/pherf/RuleGeneratorTest.java>:
Some input files use unchecked or unsafe operations.
[WARNING] <https://builds.apache.org/job/Phoenix-4.x-HBase-0.98/ws/phoenix-pherf/src/test/java/org/apache/phoenix/pherf/RuleGeneratorTest.java>:
Recompile with -Xlint:unchecked for details.
[INFO] 
[INFO] --- maven-surefire-plugin:2.19:test (default-test) @ phoenix-pherf ---

-------------------------------------------------------
 T E S T S
-------------------------------------------------------
Running org.apache.phoenix.pherf.ResourceTest
Tests run: 3, Failures: 0, Errors: 0, Skipped: 0, Time elapsed: 0.702 sec - in org.apache.phoenix.pherf.ResourceTest
Running org.apache.phoenix.pherf.RuleGeneratorTest
Tests run: 6, Failures: 0, Errors: 1, Skipped: 0, Time elapsed: 2.446 sec <<< FAILURE!
- in org.apache.phoenix.pherf.RuleGeneratorTest
testDateGenerator(org.apache.phoenix.pherf.RuleGeneratorTest)  Time elapsed: 0.425 sec  <<<
ERROR!
java.lang.IllegalArgumentException: Invalid format: "2019-09-22 00:01:00.000" is too short
	at org.apache.phoenix.pherf.RuleGeneratorTest.assertDateBetween(RuleGeneratorTest.java:314)
	at org.apache.phoenix.pherf.RuleGeneratorTest.assertRandomDateValue(RuleGeneratorTest.java:191)
	at org.apache.phoenix.pherf.RuleGeneratorTest.testDateGenerator(RuleGeneratorTest.java:57)

Running org.apache.phoenix.pherf.ConfigurationParserTest
Tests run: 2, Failures: 0, Errors: 0, Skipped: 0, Time elapsed: 0.237 sec - in org.apache.phoenix.pherf.ConfigurationParserTest
Running org.apache.phoenix.pherf.ColumnTest
Tests run: 1, Failures: 0, Errors: 0, Skipped: 0, Time elapsed: 0.001 sec - in org.apache.phoenix.pherf.ColumnTest
Running org.apache.phoenix.pherf.RowCalculatorTest
Tests run: 4, Failures: 0, Errors: 0, Skipped: 0, Time elapsed: 0.003 sec - in org.apache.phoenix.pherf.RowCalculatorTest
Running org.apache.phoenix.pherf.TestHBaseProps
Tests run: 1, Failures: 0, Errors: 0, Skipped: 0, Time elapsed: 0.142 sec - in org.apache.phoenix.pherf.TestHBaseProps
Running org.apache.phoenix.pherf.PherfTest
Tests run: 2, Failures: 0, Errors: 0, Skipped: 0, Time elapsed: 0.43 sec - in org.apache.phoenix.pherf.PherfTest
Running org.apache.phoenix.pherf.ResultTest
Tests run: 4, Failures: 0, Errors: 0, Skipped: 0, Time elapsed: 4.341 sec - in org.apache.phoenix.pherf.ResultTest

Results :

Tests in error: 
  RuleGeneratorTest.testDateGenerator:57->assertRandomDateValue:191->assertDateBetween:314
ยป IllegalArgument

Tests run: 23, Failures: 0, Errors: 1, Skipped: 0

[INFO] ------------------------------------------------------------------------
[INFO] Reactor Summary:
[INFO] 
[INFO] Apache Phoenix .................................... SUCCESS [2.832s]
[INFO] Phoenix Core ...................................... SUCCESS [35:05.824s]
[INFO] Phoenix - Flume ................................... SUCCESS [59.548s]
[INFO] Phoenix - Pig ..................................... SUCCESS [1:13.627s]
[INFO] Phoenix Query Server Client ....................... SUCCESS [1.579s]
[INFO] Phoenix Query Server .............................. SUCCESS [1:31.381s]
[INFO] Phoenix - Pherf ................................... FAILURE [14.797s]
[INFO] Phoenix - Spark ................................... SKIPPED
[INFO] Phoenix Assembly .................................. SKIPPED
[INFO] Phoenix - Tracing Web Application ................. SKIPPED
[INFO] ------------------------------------------------------------------------
[INFO] BUILD FAILURE
[INFO] ------------------------------------------------------------------------
[INFO] Total time: 39:10.220s
[INFO] Finished at: Thu Jan 07 00:58:34 UTC 2016
[INFO] Final Memory: 84M/1186M
[INFO] ------------------------------------------------------------------------
[ERROR] Failed to execute goal org.apache.maven.plugins:maven-surefire-plugin:2.19:test (default-test)
on project phoenix-pherf: There are test failures.
[ERROR] 
[ERROR] Please refer to <https://builds.apache.org/job/Phoenix-4.x-HBase-0.98/ws/phoenix-pherf/target/surefire-reports>
for the individual test results.
[ERROR] -> [Help 1]
[ERROR] 
[ERROR] To see the full stack trace of the errors, re-run Maven with the -e switch.
[ERROR] Re-run Maven using the -X switch to enable full debug logging.
[ERROR] 
[ERROR] For more information about the errors and possible solutions, please read the following
articles:
[ERROR] [Help 1] http://cwiki.apache.org/confluence/display/MAVEN/MojoFailureException
[ERROR] 
[ERROR] After correcting the problems, you can resume the build with the command
[ERROR]   mvn <goals> -rf :phoenix-pherf
Build step 'Invoke top-level Maven targets' marked build as failure
Archiving artifacts
Compressed 1.04 GB of artifacts by 28.1% relative to #971
Recording test results

Mime
View raw message