phoenix-commits mailing list archives

Site index · List index
Message view « Date » · « Thread »
Top « Date » · « Thread »
From Apache Jenkins Server <jenk...@builds.apache.org>
Subject Build failed in Jenkins: Phoenix | 4.x-HBase-0.98 #1014
Date Wed, 20 Jan 2016 07:10:48 GMT
See <https://builds.apache.org/job/Phoenix-4.x-HBase-0.98/1014/changes>

Changes:

[jtaylor] PHOENIX-2478 Rows committed in transaction overlapping index creation

------------------------------------------
[...truncated 636 lines...]
Tests run: 1, Failures: 0, Errors: 0, Skipped: 0, Time elapsed: 3.74 sec - in org.apache.phoenix.end2end.QueryExecWithoutSCNIT
Running org.apache.phoenix.end2end.RTrimFunctionIT
Tests run: 2, Failures: 0, Errors: 0, Skipped: 0, Time elapsed: 3.276 sec - in org.apache.phoenix.end2end.RTrimFunctionIT
Tests run: 2, Failures: 0, Errors: 0, Skipped: 0, Time elapsed: 14.824 sec - in org.apache.phoenix.end2end.PhoenixRuntimeIT
Running org.apache.phoenix.end2end.RegexpReplaceFunctionIT
Running org.apache.phoenix.end2end.ReadOnlyIT
Tests run: 2, Failures: 0, Errors: 0, Skipped: 0, Time elapsed: 2.474 sec - in org.apache.phoenix.end2end.RegexpReplaceFunctionIT
Running org.apache.phoenix.end2end.RegexpSplitFunctionIT
Tests run: 11, Failures: 0, Errors: 0, Skipped: 0, Time elapsed: 4.234 sec - in org.apache.phoenix.end2end.RegexpSplitFunctionIT
Running org.apache.phoenix.end2end.RegexpSubstrFunctionIT
Tests run: 1, Failures: 0, Errors: 0, Skipped: 0, Time elapsed: 9.017 sec - in org.apache.phoenix.end2end.ReadOnlyIT
Tests run: 2, Failures: 0, Errors: 0, Skipped: 0, Time elapsed: 2.315 sec - in org.apache.phoenix.end2end.RegexpSubstrFunctionIT
Running org.apache.phoenix.end2end.ReverseScanIT
Running org.apache.phoenix.end2end.ReverseFunctionIT
Tests run: 5, Failures: 0, Errors: 0, Skipped: 0, Time elapsed: 5.15 sec - in org.apache.phoenix.end2end.ReverseFunctionIT
Running org.apache.phoenix.end2end.RoundFloorCeilFunctionsEnd2EndIT
Tests run: 3, Failures: 0, Errors: 0, Skipped: 0, Time elapsed: 7.204 sec - in org.apache.phoenix.end2end.ReverseScanIT
Running org.apache.phoenix.end2end.ServerExceptionIT
Tests run: 6, Failures: 0, Errors: 0, Skipped: 0, Time elapsed: 24.641 sec - in org.apache.phoenix.end2end.QueryMoreIT
Tests run: 1, Failures: 0, Errors: 0, Skipped: 0, Time elapsed: 2.588 sec - in org.apache.phoenix.end2end.ServerExceptionIT
Running org.apache.phoenix.end2end.SignFunctionEnd2EndIT
Running org.apache.phoenix.end2end.SkipScanAfterManualSplitIT
Tests run: 2, Failures: 0, Errors: 0, Skipped: 0, Time elapsed: 7.983 sec - in org.apache.phoenix.end2end.SignFunctionEnd2EndIT
Running org.apache.phoenix.end2end.SkipScanQueryIT
Tests run: 33, Failures: 0, Errors: 0, Skipped: 0, Time elapsed: 27.702 sec - in org.apache.phoenix.end2end.RoundFloorCeilFunctionsEnd2EndIT
Running org.apache.phoenix.end2end.SortMergeJoinIT
Tests run: 3, Failures: 0, Errors: 0, Skipped: 0, Time elapsed: 25.633 sec - in org.apache.phoenix.end2end.SkipScanAfterManualSplitIT
Running org.apache.phoenix.end2end.SortMergeJoinMoreIT
Tests run: 11, Failures: 0, Errors: 0, Skipped: 0, Time elapsed: 23.216 sec - in org.apache.phoenix.end2end.SkipScanQueryIT
Running org.apache.phoenix.end2end.SortOrderIT
Tests run: 3, Failures: 0, Errors: 0, Skipped: 0, Time elapsed: 16.431 sec - in org.apache.phoenix.end2end.SortMergeJoinMoreIT
Running org.apache.phoenix.end2end.SpooledSortMergeJoinIT
Tests run: 28, Failures: 0, Errors: 0, Skipped: 0, Time elapsed: 160.089 sec - in org.apache.phoenix.end2end.InListIT
Running org.apache.phoenix.end2end.SpooledTmpFileDeleteIT
Tests run: 1, Failures: 0, Errors: 0, Skipped: 0, Time elapsed: 3.902 sec - in org.apache.phoenix.end2end.SpooledTmpFileDeleteIT
Running org.apache.phoenix.end2end.SqrtFunctionEnd2EndIT
Tests run: 2, Failures: 0, Errors: 0, Skipped: 0, Time elapsed: 7.39 sec - in org.apache.phoenix.end2end.SqrtFunctionEnd2EndIT
Running org.apache.phoenix.end2end.StatementHintsIT
Tests run: 2, Failures: 0, Errors: 0, Skipped: 0, Time elapsed: 3.586 sec - in org.apache.phoenix.end2end.StatementHintsIT
Running org.apache.phoenix.end2end.StddevIT
Tests run: 4, Failures: 0, Errors: 0, Skipped: 0, Time elapsed: 6.797 sec - in org.apache.phoenix.end2end.StddevIT
Running org.apache.phoenix.end2end.StoreNullsIT
Tests run: 45, Failures: 0, Errors: 0, Skipped: 0, Time elapsed: 75.413 sec - in org.apache.phoenix.end2end.SortOrderIT
Running org.apache.phoenix.end2end.StringToArrayFunctionIT
Tests run: 3, Failures: 0, Errors: 0, Skipped: 0, Time elapsed: 20.765 sec - in org.apache.phoenix.end2end.StoreNullsIT
Running org.apache.phoenix.end2end.SubqueryIT
Tests run: 22, Failures: 0, Errors: 0, Skipped: 0, Time elapsed: 24.159 sec - in org.apache.phoenix.end2end.StringToArrayFunctionIT
Running org.apache.phoenix.end2end.SubqueryUsingSortMergeJoinIT
Tests run: 15, Failures: 0, Errors: 0, Skipped: 0, Time elapsed: 90.81 sec - in org.apache.phoenix.end2end.SubqueryUsingSortMergeJoinIT
Running org.apache.phoenix.end2end.TenantIdTypeIT
Tests run: 21, Failures: 0, Errors: 0, Skipped: 0, Time elapsed: 117.776 sec - in org.apache.phoenix.end2end.SubqueryIT
Running org.apache.phoenix.end2end.TenantSpecificViewIndexIT
Tests run: 96, Failures: 0, Errors: 0, Skipped: 0, Time elapsed: 348.685 sec - in org.apache.phoenix.end2end.HashJoinIT
Running org.apache.phoenix.end2end.TenantSpecificViewIndexSaltedIT
Tests run: 4, Failures: 0, Errors: 0, Skipped: 0, Time elapsed: 14.226 sec - in org.apache.phoenix.end2end.TenantSpecificViewIndexSaltedIT
Tests run: 8, Failures: 0, Errors: 0, Skipped: 0, Time elapsed: 22.678 sec - in org.apache.phoenix.end2end.TenantSpecificViewIndexIT
Running org.apache.phoenix.end2end.TimezoneOffsetFunctionIT
Running org.apache.phoenix.end2end.ToDateFunctionIT
Tests run: 11, Failures: 0, Errors: 0, Skipped: 0, Time elapsed: 8.549 sec - in org.apache.phoenix.end2end.ToDateFunctionIT
Tests run: 7, Failures: 0, Errors: 0, Skipped: 0, Time elapsed: 9.552 sec - in org.apache.phoenix.end2end.TimezoneOffsetFunctionIT
Running org.apache.phoenix.end2end.UpgradeIT
Running org.apache.phoenix.end2end.UpsertBigValuesIT
Tests run: 4, Failures: 0, Errors: 0, Skipped: 0, Time elapsed: 13.87 sec - in org.apache.phoenix.end2end.UpsertBigValuesIT
Running org.apache.phoenix.end2end.UpsertSelectAutoCommitIT
Tests run: 3, Failures: 0, Errors: 0, Skipped: 0, Time elapsed: 15.567 sec - in org.apache.phoenix.end2end.UpsertSelectAutoCommitIT
Running org.apache.phoenix.end2end.index.DropViewIT
Tests run: 99, Failures: 0, Errors: 0, Skipped: 0, Time elapsed: 257.326 sec - in org.apache.phoenix.end2end.SpooledSortMergeJoinIT
Running org.apache.phoenix.end2end.index.GlobalIndexOptimizationIT
Tests run: 1, Failures: 0, Errors: 0, Skipped: 0, Time elapsed: 8.053 sec - in org.apache.phoenix.end2end.index.DropViewIT
Running org.apache.phoenix.end2end.index.ImmutableIndexIT
Tests run: 15, Failures: 0, Errors: 0, Skipped: 0, Time elapsed: 84.608 sec - in org.apache.phoenix.end2end.TenantIdTypeIT
Running org.apache.phoenix.end2end.index.IndexExpressionIT
Tests run: 6, Failures: 0, Errors: 0, Skipped: 0, Time elapsed: 54.481 sec - in org.apache.phoenix.end2end.UpgradeIT
Running org.apache.phoenix.end2end.index.IndexIT
Tests run: 6, Failures: 0, Errors: 0, Skipped: 0, Time elapsed: 38.19 sec - in org.apache.phoenix.end2end.index.GlobalIndexOptimizationIT
Running org.apache.phoenix.end2end.index.IndexMetadataIT
Tests run: 99, Failures: 0, Errors: 0, Skipped: 0, Time elapsed: 343.13 sec - in org.apache.phoenix.end2end.SortMergeJoinIT
Running org.apache.phoenix.end2end.index.LocalIndexIT
Tests run: 7, Failures: 0, Errors: 0, Skipped: 0, Time elapsed: 49.631 sec - in org.apache.phoenix.end2end.index.IndexMetadataIT
Running org.apache.phoenix.end2end.index.MutableIndexIT
Tests run: 24, Failures: 0, Errors: 0, Skipped: 0, Time elapsed: 121.11 sec - in org.apache.phoenix.end2end.index.MutableIndexIT
Running org.apache.phoenix.end2end.index.SaltedIndexIT
Tests run: 20, Failures: 0, Errors: 0, Skipped: 0, Time elapsed: 158.816 sec - in org.apache.phoenix.end2end.index.LocalIndexIT
Running org.apache.phoenix.end2end.index.ViewIndexIT
Tests run: 62, Failures: 0, Errors: 0, Skipped: 0, Time elapsed: 216.491 sec - in org.apache.phoenix.end2end.index.IndexExpressionIT
Tests run: 3, Failures: 0, Errors: 0, Skipped: 0, Time elapsed: 17.952 sec - in org.apache.phoenix.end2end.index.SaltedIndexIT
Running org.apache.phoenix.end2end.index.txn.RollbackIT
Running org.apache.phoenix.end2end.index.txn.MutableRollbackIT
Tests run: 1, Failures: 0, Errors: 0, Skipped: 0, Time elapsed: 4.747 sec - in org.apache.phoenix.end2end.index.ViewIndexIT
Running org.apache.phoenix.end2end.salted.SaltedTableUpsertSelectIT
Tests run: 5, Failures: 0, Errors: 0, Skipped: 0, Time elapsed: 11.485 sec - in org.apache.phoenix.end2end.salted.SaltedTableUpsertSelectIT
Running org.apache.phoenix.end2end.salted.SaltedTableVarLengthRowKeyIT
Tests run: 1, Failures: 0, Errors: 0, Skipped: 0, Time elapsed: 3.581 sec - in org.apache.phoenix.end2end.salted.SaltedTableVarLengthRowKeyIT
Running org.apache.phoenix.iterate.PhoenixQueryTimeoutIT
Tests run: 2, Failures: 0, Errors: 0, Skipped: 0, Time elapsed: 3.573 sec - in org.apache.phoenix.iterate.PhoenixQueryTimeoutIT
Running org.apache.phoenix.iterate.RoundRobinResultIteratorIT
Tests run: 8, Failures: 0, Errors: 0, Skipped: 0, Time elapsed: 39.835 sec - in org.apache.phoenix.end2end.index.txn.RollbackIT
Running org.apache.phoenix.rpc.UpdateCacheIT
Tests run: 6, Failures: 0, Errors: 0, Skipped: 0, Time elapsed: 46.639 sec - in org.apache.phoenix.end2end.index.txn.MutableRollbackIT
Running org.apache.phoenix.trace.PhoenixTableMetricsWriterIT
Tests run: 2, Failures: 0, Errors: 0, Skipped: 0, Time elapsed: 1.804 sec - in org.apache.phoenix.trace.PhoenixTableMetricsWriterIT
Running org.apache.phoenix.trace.PhoenixTraceReaderIT
Tests run: 2, Failures: 0, Errors: 0, Skipped: 0, Time elapsed: 1.188 sec - in org.apache.phoenix.trace.PhoenixTraceReaderIT
Running org.apache.phoenix.trace.PhoenixTracingEndToEndIT
Tests run: 7, Failures: 0, Errors: 0, Skipped: 0, Time elapsed: 20.68 sec - in org.apache.phoenix.rpc.UpdateCacheIT
Running org.apache.phoenix.tx.TransactionIT
Tests run: 9, Failures: 0, Errors: 0, Skipped: 0, Time elapsed: 55.724 sec - in org.apache.phoenix.iterate.RoundRobinResultIteratorIT
Running org.apache.phoenix.tx.TxCheckpointIT
Tests run: 6, Failures: 0, Errors: 0, Skipped: 0, Time elapsed: 92.286 sec - in org.apache.phoenix.trace.PhoenixTracingEndToEndIT
Tests run: 16, Failures: 0, Errors: 0, Skipped: 0, Time elapsed: 73.951 sec - in org.apache.phoenix.tx.TxCheckpointIT
Tests run: 20, Failures: 0, Errors: 0, Skipped: 1, Time elapsed: 124.54 sec - in org.apache.phoenix.tx.TransactionIT
Tests run: 128, Failures: 0, Errors: 0, Skipped: 0, Time elapsed: 526.156 sec - in org.apache.phoenix.end2end.index.IndexIT

Results :

Tests run: 1330, Failures: 0, Errors: 0, Skipped: 1

[INFO] 
[INFO] --- maven-failsafe-plugin:2.19.1:integration-test (NeedTheirOwnClusterTests) @ phoenix-core
---

-------------------------------------------------------
 T E S T S
-------------------------------------------------------
Running org.apache.hadoop.hbase.regionserver.wal.WALReplayWithIndexWritesAndCompressedWALIT
Running org.apache.hadoop.hbase.regionserver.wal.WALReplayWithIndexWritesAndUncompressedWALInHBase_094_9_IT
Tests run: 1, Failures: 0, Errors: 0, Skipped: 0, Time elapsed: 19.337 sec - in org.apache.hadoop.hbase.regionserver.wal.WALReplayWithIndexWritesAndUncompressedWALInHBase_094_9_IT
Tests run: 1, Failures: 0, Errors: 0, Skipped: 0, Time elapsed: 19.362 sec - in org.apache.hadoop.hbase.regionserver.wal.WALReplayWithIndexWritesAndCompressedWALIT
Running org.apache.phoenix.coprocessor.StatisticsCollectionRunTrackerIT
Running org.apache.phoenix.end2end.AlterTableIT
Running org.apache.phoenix.end2end.ConnectionUtilIT
Running org.apache.phoenix.end2end.CountDistinctCompressionIT
Running org.apache.phoenix.end2end.ContextClassloaderIT
Tests run: 1, Failures: 0, Errors: 0, Skipped: 0, Time elapsed: 17.82 sec - in org.apache.phoenix.end2end.ConnectionUtilIT
Tests run: 4, Failures: 0, Errors: 0, Skipped: 0, Time elapsed: 25.144 sec - in org.apache.phoenix.coprocessor.StatisticsCollectionRunTrackerIT
Tests run: 3, Failures: 0, Errors: 0, Skipped: 0, Time elapsed: 3.271 sec - in org.apache.phoenix.end2end.ContextClassloaderIT
Tests run: 1, Failures: 0, Errors: 0, Skipped: 0, Time elapsed: 4.185 sec - in org.apache.phoenix.end2end.CountDistinctCompressionIT
Running org.apache.phoenix.end2end.IndexToolIT
Running org.apache.phoenix.end2end.CsvBulkLoadToolIT
Running org.apache.phoenix.end2end.KeyOnlyIT
Running org.apache.phoenix.end2end.MultiCfQueryExecIT
Tests run: 3, Failures: 0, Errors: 0, Skipped: 0, Time elapsed: 14.685 sec - in org.apache.phoenix.end2end.KeyOnlyIT
Tests run: 8, Failures: 0, Errors: 0, Skipped: 0, Time elapsed: 23.114 sec - in org.apache.phoenix.end2end.MultiCfQueryExecIT
Running org.apache.phoenix.end2end.ParallelIteratorsIT
Running org.apache.phoenix.end2end.QueryTimeoutIT
Tests run: 3, Failures: 0, Errors: 0, Skipped: 0, Time elapsed: 24.228 sec - in org.apache.phoenix.end2end.ParallelIteratorsIT
Tests run: 1, Failures: 0, Errors: 0, Skipped: 0, Time elapsed: 23.88 sec - in org.apache.phoenix.end2end.QueryTimeoutIT
Running org.apache.phoenix.end2end.QueryWithLimitIT
Tests run: 2, Failures: 0, Errors: 0, Skipped: 0, Time elapsed: 13.509 sec - in org.apache.phoenix.end2end.QueryWithLimitIT
Running org.apache.phoenix.end2end.SaltedViewIT
Running org.apache.phoenix.end2end.SpillableGroupByIT
Tests run: 1, Failures: 0, Errors: 0, Skipped: 0, Time elapsed: 13.529 sec - in org.apache.phoenix.end2end.SpillableGroupByIT
Tests run: 4, Failures: 0, Errors: 0, Skipped: 0, Time elapsed: 34.356 sec - in org.apache.phoenix.end2end.SaltedViewIT
Running org.apache.phoenix.end2end.StatsCollectorIT
Running org.apache.phoenix.end2end.StatsCollectorWithSplitsAndMultiCFIT
Tests run: 1, Failures: 0, Errors: 0, Skipped: 0, Time elapsed: 5.45 sec - in org.apache.phoenix.end2end.StatsCollectorWithSplitsAndMultiCFIT
Tests run: 8, Failures: 0, Errors: 0, Skipped: 0, Time elapsed: 228.587 sec - in org.apache.phoenix.end2end.CsvBulkLoadToolIT
Running org.apache.phoenix.end2end.TenantSpecificTablesDDLIT
Running org.apache.phoenix.end2end.TenantSpecificTablesDMLIT
Tests run: 6, Failures: 0, Errors: 0, Skipped: 0, Time elapsed: 64.465 sec - in org.apache.phoenix.end2end.StatsCollectorIT
Tests run: 56, Failures: 0, Errors: 0, Skipped: 0, Time elapsed: 323.746 sec - in org.apache.phoenix.end2end.AlterTableIT
Tests run: 17, Failures: 0, Errors: 0, Skipped: 0, Time elapsed: 44.767 sec - in org.apache.phoenix.end2end.TenantSpecificTablesDDLIT
Tests run: 16, Failures: 0, Errors: 0, Skipped: 0, Time elapsed: 43.77 sec - in org.apache.phoenix.end2end.TenantSpecificTablesDMLIT
Running org.apache.phoenix.end2end.UnionAllIT
Running org.apache.phoenix.end2end.UserDefinedFunctionsIT
Running org.apache.phoenix.end2end.ViewIT
Running org.apache.phoenix.end2end.index.ImmutableIndexWithStatsIT
Tests run: 13, Failures: 0, Errors: 0, Skipped: 0, Time elapsed: 23.081 sec - in org.apache.phoenix.end2end.UserDefinedFunctionsIT
Tests run: 12, Failures: 0, Errors: 0, Skipped: 0, Time elapsed: 33.21 sec - in org.apache.phoenix.end2end.UnionAllIT
Tests run: 1, Failures: 0, Errors: 0, Skipped: 0, Time elapsed: 13.95 sec - in org.apache.phoenix.end2end.index.ImmutableIndexWithStatsIT
Running org.apache.phoenix.end2end.index.MutableIndexFailureIT
Running org.apache.phoenix.end2end.index.MutableIndexReplicationIT
Running org.apache.phoenix.end2end.index.txn.TxWriteFailureIT
Tests run: 1, Failures: 0, Errors: 0, Skipped: 0, Time elapsed: 19.913 sec - in org.apache.phoenix.end2end.index.MutableIndexReplicationIT
Tests run: 9, Failures: 0, Errors: 0, Skipped: 0, Time elapsed: 401.01 sec - in org.apache.phoenix.end2end.IndexToolIT
Running org.apache.phoenix.hbase.index.FailForUnsupportedHBaseVersionsIT
Tests run: 8, Failures: 0, Errors: 0, Skipped: 0, Time elapsed: 34.896 sec - in org.apache.phoenix.end2end.index.txn.TxWriteFailureIT
Running org.apache.phoenix.hbase.index.balancer.IndexLoadBalancerIT
Tests run: 2, Failures: 0, Errors: 0, Skipped: 0, Time elapsed: 18.382 sec - in org.apache.phoenix.hbase.index.FailForUnsupportedHBaseVersionsIT
Running org.apache.phoenix.execute.PartialCommitIT
Running org.apache.phoenix.hbase.index.covered.EndToEndCoveredColumnsIndexBuilderIT
Tests run: 12, Failures: 0, Errors: 0, Skipped: 0, Time elapsed: 7.718 sec - in org.apache.phoenix.execute.PartialCommitIT
Tests run: 2, Failures: 0, Errors: 0, Skipped: 0, Time elapsed: 8.132 sec - in org.apache.phoenix.hbase.index.covered.EndToEndCoveredColumnsIndexBuilderIT
Tests run: 46, Failures: 0, Errors: 0, Skipped: 0, Time elapsed: 144.014 sec - in org.apache.phoenix.end2end.ViewIT
Running org.apache.phoenix.hbase.index.covered.example.EndToEndCoveredIndexingIT
Running org.apache.phoenix.hbase.index.covered.example.FailWithoutRetriesIT
Running org.apache.phoenix.hbase.index.covered.example.EndtoEndIndexingWithCompressionIT
Tests run: 1, Failures: 0, Errors: 0, Skipped: 0, Time elapsed: 7.606 sec - in org.apache.phoenix.hbase.index.covered.example.FailWithoutRetriesIT
Running org.apache.phoenix.iterate.RoundRobinResultIteratorWithStatsIT
Tests run: 11, Failures: 0, Errors: 0, Skipped: 0, Time elapsed: 53.458 sec - in org.apache.phoenix.hbase.index.covered.example.EndToEndCoveredIndexingIT
Tests run: 1, Failures: 0, Errors: 0, Skipped: 0, Time elapsed: 13.419 sec - in org.apache.phoenix.iterate.RoundRobinResultIteratorWithStatsIT
Tests run: 11, Failures: 0, Errors: 0, Skipped: 0, Time elapsed: 62.814 sec - in org.apache.phoenix.hbase.index.covered.example.EndtoEndIndexingWithCompressionIT
Running org.apache.phoenix.monitoring.PhoenixMetricsIT
Tests run: 6, Failures: 0, Errors: 0, Skipped: 2, Time elapsed: 174.942 sec - in org.apache.phoenix.end2end.index.MutableIndexFailureIT
Tests run: 1, Failures: 0, Errors: 0, Skipped: 1, Time elapsed: 0 sec - in org.apache.phoenix.iterate.ScannerLeaseRenewalIT
Running org.apache.phoenix.rpc.PhoenixClientRpcIT
Tests run: 2, Failures: 0, Errors: 0, Skipped: 0, Time elapsed: 5.455 sec - in org.apache.phoenix.rpc.PhoenixClientRpcIT
Running org.apache.phoenix.rpc.PhoenixServerRpcIT
Tests run: 2, Failures: 0, Errors: 0, Skipped: 0, Time elapsed: 15.493 sec - in org.apache.phoenix.rpc.PhoenixServerRpcIT
Tests run: 18, Failures: 0, Errors: 0, Skipped: 0, Time elapsed: 43.571 sec - in org.apache.phoenix.monitoring.PhoenixMetricsIT
Tests run: 9, Failures: 0, Errors: 1, Skipped: 0, Time elapsed: 365.45 sec <<< FAILURE!
- in org.apache.phoenix.hbase.index.balancer.IndexLoadBalancerIT
testRoundRobinAssignmentDuringMasterStartUp(org.apache.phoenix.hbase.index.balancer.IndexLoadBalancerIT)
 Time elapsed: 300.013 sec  <<< ERROR!
org.junit.runners.model.TestTimedOutException: test timed out after 300 seconds
	at org.apache.phoenix.hbase.index.balancer.IndexLoadBalancerIT.createUserAndIndexTable(IndexLoadBalancerIT.java:435)
	at org.apache.phoenix.hbase.index.balancer.IndexLoadBalancerIT.testRoundRobinAssignmentDuringMasterStartUp(IndexLoadBalancerIT.java:401)


Results :

Tests in error: 
  IndexLoadBalancerIT.testRoundRobinAssignmentDuringMasterStartUp:401->createUserAndIndexTable:435
ยป TestTimedOut

Tests run: 305, Failures: 0, Errors: 1, Skipped: 3

[INFO] 
[INFO] --- maven-failsafe-plugin:2.19.1:verify (ClientManagedTimeTests) @ phoenix-core ---
[INFO] ------------------------------------------------------------------------
[INFO] Reactor Summary:
[INFO] 
[INFO] Apache Phoenix .................................... SUCCESS [3.152s]
[INFO] Phoenix Core ...................................... FAILURE [40:55.958s]
[INFO] Phoenix - Flume ................................... SKIPPED
[INFO] Phoenix - Pig ..................................... SKIPPED
[INFO] Phoenix Query Server Client ....................... SKIPPED
[INFO] Phoenix Query Server .............................. SKIPPED
[INFO] Phoenix - Pherf ................................... SKIPPED
[INFO] Phoenix - Spark ................................... SKIPPED
[INFO] Phoenix Assembly .................................. SKIPPED
[INFO] Phoenix - Tracing Web Application ................. SKIPPED
[INFO] ------------------------------------------------------------------------
[INFO] BUILD FAILURE
[INFO] ------------------------------------------------------------------------
[INFO] Total time: 41:00.105s
[INFO] Finished at: Wed Jan 20 07:07:37 UTC 2016
[INFO] Final Memory: 60M/1210M
[INFO] ------------------------------------------------------------------------
[ERROR] Failed to execute goal org.apache.maven.plugins:maven-failsafe-plugin:2.19.1:verify
(ClientManagedTimeTests) on project phoenix-core: There was a timeout or other error in the
fork -> [Help 1]
[ERROR] 
[ERROR] To see the full stack trace of the errors, re-run Maven with the -e switch.
[ERROR] Re-run Maven using the -X switch to enable full debug logging.
[ERROR] 
[ERROR] For more information about the errors and possible solutions, please read the following
articles:
[ERROR] [Help 1] http://cwiki.apache.org/confluence/display/MAVEN/MojoExecutionException
[ERROR] 
[ERROR] After correcting the problems, you can resume the build with the command
[ERROR]   mvn <goals> -rf :phoenix-core
Build step 'Invoke top-level Maven targets' marked build as failure
Archiving artifacts
Compressed 1.11 GB of artifacts by 48.5% relative to #1010
Recording test results

Mime
View raw message