phoenix-commits mailing list archives

Site index · List index
Message view « Date » · « Thread »
Top « Date » · « Thread »
From Apache Jenkins Server <jenk...@builds.apache.org>
Subject Build failed in Jenkins: Phoenix | Master #1055
Date Thu, 07 Jan 2016 03:49:16 GMT
See <https://builds.apache.org/job/Phoenix-master/1055/changes>

Changes:

[samarth] PHOENIX-2570 Start transaction manager only when needed and reduce

------------------------------------------
[...truncated 672 lines...]
Tests run: 5, Failures: 0, Errors: 0, Skipped: 0, Time elapsed: 35.966 sec - in org.apache.phoenix.end2end.salted.SaltedTableUpsertSelectIT
Tests run: 6, Failures: 0, Errors: 0, Skipped: 0, Time elapsed: 12.702 sec - in org.apache.phoenix.end2end.DecodeFunctionIT
Tests run: 5, Failures: 0, Errors: 0, Skipped: 0, Time elapsed: 13.016 sec - in org.apache.phoenix.end2end.ReverseFunctionIT
Running org.apache.phoenix.end2end.SortMergeJoinMoreIT
Running org.apache.phoenix.end2end.ReadOnlyIT
Running org.apache.phoenix.end2end.UpsertSelectAutoCommitIT
Tests run: 1, Failures: 0, Errors: 0, Skipped: 0, Time elapsed: 19.812 sec - in org.apache.phoenix.end2end.ReadOnlyIT
Running org.apache.phoenix.end2end.OctetLengthFunctionEnd2EndIT
Tests run: 1, Failures: 0, Errors: 0, Skipped: 0, Time elapsed: 12.267 sec - in org.apache.phoenix.end2end.OctetLengthFunctionEnd2EndIT
Running org.apache.phoenix.end2end.LpadFunctionIT
Tests run: 3, Failures: 0, Errors: 0, Skipped: 0, Time elapsed: 49.139 sec - in org.apache.phoenix.end2end.UpsertSelectAutoCommitIT
Running org.apache.phoenix.end2end.SpooledTmpFileDeleteIT
Tests run: 1, Failures: 0, Errors: 0, Skipped: 0, Time elapsed: 12.246 sec - in org.apache.phoenix.end2end.SpooledTmpFileDeleteIT
Running org.apache.phoenix.end2end.CoalesceFunctionIT
Tests run: 3, Failures: 0, Errors: 0, Skipped: 0, Time elapsed: 65.268 sec - in org.apache.phoenix.end2end.SortMergeJoinMoreIT
Running org.apache.phoenix.end2end.ArrayAppendFunctionIT
Tests run: 12, Failures: 0, Errors: 0, Skipped: 0, Time elapsed: 51.311 sec - in org.apache.phoenix.end2end.LpadFunctionIT
Running org.apache.phoenix.end2end.SortMergeJoinIT
Tests run: 62, Failures: 0, Errors: 0, Skipped: 0, Time elapsed: 417.728 sec - in org.apache.phoenix.end2end.index.IndexExpressionIT
Running org.apache.phoenix.end2end.RTrimFunctionIT
Tests run: 96, Failures: 0, Errors: 0, Skipped: 0, Time elapsed: 299.747 sec - in org.apache.phoenix.end2end.HashJoinIT
Running org.apache.phoenix.end2end.AlterTableWithViewsIT
Tests run: 10, Failures: 0, Errors: 0, Skipped: 0, Time elapsed: 41.351 sec - in org.apache.phoenix.end2end.CoalesceFunctionIT
Running org.apache.phoenix.end2end.SqrtFunctionEnd2EndIT
Tests run: 2, Failures: 0, Errors: 0, Skipped: 0, Time elapsed: 13.026 sec - in org.apache.phoenix.end2end.RTrimFunctionIT
Running org.apache.phoenix.end2end.RegexpSubstrFunctionIT
Tests run: 34, Failures: 0, Errors: 0, Skipped: 0, Time elapsed: 56.64 sec - in org.apache.phoenix.end2end.ArrayAppendFunctionIT
Running org.apache.phoenix.end2end.MappingTableDataTypeIT
Tests run: 2, Failures: 0, Errors: 0, Skipped: 0, Time elapsed: 11.324 sec - in org.apache.phoenix.end2end.RegexpSubstrFunctionIT
Tests run: 2, Failures: 0, Errors: 0, Skipped: 0, Time elapsed: 19.187 sec - in org.apache.phoenix.end2end.SqrtFunctionEnd2EndIT
Running org.apache.phoenix.end2end.ModulusExpressionIT
Running org.apache.phoenix.end2end.ConvertTimezoneFunctionIT
Tests run: 1, Failures: 0, Errors: 0, Skipped: 0, Time elapsed: 17.677 sec - in org.apache.phoenix.end2end.MappingTableDataTypeIT
Running org.apache.phoenix.end2end.InListIT
Tests run: 7, Failures: 0, Errors: 0, Skipped: 0, Time elapsed: 16.927 sec - in org.apache.phoenix.end2end.ConvertTimezoneFunctionIT
Running org.apache.phoenix.end2end.SubqueryUsingSortMergeJoinIT
Tests run: 11, Failures: 0, Errors: 0, Skipped: 0, Time elapsed: 20.971 sec - in org.apache.phoenix.end2end.ModulusExpressionIT
Running org.apache.phoenix.end2end.SubqueryIT
Tests run: 20, Failures: 0, Errors: 0, Skipped: 0, Time elapsed: 473.188 sec - in org.apache.phoenix.end2end.index.LocalIndexIT
Running org.apache.phoenix.end2end.ArithmeticQueryIT
Tests run: 26, Failures: 0, Errors: 0, Skipped: 0, Time elapsed: 88.835 sec - in org.apache.phoenix.end2end.ArithmeticQueryIT
Running org.apache.phoenix.end2end.StoreNullsIT
Tests run: 3, Failures: 0, Errors: 0, Skipped: 0, Time elapsed: 42.381 sec - in org.apache.phoenix.end2end.StoreNullsIT
Running org.apache.phoenix.end2end.UpgradeIT
Tests run: 15, Failures: 0, Errors: 0, Skipped: 0, Time elapsed: 189.741 sec - in org.apache.phoenix.end2end.SubqueryUsingSortMergeJoinIT
Running org.apache.phoenix.end2end.IsNullIT
Tests run: 3, Failures: 0, Errors: 0, Skipped: 0, Time elapsed: 20.598 sec - in org.apache.phoenix.end2end.IsNullIT
Running org.apache.phoenix.end2end.AutoCommitIT
Tests run: 1, Failures: 0, Errors: 0, Skipped: 0, Time elapsed: 10.194 sec - in org.apache.phoenix.end2end.AutoCommitIT
Running org.apache.phoenix.end2end.ReverseScanIT
Tests run: 128, Failures: 0, Errors: 0, Skipped: 0, Time elapsed: 705.755 sec - in org.apache.phoenix.end2end.index.IndexIT
Running org.apache.phoenix.end2end.StddevIT
Tests run: 3, Failures: 0, Errors: 0, Skipped: 0, Time elapsed: 20.202 sec - in org.apache.phoenix.end2end.ReverseScanIT
Running org.apache.phoenix.end2end.ExecuteStatementsIT
Tests run: 4, Failures: 0, Errors: 0, Skipped: 0, Time elapsed: 12.924 sec - in org.apache.phoenix.end2end.StddevIT
Running org.apache.phoenix.end2end.MD5FunctionIT
Tests run: 21, Failures: 0, Errors: 0, Skipped: 0, Time elapsed: 254.209 sec - in org.apache.phoenix.end2end.SubqueryIT
Running org.apache.phoenix.end2end.SpooledSortMergeJoinIT
Tests run: 3, Failures: 0, Errors: 0, Skipped: 0, Time elapsed: 21.43 sec - in org.apache.phoenix.end2end.MD5FunctionIT
Running org.apache.phoenix.end2end.GroupByCaseIT
Tests run: 6, Failures: 0, Errors: 0, Skipped: 0, Time elapsed: 132.577 sec - in org.apache.phoenix.end2end.UpgradeIT
Running org.apache.phoenix.end2end.ArrayToStringFunctionIT
Tests run: 16, Failures: 0, Errors: 0, Skipped: 0, Time elapsed: 339.144 sec - in org.apache.phoenix.end2end.AlterTableWithViewsIT
Running org.apache.phoenix.end2end.NthValueFunctionIT
Tests run: 28, Failures: 0, Errors: 0, Skipped: 0, Time elapsed: 301.638 sec - in org.apache.phoenix.end2end.InListIT
Tests run: 2, Failures: 0, Errors: 0, Skipped: 0, Time elapsed: 53.478 sec - in org.apache.phoenix.end2end.ExecuteStatementsIT
Running org.apache.phoenix.end2end.TenantIdTypeIT
Running org.apache.phoenix.end2end.HashJoinLocalIndexIT
Tests run: 5, Failures: 0, Errors: 0, Skipped: 0, Time elapsed: 30.861 sec - in org.apache.phoenix.end2end.GroupByCaseIT
Running org.apache.phoenix.end2end.InstrFunctionIT
Tests run: 8, Failures: 0, Errors: 0, Skipped: 0, Time elapsed: 15.575 sec - in org.apache.phoenix.end2end.InstrFunctionIT
Tests run: 36, Failures: 0, Errors: 0, Skipped: 0, Time elapsed: 41.146 sec - in org.apache.phoenix.end2end.ArrayToStringFunctionIT
Running org.apache.phoenix.end2end.SkipScanAfterManualSplitIT
Running org.apache.phoenix.end2end.StringToArrayFunctionIT
Tests run: 11, Failures: 0, Errors: 0, Skipped: 0, Time elapsed: 23.818 sec - in org.apache.phoenix.end2end.NthValueFunctionIT
Running org.apache.phoenix.end2end.QueryMoreIT
Tests run: 22, Failures: 0, Errors: 0, Skipped: 0, Time elapsed: 44.607 sec - in org.apache.phoenix.end2end.StringToArrayFunctionIT
Running org.apache.phoenix.end2end.MinMaxAggregateFunctionIT
Tests run: 1, Failures: 0, Errors: 0, Skipped: 0, Time elapsed: 72.575 sec - in org.apache.phoenix.end2end.HashJoinLocalIndexIT
Running org.apache.phoenix.end2end.LnLogFunctionEnd2EndIT
Tests run: 1, Failures: 0, Errors: 0, Skipped: 0, Time elapsed: 7.985 sec - in org.apache.phoenix.end2end.MinMaxAggregateFunctionIT
Running org.apache.phoenix.end2end.PhoenixRuntimeIT
Tests run: 3, Failures: 0, Errors: 0, Skipped: 0, Time elapsed: 65.06 sec - in org.apache.phoenix.end2end.SkipScanAfterManualSplitIT
Running org.apache.phoenix.end2end.ArraysWithNullsIT
Tests run: 1, Failures: 0, Errors: 0, Skipped: 0, Time elapsed: 15.928 sec - in org.apache.phoenix.end2end.LnLogFunctionEnd2EndIT
Running org.apache.phoenix.end2end.DateTimeIT
Tests run: 6, Failures: 0, Errors: 0, Skipped: 0, Time elapsed: 68.073 sec - in org.apache.phoenix.end2end.QueryMoreIT
Running org.apache.phoenix.rpc.UpdateCacheIT
Tests run: 3, Failures: 0, Errors: 0, Skipped: 0, Time elapsed: 32.848 sec - in org.apache.phoenix.rpc.UpdateCacheIT
Running org.apache.phoenix.tx.TxCheckpointIT
Tests run: 20, Failures: 0, Errors: 0, Skipped: 0, Time elapsed: 37.235 sec - in org.apache.phoenix.end2end.DateTimeIT
Running org.apache.phoenix.tx.TransactionIT
Tests run: 2, Failures: 0, Errors: 0, Skipped: 0, Time elapsed: 55.53 sec - in org.apache.phoenix.end2end.PhoenixRuntimeIT
Running org.apache.phoenix.iterate.RoundRobinResultIteratorIT
Tests run: 99, Failures: 0, Errors: 0, Skipped: 0, Time elapsed: 520.594 sec - in org.apache.phoenix.end2end.SortMergeJoinIT
Running org.apache.phoenix.iterate.PhoenixQueryTimeoutIT
Tests run: 2, Failures: 0, Errors: 0, Skipped: 0, Time elapsed: 9.456 sec - in org.apache.phoenix.iterate.PhoenixQueryTimeoutIT
Running org.apache.phoenix.trace.PhoenixTracingEndToEndIT
Tests run: 16, Failures: 0, Errors: 0, Skipped: 0, Time elapsed: 131.084 sec - in org.apache.phoenix.end2end.ArraysWithNullsIT
Running org.apache.phoenix.trace.PhoenixTableMetricsWriterIT
Tests run: 2, Failures: 0, Errors: 0, Skipped: 0, Time elapsed: 2.892 sec - in org.apache.phoenix.trace.PhoenixTableMetricsWriterIT
Running org.apache.phoenix.trace.PhoenixTraceReaderIT
Tests run: 2, Failures: 0, Errors: 0, Skipped: 0, Time elapsed: 0.732 sec - in org.apache.phoenix.trace.PhoenixTraceReaderIT
Tests run: 9, Failures: 0, Errors: 0, Skipped: 0, Time elapsed: 129.616 sec - in org.apache.phoenix.iterate.RoundRobinResultIteratorIT
Tests run: 15, Failures: 0, Errors: 0, Skipped: 0, Time elapsed: 262.727 sec - in org.apache.phoenix.end2end.TenantIdTypeIT
Tests run: 6, Failures: 0, Errors: 0, Skipped: 0, Time elapsed: 101.755 sec - in org.apache.phoenix.trace.PhoenixTracingEndToEndIT
Tests run: 16, Failures: 0, Errors: 0, Skipped: 0, Time elapsed: 168.715 sec - in org.apache.phoenix.tx.TxCheckpointIT
Tests run: 19, Failures: 0, Errors: 0, Skipped: 3, Time elapsed: 223.063 sec - in org.apache.phoenix.tx.TransactionIT
Tests run: 99, Failures: 0, Errors: 0, Skipped: 0, Time elapsed: 512.442 sec - in org.apache.phoenix.end2end.SpooledSortMergeJoinIT

Results :

Tests run: 1329, Failures: 0, Errors: 0, Skipped: 3

[INFO] 
[INFO] --- maven-failsafe-plugin:2.19:integration-test (NeedTheirOwnClusterTests) @ phoenix-core
---

-------------------------------------------------------
 T E S T S
-------------------------------------------------------
Running org.apache.hadoop.hbase.regionserver.wal.WALReplayWithIndexWritesAndUncompressedWALInHBase_094_9_IT
Running org.apache.hadoop.hbase.regionserver.wal.WALReplayWithIndexWritesAndCompressedWALIT
Tests run: 1, Failures: 0, Errors: 0, Skipped: 0, Time elapsed: 31.339 sec - in org.apache.hadoop.hbase.regionserver.wal.WALReplayWithIndexWritesAndUncompressedWALInHBase_094_9_IT
Tests run: 1, Failures: 0, Errors: 0, Skipped: 0, Time elapsed: 31.551 sec - in org.apache.hadoop.hbase.regionserver.wal.WALReplayWithIndexWritesAndCompressedWALIT
Running org.apache.phoenix.end2end.TenantSpecificTablesDDLIT
Running org.apache.phoenix.end2end.CountDistinctCompressionIT
Running org.apache.phoenix.coprocessor.StatisticsCollectionRunTrackerIT
Running org.apache.phoenix.monitoring.PhoenixMetricsIT
Tests run: 1, Failures: 0, Errors: 0, Skipped: 0, Time elapsed: 16.92 sec - in org.apache.phoenix.end2end.CountDistinctCompressionIT
Running org.apache.phoenix.execute.PartialCommitIT
Tests run: 12, Failures: 0, Errors: 0, Skipped: 0, Time elapsed: 5.485 sec - in org.apache.phoenix.execute.PartialCommitIT
Running org.apache.phoenix.end2end.ContextClassloaderIT
Running org.apache.phoenix.end2end.AlterTableIT
Tests run: 4, Failures: 0, Errors: 0, Skipped: 0, Time elapsed: 32.947 sec - in org.apache.phoenix.coprocessor.StatisticsCollectionRunTrackerIT
Tests run: 3, Failures: 0, Errors: 0, Skipped: 0, Time elapsed: 15.452 sec - in org.apache.phoenix.end2end.ContextClassloaderIT
Running org.apache.phoenix.end2end.index.txn.TxWriteFailureIT
Running org.apache.phoenix.end2end.index.MutableIndexFailureIT
Running org.apache.phoenix.end2end.index.ImmutableIndexWithStatsIT
Tests run: 1, Failures: 0, Errors: 0, Skipped: 0, Time elapsed: 8.613 sec - in org.apache.phoenix.end2end.index.ImmutableIndexWithStatsIT
Tests run: 17, Failures: 0, Errors: 0, Skipped: 0, Time elapsed: 78.671 sec - in org.apache.phoenix.end2end.TenantSpecificTablesDDLIT
Running org.apache.phoenix.end2end.index.MutableIndexReplicationIT
Running org.apache.phoenix.end2end.StatsCollectorIT
Tests run: 8, Failures: 0, Errors: 0, Skipped: 0, Time elapsed: 54.212 sec - in org.apache.phoenix.end2end.index.txn.TxWriteFailureIT
Running org.apache.phoenix.end2end.TenantSpecificTablesDMLIT
Tests run: 1, Failures: 0, Errors: 0, Skipped: 0, Time elapsed: 43.347 sec - in org.apache.phoenix.end2end.index.MutableIndexReplicationIT
Tests run: 17, Failures: 0, Errors: 0, Skipped: 0, Time elapsed: 115.199 sec - in org.apache.phoenix.monitoring.PhoenixMetricsIT
Running org.apache.phoenix.end2end.SaltedViewIT
Running org.apache.phoenix.end2end.KeyOnlyIT
Running org.apache.phoenix.end2end.ParallelIteratorsIT
Tests run: 16, Failures: 0, Errors: 0, Skipped: 0, Time elapsed: 65.262 sec - in org.apache.phoenix.end2end.TenantSpecificTablesDMLIT
Tests run: 3, Failures: 0, Errors: 0, Skipped: 0, Time elapsed: 26.088 sec - in org.apache.phoenix.end2end.KeyOnlyIT
Tests run: 5, Failures: 0, Errors: 0, Skipped: 0, Time elapsed: 88.465 sec - in org.apache.phoenix.end2end.StatsCollectorIT
Tests run: 4, Failures: 0, Errors: 0, Skipped: 0, Time elapsed: 56.12 sec - in org.apache.phoenix.end2end.SaltedViewIT
Running org.apache.phoenix.end2end.StatsCollectorWithSplitsAndMultiCFIT
Running org.apache.phoenix.end2end.ConnectionUtilIT
Running org.apache.phoenix.end2end.QueryWithLimitIT
Tests run: 3, Failures: 0, Errors: 0, Skipped: 0, Time elapsed: 54.964 sec - in org.apache.phoenix.end2end.ParallelIteratorsIT
Running org.apache.phoenix.end2end.MultiCfQueryExecIT
Tests run: 2, Failures: 0, Errors: 0, Skipped: 0, Time elapsed: 21.487 sec - in org.apache.phoenix.end2end.QueryWithLimitIT
Tests run: 2, Failures: 0, Errors: 0, Skipped: 0, Time elapsed: 39.483 sec - in org.apache.phoenix.end2end.StatsCollectorWithSplitsAndMultiCFIT
Running org.apache.phoenix.end2end.ViewIT
Tests run: 1, Failures: 0, Errors: 0, Skipped: 0, Time elapsed: 38.407 sec - in org.apache.phoenix.end2end.ConnectionUtilIT
Tests run: 6, Failures: 0, Errors: 0, Skipped: 2, Time elapsed: 192.605 sec - in org.apache.phoenix.end2end.index.MutableIndexFailureIT
Tests run: 8, Failures: 0, Errors: 0, Skipped: 0, Time elapsed: 28.801 sec - in org.apache.phoenix.end2end.MultiCfQueryExecIT
Running org.apache.phoenix.end2end.QueryTimeoutIT
Running org.apache.phoenix.end2end.SpillableGroupByIT
Running org.apache.phoenix.end2end.UnionAllIT
Running org.apache.phoenix.end2end.UserDefinedFunctionsIT
Tests run: 1, Failures: 0, Errors: 0, Skipped: 0, Time elapsed: 20.187 sec - in org.apache.phoenix.end2end.QueryTimeoutIT
Tests run: 1, Failures: 0, Errors: 0, Skipped: 0, Time elapsed: 13.496 sec - in org.apache.phoenix.end2end.SpillableGroupByIT
Running org.apache.phoenix.mapreduce.CsvBulkLoadToolIT
Running org.apache.phoenix.mapreduce.IndexToolIT
Running org.apache.phoenix.rpc.PhoenixClientRpcIT
Tests run: 12, Failures: 0, Errors: 0, Skipped: 0, Time elapsed: 48.903 sec - in org.apache.phoenix.end2end.UnionAllIT
Tests run: 2, Failures: 0, Errors: 0, Skipped: 0, Time elapsed: 14.787 sec - in org.apache.phoenix.rpc.PhoenixClientRpcIT
Tests run: 13, Failures: 0, Errors: 0, Skipped: 0, Time elapsed: 63.76 sec - in org.apache.phoenix.end2end.UserDefinedFunctionsIT
Running org.apache.phoenix.rpc.PhoenixServerRpcIT
Tests run: 2, Failures: 0, Errors: 0, Skipped: 0, Time elapsed: 19.899 sec - in org.apache.phoenix.rpc.PhoenixServerRpcIT
Running org.apache.phoenix.iterate.RoundRobinResultIteratorWithStatsIT
Tests run: 1, Failures: 0, Errors: 0, Skipped: 1, Time elapsed: 53.939 sec - in org.apache.phoenix.iterate.ScannerLeaseRenewalIT
Running org.apache.phoenix.hbase.index.balancer.IndexLoadBalancerIT
Running org.apache.phoenix.hbase.index.covered.EndToEndCoveredColumnsIndexBuilderIT
Tests run: 1, Failures: 0, Errors: 0, Skipped: 0, Time elapsed: 15.2 sec - in org.apache.phoenix.iterate.RoundRobinResultIteratorWithStatsIT
Tests run: 2, Failures: 0, Errors: 0, Skipped: 0, Time elapsed: 27.466 sec - in org.apache.phoenix.hbase.index.covered.EndToEndCoveredColumnsIndexBuilderIT
Running org.apache.phoenix.hbase.index.covered.example.EndToEndCoveredIndexingIT
Tests run: 44, Failures: 0, Errors: 0, Skipped: 0, Time elapsed: 206.373 sec - in org.apache.phoenix.end2end.ViewIT
Running org.apache.phoenix.hbase.index.covered.example.FailWithoutRetriesIT
Running org.apache.phoenix.hbase.index.covered.example.EndtoEndIndexingWithCompressionIT
Tests run: 1, Failures: 0, Errors: 0, Skipped: 0, Time elapsed: 7.851 sec - in org.apache.phoenix.hbase.index.covered.example.FailWithoutRetriesIT
Running org.apache.phoenix.hbase.index.FailForUnsupportedHBaseVersionsIT
Tests run: 2, Failures: 0, Errors: 0, Skipped: 0, Time elapsed: 30.162 sec - in org.apache.phoenix.hbase.index.FailForUnsupportedHBaseVersionsIT
Tests run: 8, Failures: 0, Errors: 0, Skipped: 0, Time elapsed: 290.739 sec - in org.apache.phoenix.mapreduce.CsvBulkLoadToolIT
Tests run: 56, Failures: 0, Errors: 0, Skipped: 0, Time elapsed: 576.476 sec - in org.apache.phoenix.end2end.AlterTableIT
Tests run: 11, Failures: 0, Errors: 0, Skipped: 0, Time elapsed: 278.792 sec - in org.apache.phoenix.hbase.index.covered.example.EndToEndCoveredIndexingIT
Tests run: 11, Failures: 0, Errors: 0, Skipped: 0, Time elapsed: 269.763 sec - in org.apache.phoenix.hbase.index.covered.example.EndtoEndIndexingWithCompressionIT
Tests run: 9, Failures: 1, Errors: 0, Skipped: 0, Time elapsed: 363.897 sec <<< FAILURE!
- in org.apache.phoenix.hbase.index.balancer.IndexLoadBalancerIT
testRoundRobinAssignmentDuringMasterStartUp(org.apache.phoenix.hbase.index.balancer.IndexLoadBalancerIT)
 Time elapsed: 39.031 sec  <<< FAILURE!
java.lang.AssertionError: User regions and index regions should colocate.
	at org.apache.phoenix.hbase.index.balancer.IndexLoadBalancerIT.testRoundRobinAssignmentDuringMasterStartUp(IndexLoadBalancerIT.java:425)

Tests run: 9, Failures: 0, Errors: 0, Skipped: 0, Time elapsed: 510.85 sec - in org.apache.phoenix.mapreduce.IndexToolIT

Results :

Failed tests: 
  IndexLoadBalancerIT.testRoundRobinAssignmentDuringMasterStartUp:425 User regions and index
regions should colocate.

Tests run: 302, Failures: 1, Errors: 0, Skipped: 3

[INFO] 
[INFO] --- maven-failsafe-plugin:2.19:verify (ClientManagedTimeTests) @ phoenix-core ---
[INFO] ------------------------------------------------------------------------
[INFO] Reactor Summary:
[INFO] 
[INFO] Apache Phoenix .................................... SUCCESS [6.425s]
[INFO] Phoenix Core ...................................... FAILURE [52:26.731s]
[INFO] Phoenix - Flume ................................... SKIPPED
[INFO] Phoenix - Pig ..................................... SKIPPED
[INFO] Phoenix Query Server Client ....................... SKIPPED
[INFO] Phoenix Query Server .............................. SKIPPED
[INFO] Phoenix - Pherf ................................... SKIPPED
[INFO] Phoenix - Spark ................................... SKIPPED
[INFO] Phoenix Assembly .................................. SKIPPED
[INFO] Phoenix - Tracing Web Application ................. SKIPPED
[INFO] ------------------------------------------------------------------------
[INFO] BUILD FAILURE
[INFO] ------------------------------------------------------------------------
[INFO] Total time: 52:33.744s
[INFO] Finished at: Thu Jan 07 03:44:44 UTC 2016
[INFO] Final Memory: 48M/1090M
[INFO] ------------------------------------------------------------------------
[ERROR] Failed to execute goal org.apache.maven.plugins:maven-failsafe-plugin:2.19:verify
(ClientManagedTimeTests) on project phoenix-core: There are test failures.
[ERROR] 
[ERROR] Please refer to /x1/jenkins/jenkins-slave/workspace/Phoenix-master/phoenix-core/target/failsafe-reports
for the individual test results.
[ERROR] -> [Help 1]
[ERROR] 
[ERROR] To see the full stack trace of the errors, re-run Maven with the -e switch.
[ERROR] Re-run Maven using the -X switch to enable full debug logging.
[ERROR] 
[ERROR] For more information about the errors and possible solutions, please read the following
articles:
[ERROR] [Help 1] http://cwiki.apache.org/confluence/display/MAVEN/MojoFailureException
[ERROR] 
[ERROR] After correcting the problems, you can resume the build with the command
[ERROR]   mvn <goals> -rf :phoenix-core
Build step 'Invoke top-level Maven targets' marked build as failure
Archiving artifacts
Compressed 1.20 GB of artifacts by 31.7% relative to #1051
Updating PHOENIX-2570
Recording test results

Mime
View raw message