phoenix-commits mailing list archives

Site index · List index
Message view « Date » · « Thread »
Top « Date » · « Thread »
From Apache Jenkins Server <jenk...@builds.apache.org>
Subject Build failed in Jenkins: Phoenix | 4.x-HBase-0.98 #992
Date Tue, 12 Jan 2016 23:11:00 GMT
See <https://builds.apache.org/job/Phoenix-4.x-HBase-0.98/992/>

------------------------------------------
[...truncated 636 lines...]
Tests run: 1, Failures: 0, Errors: 0, Skipped: 0, Time elapsed: 9.647 sec - in org.apache.phoenix.end2end.ReadOnlyIT
Tests run: 2, Failures: 0, Errors: 0, Skipped: 0, Time elapsed: 23.221 sec - in org.apache.phoenix.end2end.PhoenixRuntimeIT
Running org.apache.phoenix.end2end.RegexpReplaceFunctionIT
Running org.apache.phoenix.end2end.RegexpSplitFunctionIT
Tests run: 2, Failures: 0, Errors: 0, Skipped: 0, Time elapsed: 4.624 sec - in org.apache.phoenix.end2end.RegexpReplaceFunctionIT
Running org.apache.phoenix.end2end.RegexpSubstrFunctionIT
Tests run: 6, Failures: 0, Errors: 0, Skipped: 0, Time elapsed: 24.726 sec - in org.apache.phoenix.end2end.QueryMoreIT
Running org.apache.phoenix.end2end.ReverseFunctionIT
Tests run: 2, Failures: 0, Errors: 0, Skipped: 0, Time elapsed: 4.472 sec - in org.apache.phoenix.end2end.RegexpSubstrFunctionIT
Tests run: 5, Failures: 0, Errors: 0, Skipped: 0, Time elapsed: 3.953 sec - in org.apache.phoenix.end2end.ReverseFunctionIT
Running org.apache.phoenix.end2end.ReverseScanIT
Running org.apache.phoenix.end2end.RoundFloorCeilFunctionsEnd2EndIT
Tests run: 11, Failures: 0, Errors: 0, Skipped: 0, Time elapsed: 12.147 sec - in org.apache.phoenix.end2end.RegexpSplitFunctionIT
Running org.apache.phoenix.end2end.ServerExceptionIT
Tests run: 1, Failures: 0, Errors: 0, Skipped: 0, Time elapsed: 3.485 sec - in org.apache.phoenix.end2end.ServerExceptionIT
Running org.apache.phoenix.end2end.SignFunctionEnd2EndIT
Tests run: 3, Failures: 0, Errors: 0, Skipped: 0, Time elapsed: 9.027 sec - in org.apache.phoenix.end2end.ReverseScanIT
Running org.apache.phoenix.end2end.SkipScanAfterManualSplitIT
Tests run: 2, Failures: 0, Errors: 0, Skipped: 0, Time elapsed: 9.721 sec - in org.apache.phoenix.end2end.SignFunctionEnd2EndIT
Tests run: 32, Failures: 0, Errors: 0, Skipped: 0, Time elapsed: 16.768 sec - in org.apache.phoenix.end2end.RoundFloorCeilFunctionsEnd2EndIT
Running org.apache.phoenix.end2end.SortMergeJoinIT
Running org.apache.phoenix.end2end.SkipScanQueryIT
Tests run: 11, Failures: 0, Errors: 0, Skipped: 0, Time elapsed: 30.718 sec - in org.apache.phoenix.end2end.SkipScanQueryIT
Running org.apache.phoenix.end2end.SortMergeJoinMoreIT
Tests run: 3, Failures: 0, Errors: 0, Skipped: 0, Time elapsed: 43.032 sec - in org.apache.phoenix.end2end.SkipScanAfterManualSplitIT
Running org.apache.phoenix.end2end.SortOrderIT
Tests run: 3, Failures: 0, Errors: 0, Skipped: 0, Time elapsed: 25.66 sec - in org.apache.phoenix.end2end.SortMergeJoinMoreIT
Running org.apache.phoenix.end2end.SpooledSortMergeJoinIT
Tests run: 28, Failures: 0, Errors: 0, Skipped: 0, Time elapsed: 212.012 sec - in org.apache.phoenix.end2end.InListIT
Running org.apache.phoenix.end2end.SpooledTmpFileDeleteIT
Tests run: 1, Failures: 0, Errors: 0, Skipped: 0, Time elapsed: 4.126 sec - in org.apache.phoenix.end2end.SpooledTmpFileDeleteIT
Running org.apache.phoenix.end2end.SqrtFunctionEnd2EndIT
Tests run: 2, Failures: 0, Errors: 0, Skipped: 0, Time elapsed: 9.347 sec - in org.apache.phoenix.end2end.SqrtFunctionEnd2EndIT
Running org.apache.phoenix.end2end.StatementHintsIT
Tests run: 2, Failures: 0, Errors: 0, Skipped: 0, Time elapsed: 3.845 sec - in org.apache.phoenix.end2end.StatementHintsIT
Running org.apache.phoenix.end2end.StddevIT
Tests run: 4, Failures: 0, Errors: 0, Skipped: 0, Time elapsed: 6.21 sec - in org.apache.phoenix.end2end.StddevIT
Running org.apache.phoenix.end2end.StoreNullsIT
Tests run: 45, Failures: 0, Errors: 0, Skipped: 0, Time elapsed: 95.66 sec - in org.apache.phoenix.end2end.SortOrderIT
Running org.apache.phoenix.end2end.StringToArrayFunctionIT
Tests run: 3, Failures: 0, Errors: 0, Skipped: 0, Time elapsed: 18.832 sec - in org.apache.phoenix.end2end.StoreNullsIT
Running org.apache.phoenix.end2end.SubqueryIT
Tests run: 22, Failures: 0, Errors: 0, Skipped: 0, Time elapsed: 21.462 sec - in org.apache.phoenix.end2end.StringToArrayFunctionIT
Running org.apache.phoenix.end2end.SubqueryUsingSortMergeJoinIT
Tests run: 99, Failures: 0, Errors: 0, Skipped: 0, Time elapsed: 185.361 sec - in org.apache.phoenix.end2end.SortMergeJoinIT
Running org.apache.phoenix.end2end.TenantIdTypeIT
Tests run: 15, Failures: 0, Errors: 0, Skipped: 0, Time elapsed: 97.779 sec - in org.apache.phoenix.end2end.SubqueryUsingSortMergeJoinIT
Running org.apache.phoenix.end2end.TenantSpecificViewIndexIT
Tests run: 15, Failures: 0, Errors: 0, Skipped: 0, Time elapsed: 90.445 sec - in org.apache.phoenix.end2end.TenantIdTypeIT
Running org.apache.phoenix.end2end.TenantSpecificViewIndexSaltedIT
Tests run: 21, Failures: 0, Errors: 0, Skipped: 0, Time elapsed: 136.451 sec - in org.apache.phoenix.end2end.SubqueryIT
Running org.apache.phoenix.end2end.TimezoneOffsetFunctionIT
Tests run: 8, Failures: 0, Errors: 0, Skipped: 0, Time elapsed: 23.64 sec - in org.apache.phoenix.end2end.TenantSpecificViewIndexIT
Running org.apache.phoenix.end2end.ToDateFunctionIT
Tests run: 4, Failures: 0, Errors: 0, Skipped: 0, Time elapsed: 9.757 sec - in org.apache.phoenix.end2end.TenantSpecificViewIndexSaltedIT
Running org.apache.phoenix.end2end.UpgradeIT
Tests run: 7, Failures: 0, Errors: 0, Skipped: 0, Time elapsed: 8.805 sec - in org.apache.phoenix.end2end.TimezoneOffsetFunctionIT
Tests run: 11, Failures: 0, Errors: 0, Skipped: 0, Time elapsed: 7.891 sec - in org.apache.phoenix.end2end.ToDateFunctionIT
Running org.apache.phoenix.end2end.UpsertSelectAutoCommitIT
Running org.apache.phoenix.end2end.UpsertBigValuesIT
Tests run: 4, Failures: 0, Errors: 0, Skipped: 0, Time elapsed: 14.344 sec - in org.apache.phoenix.end2end.UpsertBigValuesIT
Running org.apache.phoenix.end2end.index.DropViewIT
Tests run: 3, Failures: 0, Errors: 0, Skipped: 0, Time elapsed: 18.402 sec - in org.apache.phoenix.end2end.UpsertSelectAutoCommitIT
Running org.apache.phoenix.end2end.index.GlobalIndexOptimizationIT
Tests run: 1, Failures: 0, Errors: 0, Skipped: 0, Time elapsed: 8.935 sec - in org.apache.phoenix.end2end.index.DropViewIT
Running org.apache.phoenix.end2end.index.ImmutableIndexIT
Tests run: 96, Failures: 0, Errors: 0, Skipped: 0, Time elapsed: 447.344 sec - in org.apache.phoenix.end2end.HashJoinIT
Running org.apache.phoenix.end2end.index.IndexExpressionIT
Tests run: 6, Failures: 0, Errors: 0, Skipped: 0, Time elapsed: 48.015 sec - in org.apache.phoenix.end2end.UpgradeIT
Running org.apache.phoenix.end2end.index.IndexIT
Tests run: 4, Failures: 0, Errors: 0, Skipped: 0, Time elapsed: 29.995 sec - in org.apache.phoenix.end2end.index.ImmutableIndexIT
Running org.apache.phoenix.end2end.index.IndexMetadataIT
Tests run: 6, Failures: 0, Errors: 0, Skipped: 0, Time elapsed: 50.822 sec - in org.apache.phoenix.end2end.index.GlobalIndexOptimizationIT
Running org.apache.phoenix.end2end.index.LocalIndexIT
Tests run: 7, Failures: 0, Errors: 0, Skipped: 0, Time elapsed: 62.959 sec - in org.apache.phoenix.end2end.index.IndexMetadataIT
Running org.apache.phoenix.end2end.index.MutableIndexIT
Tests run: 99, Failures: 0, Errors: 0, Skipped: 0, Time elapsed: 424.364 sec - in org.apache.phoenix.end2end.SpooledSortMergeJoinIT
Running org.apache.phoenix.end2end.index.SaltedIndexIT
Tests run: 3, Failures: 0, Errors: 0, Skipped: 0, Time elapsed: 25.918 sec - in org.apache.phoenix.end2end.index.SaltedIndexIT
Running org.apache.phoenix.end2end.index.ViewIndexIT
Tests run: 1, Failures: 0, Errors: 0, Skipped: 0, Time elapsed: 7.044 sec - in org.apache.phoenix.end2end.index.ViewIndexIT
Running org.apache.phoenix.end2end.index.txn.MutableRollbackIT
Tests run: 20, Failures: 0, Errors: 0, Skipped: 0, Time elapsed: 181.675 sec - in org.apache.phoenix.end2end.index.LocalIndexIT
Running org.apache.phoenix.end2end.index.txn.RollbackIT
Tests run: 62, Failures: 0, Errors: 0, Skipped: 0, Time elapsed: 241.912 sec - in org.apache.phoenix.end2end.index.IndexExpressionIT
Running org.apache.phoenix.end2end.salted.SaltedTableUpsertSelectIT
Tests run: 24, Failures: 0, Errors: 0, Skipped: 0, Time elapsed: 157.744 sec - in org.apache.phoenix.end2end.index.MutableIndexIT
Running org.apache.phoenix.end2end.salted.SaltedTableVarLengthRowKeyIT
Tests run: 1, Failures: 0, Errors: 0, Skipped: 0, Time elapsed: 4.449 sec - in org.apache.phoenix.end2end.salted.SaltedTableVarLengthRowKeyIT
Running org.apache.phoenix.iterate.PhoenixQueryTimeoutIT
Tests run: 2, Failures: 0, Errors: 0, Skipped: 0, Time elapsed: 5.748 sec - in org.apache.phoenix.iterate.PhoenixQueryTimeoutIT
Running org.apache.phoenix.iterate.RoundRobinResultIteratorIT
Tests run: 6, Failures: 0, Errors: 0, Skipped: 0, Time elapsed: 58.673 sec - in org.apache.phoenix.end2end.index.txn.MutableRollbackIT
Running org.apache.phoenix.rpc.UpdateCacheIT
Tests run: 5, Failures: 0, Errors: 0, Skipped: 0, Time elapsed: 17.494 sec - in org.apache.phoenix.end2end.salted.SaltedTableUpsertSelectIT
Running org.apache.phoenix.trace.PhoenixTableMetricsWriterIT
Tests run: 2, Failures: 0, Errors: 0, Skipped: 0, Time elapsed: 2.719 sec - in org.apache.phoenix.trace.PhoenixTableMetricsWriterIT
Running org.apache.phoenix.trace.PhoenixTraceReaderIT
Tests run: 2, Failures: 0, Errors: 0, Skipped: 0, Time elapsed: 1.081 sec - in org.apache.phoenix.trace.PhoenixTraceReaderIT
Running org.apache.phoenix.trace.PhoenixTracingEndToEndIT
Tests run: 8, Failures: 0, Errors: 0, Skipped: 0, Time elapsed: 50.401 sec - in org.apache.phoenix.end2end.index.txn.RollbackIT
Running org.apache.phoenix.tx.TransactionIT
Tests run: 3, Failures: 0, Errors: 0, Skipped: 0, Time elapsed: 17.465 sec - in org.apache.phoenix.rpc.UpdateCacheIT
Running org.apache.phoenix.tx.TxCheckpointIT
Tests run: 9, Failures: 0, Errors: 0, Skipped: 0, Time elapsed: 71.85 sec - in org.apache.phoenix.iterate.RoundRobinResultIteratorIT
Tests run: 6, Failures: 0, Errors: 0, Skipped: 0, Time elapsed: 91.057 sec - in org.apache.phoenix.trace.PhoenixTracingEndToEndIT
Tests run: 16, Failures: 0, Errors: 0, Skipped: 0, Time elapsed: 91.843 sec - in org.apache.phoenix.tx.TxCheckpointIT
Tests run: 19, Failures: 0, Errors: 0, Skipped: 3, Time elapsed: 129.676 sec - in org.apache.phoenix.tx.TransactionIT
Tests run: 128, Failures: 0, Errors: 0, Skipped: 0, Time elapsed: 456.221 sec - in org.apache.phoenix.end2end.index.IndexIT

Results :

Tests run: 1327, Failures: 0, Errors: 0, Skipped: 3

[INFO] 
[INFO] --- maven-failsafe-plugin:2.19.1:integration-test (NeedTheirOwnClusterTests) @ phoenix-core
---

-------------------------------------------------------
 T E S T S
-------------------------------------------------------
Running org.apache.hadoop.hbase.regionserver.wal.WALReplayWithIndexWritesAndCompressedWALIT
Running org.apache.hadoop.hbase.regionserver.wal.WALReplayWithIndexWritesAndUncompressedWALInHBase_094_9_IT
Tests run: 1, Failures: 0, Errors: 0, Skipped: 0, Time elapsed: 22.118 sec - in org.apache.hadoop.hbase.regionserver.wal.WALReplayWithIndexWritesAndCompressedWALIT
Tests run: 1, Failures: 0, Errors: 0, Skipped: 0, Time elapsed: 22.295 sec - in org.apache.hadoop.hbase.regionserver.wal.WALReplayWithIndexWritesAndUncompressedWALInHBase_094_9_IT
Running org.apache.phoenix.coprocessor.StatisticsCollectionRunTrackerIT
Running org.apache.phoenix.end2end.AlterTableIT
Running org.apache.phoenix.end2end.ConnectionUtilIT
Running org.apache.phoenix.end2end.ContextClassloaderIT
Running org.apache.phoenix.end2end.CountDistinctCompressionIT
Tests run: 3, Failures: 0, Errors: 0, Skipped: 0, Time elapsed: 3.758 sec - in org.apache.phoenix.end2end.ContextClassloaderIT
Tests run: 4, Failures: 0, Errors: 0, Skipped: 0, Time elapsed: 23.65 sec - in org.apache.phoenix.coprocessor.StatisticsCollectionRunTrackerIT
Tests run: 1, Failures: 0, Errors: 0, Skipped: 0, Time elapsed: 27.348 sec - in org.apache.phoenix.end2end.ConnectionUtilIT
Tests run: 1, Failures: 0, Errors: 0, Skipped: 0, Time elapsed: 13.981 sec - in org.apache.phoenix.end2end.CountDistinctCompressionIT
Running org.apache.phoenix.end2end.IndexToolIT
Running org.apache.phoenix.end2end.CsvBulkLoadToolIT
Running org.apache.phoenix.end2end.KeyOnlyIT
Running org.apache.phoenix.end2end.MultiCfQueryExecIT
Tests run: 3, Failures: 0, Errors: 0, Skipped: 0, Time elapsed: 20.981 sec - in org.apache.phoenix.end2end.KeyOnlyIT
Tests run: 8, Failures: 0, Errors: 0, Skipped: 0, Time elapsed: 23.055 sec - in org.apache.phoenix.end2end.MultiCfQueryExecIT
Running org.apache.phoenix.end2end.ParallelIteratorsIT
Running org.apache.phoenix.end2end.QueryTimeoutIT
Tests run: 1, Failures: 0, Errors: 0, Skipped: 0, Time elapsed: 20.203 sec - in org.apache.phoenix.end2end.QueryTimeoutIT
Tests run: 3, Failures: 0, Errors: 0, Skipped: 0, Time elapsed: 32.812 sec - in org.apache.phoenix.end2end.ParallelIteratorsIT
Running org.apache.phoenix.end2end.QueryWithLimitIT
Running org.apache.phoenix.end2end.SaltedViewIT
Tests run: 2, Failures: 0, Errors: 0, Skipped: 0, Time elapsed: 11.14 sec - in org.apache.phoenix.end2end.QueryWithLimitIT
Tests run: 4, Failures: 0, Errors: 0, Skipped: 0, Time elapsed: 43.204 sec - in org.apache.phoenix.end2end.SaltedViewIT
Running org.apache.phoenix.end2end.SpillableGroupByIT
Tests run: 1, Failures: 0, Errors: 0, Skipped: 0, Time elapsed: 10.079 sec - in org.apache.phoenix.end2end.SpillableGroupByIT
Running org.apache.phoenix.end2end.StatsCollectorIT
Running org.apache.phoenix.end2end.StatsCollectorWithSplitsAndMultiCFIT
Tests run: 8, Failures: 0, Errors: 0, Skipped: 0, Time elapsed: 226.769 sec - in org.apache.phoenix.end2end.CsvBulkLoadToolIT
Tests run: 2, Failures: 0, Errors: 0, Skipped: 0, Time elapsed: 34.272 sec - in org.apache.phoenix.end2end.StatsCollectorWithSplitsAndMultiCFIT
Running org.apache.phoenix.end2end.TenantSpecificTablesDDLIT
Running org.apache.phoenix.end2end.TenantSpecificTablesDMLIT
Tests run: 5, Failures: 0, Errors: 0, Skipped: 0, Time elapsed: 75.568 sec - in org.apache.phoenix.end2end.StatsCollectorIT
Tests run: 56, Failures: 0, Errors: 0, Skipped: 0, Time elapsed: 353.021 sec - in org.apache.phoenix.end2end.AlterTableIT
Tests run: 17, Failures: 0, Errors: 0, Skipped: 0, Time elapsed: 51.304 sec - in org.apache.phoenix.end2end.TenantSpecificTablesDDLIT
Running org.apache.phoenix.end2end.UnionAllIT
Tests run: 16, Failures: 0, Errors: 0, Skipped: 0, Time elapsed: 54.497 sec - in org.apache.phoenix.end2end.TenantSpecificTablesDMLIT
Running org.apache.phoenix.end2end.UserDefinedFunctionsIT
Running org.apache.phoenix.end2end.ViewIT
Tests run: 12, Failures: 0, Errors: 0, Skipped: 0, Time elapsed: 36.042 sec - in org.apache.phoenix.end2end.UnionAllIT
Running org.apache.phoenix.end2end.index.ImmutableIndexWithStatsIT
Tests run: 13, Failures: 0, Errors: 0, Skipped: 0, Time elapsed: 28.891 sec - in org.apache.phoenix.end2end.UserDefinedFunctionsIT
Tests run: 1, Failures: 0, Errors: 0, Skipped: 0, Time elapsed: 13.527 sec - in org.apache.phoenix.end2end.index.ImmutableIndexWithStatsIT
Running org.apache.phoenix.end2end.index.MutableIndexFailureIT
Tests run: 9, Failures: 0, Errors: 0, Skipped: 0, Time elapsed: 411.478 sec - in org.apache.phoenix.end2end.IndexToolIT
Running org.apache.phoenix.end2end.index.MutableIndexReplicationIT
Running org.apache.phoenix.end2end.index.txn.TxWriteFailureIT
Tests run: 1, Failures: 0, Errors: 0, Skipped: 0, Time elapsed: 21.781 sec - in org.apache.phoenix.end2end.index.MutableIndexReplicationIT
Running org.apache.phoenix.hbase.index.FailForUnsupportedHBaseVersionsIT
Tests run: 2, Failures: 0, Errors: 0, Skipped: 0, Time elapsed: 19.088 sec - in org.apache.phoenix.hbase.index.FailForUnsupportedHBaseVersionsIT
Running org.apache.phoenix.execute.PartialCommitIT
Tests run: 12, Failures: 0, Errors: 0, Skipped: 0, Time elapsed: 3.925 sec - in org.apache.phoenix.execute.PartialCommitIT
Tests run: 8, Failures: 0, Errors: 0, Skipped: 0, Time elapsed: 42.443 sec - in org.apache.phoenix.end2end.index.txn.TxWriteFailureIT
Running org.apache.phoenix.hbase.index.balancer.IndexLoadBalancerIT
Running org.apache.phoenix.hbase.index.covered.EndToEndCoveredColumnsIndexBuilderIT
Tests run: 2, Failures: 0, Errors: 0, Skipped: 0, Time elapsed: 7.241 sec - in org.apache.phoenix.hbase.index.covered.EndToEndCoveredColumnsIndexBuilderIT
Tests run: 44, Failures: 0, Errors: 0, Skipped: 0, Time elapsed: 140.92 sec - in org.apache.phoenix.end2end.ViewIT
Running org.apache.phoenix.hbase.index.covered.example.EndToEndCoveredIndexingIT
Running org.apache.phoenix.hbase.index.covered.example.FailWithoutRetriesIT
Tests run: 1, Failures: 0, Errors: 0, Skipped: 0, Time elapsed: 16.147 sec - in org.apache.phoenix.hbase.index.covered.example.FailWithoutRetriesIT
Running org.apache.phoenix.hbase.index.covered.example.EndtoEndIndexingWithCompressionIT
Running org.apache.phoenix.iterate.RoundRobinResultIteratorWithStatsIT
Tests run: 1, Failures: 0, Errors: 0, Skipped: 0, Time elapsed: 14.13 sec - in org.apache.phoenix.iterate.RoundRobinResultIteratorWithStatsIT
Tests run: 11, Failures: 0, Errors: 0, Skipped: 0, Time elapsed: 93.54 sec - in org.apache.phoenix.hbase.index.covered.example.EndToEndCoveredIndexingIT
Tests run: 6, Failures: 0, Errors: 0, Skipped: 2, Time elapsed: 185.767 sec - in org.apache.phoenix.end2end.index.MutableIndexFailureIT
Tests run: 11, Failures: 0, Errors: 0, Skipped: 0, Time elapsed: 71.48 sec - in org.apache.phoenix.hbase.index.covered.example.EndtoEndIndexingWithCompressionIT
Tests run: 1, Failures: 0, Errors: 0, Skipped: 1, Time elapsed: 0 sec - in org.apache.phoenix.iterate.ScannerLeaseRenewalIT
Running org.apache.phoenix.monitoring.PhoenixMetricsIT
Running org.apache.phoenix.rpc.PhoenixClientRpcIT
Tests run: 2, Failures: 0, Errors: 0, Skipped: 0, Time elapsed: 5.543 sec - in org.apache.phoenix.rpc.PhoenixClientRpcIT
Running org.apache.phoenix.rpc.PhoenixServerRpcIT
Tests run: 2, Failures: 0, Errors: 0, Skipped: 0, Time elapsed: 14.965 sec - in org.apache.phoenix.rpc.PhoenixServerRpcIT
Tests run: 17, Failures: 0, Errors: 0, Skipped: 0, Time elapsed: 61.718 sec - in org.apache.phoenix.monitoring.PhoenixMetricsIT
Tests run: 9, Failures: 0, Errors: 1, Skipped: 0, Time elapsed: 279.914 sec <<< FAILURE!
- in org.apache.phoenix.hbase.index.balancer.IndexLoadBalancerIT
testRoundRobinAssignmentDuringMasterStartUp(org.apache.phoenix.hbase.index.balancer.IndexLoadBalancerIT)
 Time elapsed: 179.892 sec  <<< ERROR!
org.junit.runners.model.TestTimedOutException: test timed out after 180 seconds
	at org.apache.phoenix.hbase.index.balancer.IndexLoadBalancerIT.createUserAndIndexTable(IndexLoadBalancerIT.java:435)
	at org.apache.phoenix.hbase.index.balancer.IndexLoadBalancerIT.testRoundRobinAssignmentDuringMasterStartUp(IndexLoadBalancerIT.java:401)


Results :

Tests in error: 
  IndexLoadBalancerIT.testRoundRobinAssignmentDuringMasterStartUp:401->createUserAndIndexTable:435
? TestTimedOut

Tests run: 302, Failures: 0, Errors: 1, Skipped: 3

[INFO] 
[INFO] --- maven-failsafe-plugin:2.19.1:verify (ClientManagedTimeTests) @ phoenix-core ---
[INFO] ------------------------------------------------------------------------
[INFO] Reactor Summary:
[INFO] 
[INFO] Apache Phoenix .................................... SUCCESS [2.870s]
[INFO] Phoenix Core ...................................... FAILURE [42:35.556s]
[INFO] Phoenix - Flume ................................... SKIPPED
[INFO] Phoenix - Pig ..................................... SKIPPED
[INFO] Phoenix Query Server Client ....................... SKIPPED
[INFO] Phoenix Query Server .............................. SKIPPED
[INFO] Phoenix - Pherf ................................... SKIPPED
[INFO] Phoenix - Spark ................................... SKIPPED
[INFO] Phoenix Assembly .................................. SKIPPED
[INFO] Phoenix - Tracing Web Application ................. SKIPPED
[INFO] ------------------------------------------------------------------------
[INFO] BUILD FAILURE
[INFO] ------------------------------------------------------------------------
[INFO] Total time: 42:39.039s
[INFO] Finished at: Tue Jan 12 23:07:28 UTC 2016
[INFO] Final Memory: 60M/995M
[INFO] ------------------------------------------------------------------------
[ERROR] Failed to execute goal org.apache.maven.plugins:maven-failsafe-plugin:2.19.1:verify
(ClientManagedTimeTests) on project phoenix-core: There are test failures.
[ERROR] 
[ERROR] Please refer to /x1/jenkins/jenkins-slave/workspace/Phoenix-4.x-HBase-0.98/phoenix-core/target/failsafe-reports
for the individual test results.
[ERROR] -> [Help 1]
[ERROR] 
[ERROR] To see the full stack trace of the errors, re-run Maven with the -e switch.
[ERROR] Re-run Maven using the -X switch to enable full debug logging.
[ERROR] 
[ERROR] For more information about the errors and possible solutions, please read the following
articles:
[ERROR] [Help 1] http://cwiki.apache.org/confluence/display/MAVEN/MojoFailureException
[ERROR] 
[ERROR] After correcting the problems, you can resume the build with the command
[ERROR]   mvn <goals> -rf :phoenix-core
Build step 'Invoke top-level Maven targets' marked build as failure
Archiving artifacts
Compressed 1.11 GB of artifacts by 48.5% relative to #989
Recording test results

Mime
View raw message