phoenix-commits mailing list archives

Site index · List index
Message view « Date » · « Thread »
Top « Date » · « Thread »
From Apache Jenkins Server <jenk...@builds.apache.org>
Subject Build failed in Jenkins: Phoenix | Master #1099
Date Fri, 22 Jan 2016 04:22:01 GMT
See <https://builds.apache.org/job/Phoenix-master/1099/changes>

Changes:

[ravimagham] PHOENIX-2584 - Support Array datatype in phoenix-pig module

------------------------------------------
[...truncated 664 lines...]
Running org.apache.phoenix.end2end.RegexpReplaceFunctionIT
Tests run: 2, Failures: 0, Errors: 0, Skipped: 0, Time elapsed: 49.222 sec - in org.apache.phoenix.end2end.PhoenixRuntimeIT
Running org.apache.phoenix.end2end.RegexpSplitFunctionIT
Tests run: 2, Failures: 0, Errors: 0, Skipped: 0, Time elapsed: 7.58 sec - in org.apache.phoenix.end2end.RegexpReplaceFunctionIT
Running org.apache.phoenix.end2end.RegexpSubstrFunctionIT
Tests run: 11, Failures: 0, Errors: 0, Skipped: 0, Time elapsed: 11.845 sec - in org.apache.phoenix.end2end.RegexpSplitFunctionIT
Running org.apache.phoenix.end2end.ReverseFunctionIT
Tests run: 2, Failures: 0, Errors: 0, Skipped: 0, Time elapsed: 11.14 sec - in org.apache.phoenix.end2end.RegexpSubstrFunctionIT
Running org.apache.phoenix.end2end.ReverseScanIT
Tests run: 5, Failures: 0, Errors: 0, Skipped: 0, Time elapsed: 10.579 sec - in org.apache.phoenix.end2end.ReverseFunctionIT
Running org.apache.phoenix.end2end.RoundFloorCeilFunctionsEnd2EndIT
Tests run: 6, Failures: 0, Errors: 0, Skipped: 0, Time elapsed: 70.922 sec - in org.apache.phoenix.end2end.QueryMoreIT
Running org.apache.phoenix.end2end.ServerExceptionIT
Tests run: 3, Failures: 0, Errors: 0, Skipped: 0, Time elapsed: 22.784 sec - in org.apache.phoenix.end2end.ReverseScanIT
Running org.apache.phoenix.end2end.SignFunctionEnd2EndIT
Tests run: 1, Failures: 0, Errors: 0, Skipped: 0, Time elapsed: 9.91 sec - in org.apache.phoenix.end2end.ServerExceptionIT
Running org.apache.phoenix.end2end.SkipScanAfterManualSplitIT
Tests run: 33, Failures: 0, Errors: 0, Skipped: 0, Time elapsed: 35.575 sec - in org.apache.phoenix.end2end.RoundFloorCeilFunctionsEnd2EndIT
Running org.apache.phoenix.end2end.SkipScanQueryIT
Tests run: 2, Failures: 0, Errors: 0, Skipped: 0, Time elapsed: 22.129 sec - in org.apache.phoenix.end2end.SignFunctionEnd2EndIT
Running org.apache.phoenix.end2end.SortMergeJoinIT
Tests run: 28, Failures: 0, Errors: 0, Skipped: 0, Time elapsed: 255.079 sec - in org.apache.phoenix.end2end.InListIT
Running org.apache.phoenix.end2end.SortMergeJoinMoreIT
Tests run: 3, Failures: 0, Errors: 0, Skipped: 0, Time elapsed: 49.976 sec - in org.apache.phoenix.end2end.SkipScanAfterManualSplitIT
Running org.apache.phoenix.end2end.SortOrderIT
Tests run: 12, Failures: 0, Errors: 0, Skipped: 0, Time elapsed: 60.321 sec - in org.apache.phoenix.end2end.SkipScanQueryIT
Running org.apache.phoenix.end2end.SpooledSortMergeJoinIT
Tests run: 3, Failures: 0, Errors: 0, Skipped: 0, Time elapsed: 56.8 sec - in org.apache.phoenix.end2end.SortMergeJoinMoreIT
Running org.apache.phoenix.end2end.SpooledTmpFileDeleteIT
Tests run: 1, Failures: 0, Errors: 0, Skipped: 0, Time elapsed: 12.166 sec - in org.apache.phoenix.end2end.SpooledTmpFileDeleteIT
Running org.apache.phoenix.end2end.SqrtFunctionEnd2EndIT
Tests run: 2, Failures: 0, Errors: 0, Skipped: 0, Time elapsed: 19.85 sec - in org.apache.phoenix.end2end.SqrtFunctionEnd2EndIT
Running org.apache.phoenix.end2end.StatementHintsIT
Tests run: 2, Failures: 0, Errors: 0, Skipped: 0, Time elapsed: 8.524 sec - in org.apache.phoenix.end2end.StatementHintsIT
Running org.apache.phoenix.end2end.StddevIT
Tests run: 4, Failures: 0, Errors: 0, Skipped: 0, Time elapsed: 12.059 sec - in org.apache.phoenix.end2end.StddevIT
Running org.apache.phoenix.end2end.StoreNullsIT
Tests run: 96, Failures: 0, Errors: 0, Skipped: 0, Time elapsed: 429.972 sec - in org.apache.phoenix.end2end.HashJoinIT
Running org.apache.phoenix.end2end.StringToArrayFunctionIT
Tests run: 3, Failures: 0, Errors: 0, Skipped: 0, Time elapsed: 42.092 sec - in org.apache.phoenix.end2end.StoreNullsIT
Running org.apache.phoenix.end2end.SubqueryIT
Tests run: 45, Failures: 0, Errors: 0, Skipped: 0, Time elapsed: 156.219 sec - in org.apache.phoenix.end2end.SortOrderIT
Running org.apache.phoenix.end2end.SubqueryUsingSortMergeJoinIT
Tests run: 22, Failures: 0, Errors: 0, Skipped: 0, Time elapsed: 44.625 sec - in org.apache.phoenix.end2end.StringToArrayFunctionIT
Running org.apache.phoenix.end2end.TenantIdTypeIT
Tests run: 15, Failures: 0, Errors: 0, Skipped: 0, Time elapsed: 172.915 sec - in org.apache.phoenix.end2end.SubqueryUsingSortMergeJoinIT
Running org.apache.phoenix.end2end.TenantSpecificViewIndexIT
Tests run: 21, Failures: 0, Errors: 0, Skipped: 0, Time elapsed: 209.592 sec - in org.apache.phoenix.end2end.SubqueryIT
Running org.apache.phoenix.end2end.TenantSpecificViewIndexSaltedIT
Tests run: 99, Failures: 0, Errors: 0, Skipped: 0, Time elapsed: 362.962 sec - in org.apache.phoenix.end2end.SpooledSortMergeJoinIT
Running org.apache.phoenix.end2end.TimezoneOffsetFunctionIT
Tests run: 4, Failures: 0, Errors: 0, Skipped: 0, Time elapsed: 35.444 sec - in org.apache.phoenix.end2end.TenantSpecificViewIndexSaltedIT
Tests run: 8, Failures: 0, Errors: 0, Skipped: 0, Time elapsed: 53.417 sec - in org.apache.phoenix.end2end.TenantSpecificViewIndexIT
Running org.apache.phoenix.end2end.ToDateFunctionIT
Running org.apache.phoenix.end2end.UpgradeIT
Tests run: 7, Failures: 0, Errors: 0, Skipped: 0, Time elapsed: 13.626 sec - in org.apache.phoenix.end2end.TimezoneOffsetFunctionIT
Running org.apache.phoenix.end2end.UpsertBigValuesIT
Tests run: 11, Failures: 0, Errors: 0, Skipped: 0, Time elapsed: 17.561 sec - in org.apache.phoenix.end2end.ToDateFunctionIT
Running org.apache.phoenix.end2end.UpsertSelectAutoCommitIT
Tests run: 99, Failures: 0, Errors: 0, Skipped: 0, Time elapsed: 453.412 sec - in org.apache.phoenix.end2end.SortMergeJoinIT
Running org.apache.phoenix.end2end.index.DropViewIT
Tests run: 4, Failures: 0, Errors: 0, Skipped: 0, Time elapsed: 26.45 sec - in org.apache.phoenix.end2end.UpsertBigValuesIT
Running org.apache.phoenix.end2end.index.GlobalIndexOptimizationIT
Tests run: 1, Failures: 0, Errors: 0, Skipped: 0, Time elapsed: 17.205 sec - in org.apache.phoenix.end2end.index.DropViewIT
Running org.apache.phoenix.end2end.index.ImmutableIndexIT
Tests run: 3, Failures: 0, Errors: 0, Skipped: 0, Time elapsed: 39.224 sec - in org.apache.phoenix.end2end.UpsertSelectAutoCommitIT
Running org.apache.phoenix.end2end.index.IndexExpressionIT
Tests run: 15, Failures: 0, Errors: 0, Skipped: 0, Time elapsed: 281.882 sec - in org.apache.phoenix.end2end.TenantIdTypeIT
Running org.apache.phoenix.end2end.index.IndexIT
Tests run: 6, Failures: 0, Errors: 0, Skipped: 0, Time elapsed: 125.977 sec - in org.apache.phoenix.end2end.UpgradeIT
Running org.apache.phoenix.end2end.index.IndexMetadataIT
Tests run: 6, Failures: 0, Errors: 0, Skipped: 0, Time elapsed: 119.614 sec - in org.apache.phoenix.end2end.index.GlobalIndexOptimizationIT
Tests run: 4, Failures: 0, Errors: 0, Skipped: 0, Time elapsed: 104.408 sec - in org.apache.phoenix.end2end.index.ImmutableIndexIT
Running org.apache.phoenix.end2end.index.LocalIndexIT
Running org.apache.phoenix.end2end.index.MutableIndexIT
Tests run: 7, Failures: 0, Errors: 0, Skipped: 0, Time elapsed: 153.372 sec - in org.apache.phoenix.end2end.index.IndexMetadataIT
Running org.apache.phoenix.end2end.index.SaltedIndexIT
Tests run: 3, Failures: 0, Errors: 0, Skipped: 0, Time elapsed: 60.191 sec - in org.apache.phoenix.end2end.index.SaltedIndexIT
Running org.apache.phoenix.end2end.index.ViewIndexIT
Tests run: 1, Failures: 0, Errors: 0, Skipped: 0, Time elapsed: 14.998 sec - in org.apache.phoenix.end2end.index.ViewIndexIT
Running org.apache.phoenix.end2end.index.txn.MutableRollbackIT
Tests run: 24, Failures: 0, Errors: 0, Skipped: 0, Time elapsed: 249.748 sec - in org.apache.phoenix.end2end.index.MutableIndexIT
Running org.apache.phoenix.end2end.index.txn.RollbackIT
Tests run: 6, Failures: 0, Errors: 0, Skipped: 0, Time elapsed: 76.035 sec - in org.apache.phoenix.end2end.index.txn.MutableRollbackIT
Running org.apache.phoenix.end2end.salted.SaltedTableUpsertSelectIT
Tests run: 5, Failures: 0, Errors: 0, Skipped: 0, Time elapsed: 25.359 sec - in org.apache.phoenix.end2end.salted.SaltedTableUpsertSelectIT
Tests run: 62, Failures: 0, Errors: 0, Skipped: 0, Time elapsed: 401.379 sec - in org.apache.phoenix.end2end.index.IndexExpressionIT
Running org.apache.phoenix.end2end.salted.SaltedTableVarLengthRowKeyIT
Running org.apache.phoenix.iterate.PhoenixQueryTimeoutIT
Tests run: 1, Failures: 0, Errors: 0, Skipped: 0, Time elapsed: 8.53 sec - in org.apache.phoenix.end2end.salted.SaltedTableVarLengthRowKeyIT
Running org.apache.phoenix.iterate.RoundRobinResultIteratorIT
Tests run: 2, Failures: 0, Errors: 0, Skipped: 0, Time elapsed: 10.342 sec - in org.apache.phoenix.iterate.PhoenixQueryTimeoutIT
Running org.apache.phoenix.rpc.UpdateCacheIT
Tests run: 8, Failures: 0, Errors: 0, Skipped: 0, Time elapsed: 67.844 sec - in org.apache.phoenix.end2end.index.txn.RollbackIT
Running org.apache.phoenix.trace.PhoenixTableMetricsWriterIT
Tests run: 2, Failures: 0, Errors: 0, Skipped: 0, Time elapsed: 3.566 sec - in org.apache.phoenix.trace.PhoenixTableMetricsWriterIT
Running org.apache.phoenix.trace.PhoenixTraceReaderIT
Tests run: 2, Failures: 0, Errors: 0, Skipped: 0, Time elapsed: 1.05 sec - in org.apache.phoenix.trace.PhoenixTraceReaderIT
Running org.apache.phoenix.trace.PhoenixTracingEndToEndIT
Tests run: 7, Failures: 0, Errors: 0, Skipped: 0, Time elapsed: 35.858 sec - in org.apache.phoenix.rpc.UpdateCacheIT
Running org.apache.phoenix.tx.TransactionIT
Tests run: 20, Failures: 0, Errors: 0, Skipped: 0, Time elapsed: 425.039 sec - in org.apache.phoenix.end2end.index.LocalIndexIT
Tests run: 6, Failures: 0, Errors: 0, Skipped: 0, Time elapsed: 98.192 sec - in org.apache.phoenix.trace.PhoenixTracingEndToEndIT
Running org.apache.phoenix.tx.TxCheckpointIT
Tests run: 9, Failures: 0, Errors: 0, Skipped: 0, Time elapsed: 137.961 sec - in org.apache.phoenix.iterate.RoundRobinResultIteratorIT
Tests run: 20, Failures: 0, Errors: 0, Skipped: 1, Time elapsed: 210.991 sec - in org.apache.phoenix.tx.TransactionIT
Tests run: 16, Failures: 0, Errors: 0, Skipped: 0, Time elapsed: 138.608 sec - in org.apache.phoenix.tx.TxCheckpointIT
Tests run: 128, Failures: 0, Errors: 0, Skipped: 0, Time elapsed: 714.399 sec - in org.apache.phoenix.end2end.index.IndexIT

Results :

Tests run: 1337, Failures: 0, Errors: 0, Skipped: 1

[INFO] 
[INFO] --- maven-failsafe-plugin:2.19.1:integration-test (NeedTheirOwnClusterTests) @ phoenix-core
---

-------------------------------------------------------
 T E S T S
-------------------------------------------------------
Running org.apache.hadoop.hbase.regionserver.wal.WALReplayWithIndexWritesAndCompressedWALIT
Running org.apache.hadoop.hbase.regionserver.wal.WALReplayWithIndexWritesAndUncompressedWALInHBase_094_9_IT
Running org.apache.phoenix.end2end.ConnectionUtilIT
Running org.apache.phoenix.coprocessor.StatisticsCollectionRunTrackerIT
Tests run: 1, Failures: 0, Errors: 0, Skipped: 0, Time elapsed: 33.338 sec - in org.apache.hadoop.hbase.regionserver.wal.WALReplayWithIndexWritesAndCompressedWALIT
Tests run: 1, Failures: 0, Errors: 0, Skipped: 0, Time elapsed: 33.262 sec - in org.apache.hadoop.hbase.regionserver.wal.WALReplayWithIndexWritesAndUncompressedWALInHBase_094_9_IT
Running org.apache.phoenix.end2end.AlterTableIT
Running org.apache.phoenix.end2end.CountDistinctCompressionIT
Running org.apache.phoenix.end2end.ContextClassloaderIT
Tests run: 4, Failures: 0, Errors: 0, Skipped: 0, Time elapsed: 37.075 sec - in org.apache.phoenix.coprocessor.StatisticsCollectionRunTrackerIT
Tests run: 1, Failures: 0, Errors: 0, Skipped: 0, Time elapsed: 38.061 sec - in org.apache.phoenix.end2end.ConnectionUtilIT
Tests run: 3, Failures: 0, Errors: 0, Skipped: 0, Time elapsed: 6.8 sec - in org.apache.phoenix.end2end.ContextClassloaderIT
Tests run: 1, Failures: 0, Errors: 0, Skipped: 0, Time elapsed: 9.314 sec - in org.apache.phoenix.end2end.CountDistinctCompressionIT
Running org.apache.phoenix.end2end.IndexToolIT
Running org.apache.phoenix.end2end.CsvBulkLoadToolIT
Running org.apache.phoenix.end2end.KeyOnlyIT
Running org.apache.phoenix.end2end.MultiCfQueryExecIT
Tests run: 3, Failures: 0, Errors: 0, Skipped: 0, Time elapsed: 23.985 sec - in org.apache.phoenix.end2end.KeyOnlyIT
Tests run: 8, Failures: 0, Errors: 0, Skipped: 0, Time elapsed: 30.45 sec - in org.apache.phoenix.end2end.MultiCfQueryExecIT
Running org.apache.phoenix.end2end.ParallelIteratorsIT
Running org.apache.phoenix.end2end.QueryTimeoutIT
Tests run: 1, Failures: 0, Errors: 0, Skipped: 0, Time elapsed: 24.838 sec - in org.apache.phoenix.end2end.QueryTimeoutIT
Tests run: 3, Failures: 0, Errors: 0, Skipped: 0, Time elapsed: 48.429 sec - in org.apache.phoenix.end2end.ParallelIteratorsIT
Running org.apache.phoenix.end2end.QueryWithLimitIT
Running org.apache.phoenix.end2end.SaltedViewIT
Tests run: 2, Failures: 0, Errors: 0, Skipped: 0, Time elapsed: 24.679 sec - in org.apache.phoenix.end2end.QueryWithLimitIT
Running org.apache.phoenix.end2end.SpillableGroupByIT
Tests run: 1, Failures: 0, Errors: 0, Skipped: 0, Time elapsed: 8.222 sec - in org.apache.phoenix.end2end.SpillableGroupByIT
Tests run: 4, Failures: 0, Errors: 0, Skipped: 0, Time elapsed: 58.516 sec - in org.apache.phoenix.end2end.SaltedViewIT
Tests run: 8, Failures: 0, Errors: 0, Skipped: 0, Time elapsed: 241.012 sec - in org.apache.phoenix.end2end.CsvBulkLoadToolIT
Running org.apache.phoenix.end2end.StatsCollectorIT
Running org.apache.phoenix.end2end.StatsCollectorWithSplitsAndMultiCFIT
Tests run: 1, Failures: 0, Errors: 0, Skipped: 0, Time elapsed: 7.04 sec - in org.apache.phoenix.end2end.StatsCollectorWithSplitsAndMultiCFIT
Running org.apache.phoenix.end2end.TenantSpecificTablesDDLIT
Running org.apache.phoenix.end2end.TenantSpecificTablesDMLIT
Tests run: 6, Failures: 0, Errors: 0, Skipped: 0, Time elapsed: 88.195 sec - in org.apache.phoenix.end2end.StatsCollectorIT
Tests run: 17, Failures: 0, Errors: 0, Skipped: 0, Time elapsed: 67.636 sec - in org.apache.phoenix.end2end.TenantSpecificTablesDDLIT
Tests run: 16, Failures: 0, Errors: 0, Skipped: 0, Time elapsed: 54.141 sec - in org.apache.phoenix.end2end.TenantSpecificTablesDMLIT
Running org.apache.phoenix.end2end.UnionAllIT
Running org.apache.phoenix.end2end.ViewIT
Running org.apache.phoenix.end2end.UserDefinedFunctionsIT
Tests run: 56, Failures: 0, Errors: 0, Skipped: 0, Time elapsed: 497.966 sec - in org.apache.phoenix.end2end.AlterTableIT
Tests run: 12, Failures: 0, Errors: 0, Skipped: 0, Time elapsed: 40.775 sec - in org.apache.phoenix.end2end.UnionAllIT
Tests run: 9, Failures: 0, Errors: 0, Skipped: 0, Time elapsed: 442.073 sec - in org.apache.phoenix.end2end.IndexToolIT
Running org.apache.phoenix.end2end.index.ImmutableIndexWithStatsIT
Running org.apache.phoenix.end2end.index.MutableIndexFailureIT
Tests run: 13, Failures: 0, Errors: 0, Skipped: 0, Time elapsed: 62.915 sec - in org.apache.phoenix.end2end.UserDefinedFunctionsIT
Tests run: 1, Failures: 0, Errors: 0, Skipped: 0, Time elapsed: 14.518 sec - in org.apache.phoenix.end2end.index.ImmutableIndexWithStatsIT
Running org.apache.phoenix.end2end.index.MutableIndexReplicationIT
Running org.apache.phoenix.end2end.index.txn.TxWriteFailureIT
Tests run: 1, Failures: 0, Errors: 0, Skipped: 0, Time elapsed: 41.856 sec - in org.apache.phoenix.end2end.index.MutableIndexReplicationIT
Running org.apache.phoenix.hbase.index.FailForUnsupportedHBaseVersionsIT
Running org.apache.phoenix.execute.PartialCommitIT
Tests run: 12, Failures: 0, Errors: 0, Skipped: 0, Time elapsed: 9.353 sec - in org.apache.phoenix.execute.PartialCommitIT
Tests run: 2, Failures: 0, Errors: 0, Skipped: 0, Time elapsed: 24.122 sec - in org.apache.phoenix.hbase.index.FailForUnsupportedHBaseVersionsIT
Running org.apache.phoenix.hbase.index.balancer.IndexLoadBalancerIT
Tests run: 8, Failures: 0, Errors: 0, Skipped: 0, Time elapsed: 46.896 sec - in org.apache.phoenix.end2end.index.txn.TxWriteFailureIT
Running org.apache.phoenix.hbase.index.covered.EndToEndCoveredColumnsIndexBuilderIT
Tests run: 2, Failures: 0, Errors: 0, Skipped: 0, Time elapsed: 27.79 sec - in org.apache.phoenix.hbase.index.covered.EndToEndCoveredColumnsIndexBuilderIT
Running org.apache.phoenix.hbase.index.covered.example.EndToEndCoveredIndexingIT
Tests run: 46, Failures: 0, Errors: 0, Skipped: 0, Time elapsed: 228.465 sec - in org.apache.phoenix.end2end.ViewIT
Running org.apache.phoenix.hbase.index.covered.example.EndtoEndIndexingWithCompressionIT
Running org.apache.phoenix.hbase.index.covered.example.FailWithoutRetriesIT
Tests run: 1, Failures: 0, Errors: 0, Skipped: 0, Time elapsed: 7.491 sec - in org.apache.phoenix.hbase.index.covered.example.FailWithoutRetriesIT
Tests run: 6, Failures: 0, Errors: 0, Skipped: 2, Time elapsed: 188.71 sec - in org.apache.phoenix.end2end.index.MutableIndexFailureIT
Running org.apache.phoenix.iterate.RoundRobinResultIteratorWithStatsIT
Tests run: 1, Failures: 0, Errors: 0, Skipped: 1, Time elapsed: 0 sec - in org.apache.phoenix.iterate.ScannerLeaseRenewalIT
Tests run: 1, Failures: 0, Errors: 0, Skipped: 0, Time elapsed: 16.707 sec - in org.apache.phoenix.iterate.RoundRobinResultIteratorWithStatsIT
Running org.apache.phoenix.monitoring.PhoenixMetricsIT
Running org.apache.phoenix.rpc.PhoenixClientRpcIT
Tests run: 2, Failures: 0, Errors: 0, Skipped: 0, Time elapsed: 9.734 sec - in org.apache.phoenix.rpc.PhoenixClientRpcIT
Running org.apache.phoenix.rpc.PhoenixServerRpcIT
Tests run: 2, Failures: 0, Errors: 0, Skipped: 0, Time elapsed: 18.689 sec - in org.apache.phoenix.rpc.PhoenixServerRpcIT
Tests run: 11, Failures: 0, Errors: 0, Skipped: 0, Time elapsed: 214.179 sec - in org.apache.phoenix.hbase.index.covered.example.EndToEndCoveredIndexingIT
Tests run: 18, Failures: 0, Errors: 0, Skipped: 0, Time elapsed: 94.601 sec - in org.apache.phoenix.monitoring.PhoenixMetricsIT
Tests run: 11, Failures: 0, Errors: 0, Skipped: 0, Time elapsed: 200.317 sec - in org.apache.phoenix.hbase.index.covered.example.EndtoEndIndexingWithCompressionIT
Tests run: 9, Failures: 0, Errors: 1, Skipped: 0, Time elapsed: 442.164 sec <<< FAILURE!
- in org.apache.phoenix.hbase.index.balancer.IndexLoadBalancerIT
testRoundRobinAssignmentDuringMasterStartUp(org.apache.phoenix.hbase.index.balancer.IndexLoadBalancerIT)
 Time elapsed: 300.016 sec  <<< ERROR!
org.junit.runners.model.TestTimedOutException: test timed out after 300 seconds
	at org.apache.phoenix.hbase.index.balancer.IndexLoadBalancerIT.createUserAndIndexTable(IndexLoadBalancerIT.java:435)
	at org.apache.phoenix.hbase.index.balancer.IndexLoadBalancerIT.testRoundRobinAssignmentDuringMasterStartUp(IndexLoadBalancerIT.java:401)


Results :

Tests in error: 
  IndexLoadBalancerIT.testRoundRobinAssignmentDuringMasterStartUp:401->createUserAndIndexTable:435
ยป TestTimedOut

Tests run: 305, Failures: 0, Errors: 1, Skipped: 3

[INFO] 
[INFO] --- maven-failsafe-plugin:2.19.1:verify (ClientManagedTimeTests) @ phoenix-core ---
[INFO] ------------------------------------------------------------------------
[INFO] Reactor Summary:
[INFO] 
[INFO] Apache Phoenix .................................... SUCCESS [2.692s]
[INFO] Phoenix Core ...................................... FAILURE [59:19.275s]
[INFO] Phoenix - Flume ................................... SKIPPED
[INFO] Phoenix - Pig ..................................... SKIPPED
[INFO] Phoenix Query Server Client ....................... SKIPPED
[INFO] Phoenix Query Server .............................. SKIPPED
[INFO] Phoenix - Pherf ................................... SKIPPED
[INFO] Phoenix - Spark ................................... SKIPPED
[INFO] Phoenix Assembly .................................. SKIPPED
[INFO] Phoenix - Tracing Web Application ................. SKIPPED
[INFO] ------------------------------------------------------------------------
[INFO] BUILD FAILURE
[INFO] ------------------------------------------------------------------------
[INFO] Total time: 59:22.579s
[INFO] Finished at: Fri Jan 22 04:19:01 UTC 2016
[INFO] Final Memory: 50M/986M
[INFO] ------------------------------------------------------------------------
[ERROR] Failed to execute goal org.apache.maven.plugins:maven-failsafe-plugin:2.19.1:verify
(ClientManagedTimeTests) on project phoenix-core: There are test failures.
[ERROR] 
[ERROR] Please refer to <https://builds.apache.org/job/Phoenix-master/ws/phoenix-core/target/failsafe-reports>
for the individual test results.
[ERROR] -> [Help 1]
[ERROR] 
[ERROR] To see the full stack trace of the errors, re-run Maven with the -e switch.
[ERROR] Re-run Maven using the -X switch to enable full debug logging.
[ERROR] 
[ERROR] For more information about the errors and possible solutions, please read the following
articles:
[ERROR] [Help 1] http://cwiki.apache.org/confluence/display/MAVEN/MojoFailureException
[ERROR] 
[ERROR] After correcting the problems, you can resume the build with the command
[ERROR]   mvn <goals> -rf :phoenix-core
Build step 'Invoke top-level Maven targets' marked build as failure
Archiving artifacts
Compressed 1.19 GB of artifacts by 52.3% relative to #1098
Updating PHOENIX-2584
Recording test results

Mime
View raw message