phoenix-commits mailing list archives

Site index · List index
Message view « Date » · « Thread »
Top « Date » · « Thread »
From Apache Jenkins Server <jenk...@builds.apache.org>
Subject Build failed in Jenkins: Phoenix | Master #1026
Date Thu, 17 Dec 2015 00:38:27 GMT
See <https://builds.apache.org/job/Phoenix-master/1026/changes>

Changes:

[enis] PHOENIX-2527 InsufficientMemoryException error message is misleading

------------------------------------------
[...truncated 647 lines...]
Running org.apache.phoenix.end2end.DateTimeIT
Tests run: 20, Failures: 0, Errors: 0, Skipped: 0, Time elapsed: 31.761 sec - in org.apache.phoenix.end2end.DateTimeIT
Running org.apache.phoenix.end2end.HashJoinLocalIndexIT
Tests run: 1, Failures: 0, Errors: 0, Skipped: 0, Time elapsed: 70.564 sec - in org.apache.phoenix.end2end.HashJoinLocalIndexIT
Running org.apache.phoenix.end2end.StoreNullsIT
Tests run: 16, Failures: 0, Errors: 0, Skipped: 0, Time elapsed: 353.557 sec - in org.apache.phoenix.end2end.AlterTableWithViewsIT
Running org.apache.phoenix.end2end.ExpFunctionEnd2EndIT
Tests run: 6, Failures: 0, Errors: 0, Skipped: 0, Time elapsed: 184.724 sec - in org.apache.phoenix.end2end.HashJoinMoreIT
Running org.apache.phoenix.end2end.GetSetByteBitFunctionEnd2EndIT
Tests run: 1, Failures: 0, Errors: 0, Skipped: 0, Time elapsed: 9.572 sec - in org.apache.phoenix.end2end.GetSetByteBitFunctionEnd2EndIT
Running org.apache.phoenix.end2end.PowerFunctionEnd2EndIT
Tests run: 3, Failures: 0, Errors: 0, Skipped: 0, Time elapsed: 46.231 sec - in org.apache.phoenix.end2end.StoreNullsIT
Running org.apache.phoenix.end2end.ArithmeticQueryIT
Tests run: 3, Failures: 0, Errors: 0, Skipped: 0, Time elapsed: 28.886 sec - in org.apache.phoenix.end2end.ExpFunctionEnd2EndIT
Running org.apache.phoenix.end2end.UpgradeIT
Tests run: 1, Failures: 0, Errors: 0, Skipped: 0, Time elapsed: 21.667 sec - in org.apache.phoenix.end2end.PowerFunctionEnd2EndIT
Running org.apache.phoenix.end2end.LikeExpressionIT
Tests run: 2, Failures: 0, Errors: 0, Skipped: 0, Time elapsed: 21.038 sec - in org.apache.phoenix.end2end.LikeExpressionIT
Running org.apache.phoenix.end2end.DecodeFunctionIT
Tests run: 96, Failures: 0, Errors: 0, Skipped: 0, Time elapsed: 309.612 sec - in org.apache.phoenix.end2end.HashJoinIT
Running org.apache.phoenix.end2end.ExecuteStatementsIT
Tests run: 6, Failures: 0, Errors: 0, Skipped: 0, Time elapsed: 13.487 sec - in org.apache.phoenix.end2end.DecodeFunctionIT
Running org.apache.phoenix.end2end.ArraysWithNullsIT
Tests run: 26, Failures: 0, Errors: 0, Skipped: 0, Time elapsed: 93.757 sec - in org.apache.phoenix.end2end.ArithmeticQueryIT
Running org.apache.phoenix.end2end.SpooledTmpFileDeleteIT
Tests run: 1, Failures: 0, Errors: 0, Skipped: 0, Time elapsed: 7.489 sec - in org.apache.phoenix.end2end.SpooledTmpFileDeleteIT
Tests run: 2, Failures: 0, Errors: 0, Skipped: 0, Time elapsed: 48.767 sec - in org.apache.phoenix.end2end.ExecuteStatementsIT
Running org.apache.phoenix.end2end.ServerExceptionIT
Running org.apache.phoenix.end2end.ToDateFunctionIT
Tests run: 1, Failures: 1, Errors: 0, Skipped: 0, Time elapsed: 1.629 sec <<< FAILURE!
- in org.apache.phoenix.end2end.ServerExceptionIT
testServerExceptionBackToClient(org.apache.phoenix.end2end.ServerExceptionIT)  Time elapsed:
1.522 sec  <<< FAILURE!
java.lang.AssertionError
	at org.apache.phoenix.end2end.ServerExceptionIT.testServerExceptionBackToClient(ServerExceptionIT.java:62)

Running org.apache.phoenix.end2end.CSVCommonsLoaderIT
Tests run: 11, Failures: 0, Errors: 0, Skipped: 0, Time elapsed: 21.453 sec - in org.apache.phoenix.end2end.ToDateFunctionIT
Running org.apache.phoenix.end2end.CbrtFunctionEnd2EndIT
Tests run: 6, Failures: 0, Errors: 0, Skipped: 0, Time elapsed: 122.45 sec - in org.apache.phoenix.end2end.UpgradeIT
Running org.apache.phoenix.end2end.AlterSessionIT
Tests run: 2, Failures: 0, Errors: 0, Skipped: 0, Time elapsed: 19.2 sec - in org.apache.phoenix.end2end.CbrtFunctionEnd2EndIT
Running org.apache.phoenix.end2end.MappingTableDataTypeIT
Tests run: 2, Failures: 0, Errors: 0, Skipped: 0, Time elapsed: 9.77 sec - in org.apache.phoenix.end2end.AlterSessionIT
Running org.apache.phoenix.end2end.TenantSpecificViewIndexIT
Tests run: 1, Failures: 0, Errors: 0, Skipped: 0, Time elapsed: 17.296 sec - in org.apache.phoenix.end2end.MappingTableDataTypeIT
Running org.apache.phoenix.end2end.AbsFunctionEnd2EndIT
Tests run: 16, Failures: 0, Errors: 0, Skipped: 0, Time elapsed: 60.407 sec - in org.apache.phoenix.end2end.CSVCommonsLoaderIT
Running org.apache.phoenix.end2end.InListIT
Tests run: 1, Failures: 0, Errors: 0, Skipped: 0, Time elapsed: 9.916 sec - in org.apache.phoenix.end2end.AbsFunctionEnd2EndIT
Running org.apache.phoenix.end2end.StatementHintsIT
Tests run: 16, Failures: 0, Errors: 0, Skipped: 0, Time elapsed: 123.663 sec - in org.apache.phoenix.end2end.ArraysWithNullsIT
Running org.apache.phoenix.end2end.TenantSpecificViewIndexSaltedIT
Tests run: 2, Failures: 0, Errors: 0, Skipped: 0, Time elapsed: 9.658 sec - in org.apache.phoenix.end2end.StatementHintsIT
Running org.apache.phoenix.end2end.TimezoneOffsetFunctionIT
Tests run: 7, Failures: 0, Errors: 0, Skipped: 0, Time elapsed: 21.242 sec - in org.apache.phoenix.end2end.TimezoneOffsetFunctionIT
Running org.apache.phoenix.end2end.QueryExecWithoutSCNIT
Tests run: 8, Failures: 0, Errors: 0, Skipped: 0, Time elapsed: 57.944 sec - in org.apache.phoenix.end2end.TenantSpecificViewIndexIT
Running org.apache.phoenix.end2end.LpadFunctionIT
Tests run: 4, Failures: 0, Errors: 0, Skipped: 0, Time elapsed: 28.841 sec - in org.apache.phoenix.end2end.TenantSpecificViewIndexSaltedIT
Running org.apache.phoenix.end2end.SortOrderIT
Tests run: 1, Failures: 0, Errors: 0, Skipped: 0, Time elapsed: 11.591 sec - in org.apache.phoenix.end2end.QueryExecWithoutSCNIT
Running org.apache.phoenix.end2end.CoalesceFunctionIT
Tests run: 10, Failures: 0, Errors: 0, Skipped: 0, Time elapsed: 32.606 sec - in org.apache.phoenix.end2end.CoalesceFunctionIT
Running org.apache.phoenix.end2end.GroupByCaseIT
Tests run: 12, Failures: 0, Errors: 0, Skipped: 0, Time elapsed: 45.141 sec - in org.apache.phoenix.end2end.LpadFunctionIT
Running org.apache.phoenix.end2end.RegexpReplaceFunctionIT
Tests run: 2, Failures: 0, Errors: 0, Skipped: 0, Time elapsed: 7.066 sec - in org.apache.phoenix.end2end.RegexpReplaceFunctionIT
Running org.apache.phoenix.end2end.EvaluationOfORIT
Tests run: 2, Failures: 0, Errors: 0, Skipped: 0, Time elapsed: 10.664 sec - in org.apache.phoenix.end2end.EvaluationOfORIT
Running org.apache.phoenix.end2end.LastValueFunctionIT
Tests run: 5, Failures: 0, Errors: 0, Skipped: 0, Time elapsed: 29.678 sec - in org.apache.phoenix.end2end.GroupByCaseIT
Running org.apache.phoenix.end2end.SkipScanAfterManualSplitIT
Tests run: 11, Failures: 0, Errors: 0, Skipped: 0, Time elapsed: 21.085 sec - in org.apache.phoenix.end2end.LastValueFunctionIT
Running org.apache.phoenix.end2end.salted.SaltedTableVarLengthRowKeyIT
Tests run: 1, Failures: 0, Errors: 0, Skipped: 0, Time elapsed: 7.446 sec - in org.apache.phoenix.end2end.salted.SaltedTableVarLengthRowKeyIT
Running org.apache.phoenix.end2end.salted.SaltedTableUpsertSelectIT
Tests run: 28, Failures: 0, Errors: 0, Skipped: 0, Time elapsed: 159.924 sec - in org.apache.phoenix.end2end.InListIT
Running org.apache.phoenix.end2end.DynamicFamilyIT
Tests run: 5, Failures: 0, Errors: 0, Skipped: 0, Time elapsed: 31.495 sec - in org.apache.phoenix.end2end.salted.SaltedTableUpsertSelectIT
Running org.apache.phoenix.end2end.MinMaxAggregateFunctionIT
Tests run: 3, Failures: 0, Errors: 0, Skipped: 0, Time elapsed: 56.149 sec - in org.apache.phoenix.end2end.SkipScanAfterManualSplitIT
Running org.apache.phoenix.end2end.ArrayToStringFunctionIT
Tests run: 45, Failures: 0, Errors: 0, Skipped: 0, Time elapsed: 128.807 sec - in org.apache.phoenix.end2end.SortOrderIT
Running org.apache.phoenix.end2end.SubqueryIT
Tests run: 1, Failures: 0, Errors: 0, Skipped: 0, Time elapsed: 8.432 sec - in org.apache.phoenix.end2end.MinMaxAggregateFunctionIT
Tests run: 4, Failures: 0, Errors: 0, Skipped: 0, Time elapsed: 17.339 sec - in org.apache.phoenix.end2end.DynamicFamilyIT
Running org.apache.phoenix.end2end.ArrayAppendFunctionIT
Running org.apache.phoenix.end2end.ReverseScanIT
Tests run: 99, Failures: 0, Errors: 0, Skipped: 0, Time elapsed: 634.731 sec - in org.apache.phoenix.end2end.SpooledSortMergeJoinIT
Running org.apache.phoenix.end2end.RTrimFunctionIT
Tests run: 2, Failures: 0, Errors: 0, Skipped: 0, Time elapsed: 8.135 sec - in org.apache.phoenix.end2end.RTrimFunctionIT
Running org.apache.phoenix.end2end.SortMergeJoinIT
Tests run: 3, Failures: 0, Errors: 0, Skipped: 0, Time elapsed: 17.634 sec - in org.apache.phoenix.end2end.ReverseScanIT
Running org.apache.phoenix.end2end.SignFunctionEnd2EndIT
Tests run: 36, Failures: 0, Errors: 0, Skipped: 0, Time elapsed: 30.33 sec - in org.apache.phoenix.end2end.ArrayToStringFunctionIT
Running org.apache.phoenix.end2end.QueryMoreIT
Tests run: 2, Failures: 0, Errors: 0, Skipped: 0, Time elapsed: 15.117 sec - in org.apache.phoenix.end2end.SignFunctionEnd2EndIT
Running org.apache.phoenix.end2end.TenantIdTypeIT
Tests run: 34, Failures: 0, Errors: 0, Skipped: 0, Time elapsed: 38.906 sec - in org.apache.phoenix.end2end.ArrayAppendFunctionIT
Running org.apache.phoenix.end2end.ArrayConcatFunctionIT
Tests run: 30, Failures: 0, Errors: 0, Skipped: 0, Time elapsed: 42.944 sec - in org.apache.phoenix.end2end.ArrayConcatFunctionIT
Tests run: 6, Failures: 0, Errors: 0, Skipped: 0, Time elapsed: 59.716 sec - in org.apache.phoenix.end2end.QueryMoreIT
Running org.apache.phoenix.end2end.ConvertTimezoneFunctionIT
Running org.apache.phoenix.end2end.LnLogFunctionEnd2EndIT
Tests run: 7, Failures: 0, Errors: 0, Skipped: 0, Time elapsed: 9.549 sec - in org.apache.phoenix.end2end.ConvertTimezoneFunctionIT
Running org.apache.phoenix.trace.PhoenixTraceReaderIT
Tests run: 2, Failures: 0, Errors: 0, Skipped: 0, Time elapsed: 4.934 sec - in org.apache.phoenix.trace.PhoenixTraceReaderIT
Running org.apache.phoenix.trace.PhoenixTracingEndToEndIT
Tests run: 1, Failures: 0, Errors: 0, Skipped: 0, Time elapsed: 17.818 sec - in org.apache.phoenix.end2end.LnLogFunctionEnd2EndIT
Running org.apache.phoenix.trace.PhoenixTableMetricsWriterIT
Tests run: 2, Failures: 0, Errors: 0, Skipped: 0, Time elapsed: 2.924 sec - in org.apache.phoenix.trace.PhoenixTableMetricsWriterIT
Running org.apache.phoenix.rpc.UpdateCacheIT
Tests run: 21, Failures: 0, Errors: 0, Skipped: 0, Time elapsed: 128.086 sec - in org.apache.phoenix.end2end.SubqueryIT
Tests run: 3, Failures: 0, Errors: 0, Skipped: 0, Time elapsed: 27.841 sec - in org.apache.phoenix.rpc.UpdateCacheIT
Tests run: 6, Failures: 0, Errors: 0, Skipped: 0, Time elapsed: 99.372 sec - in org.apache.phoenix.trace.PhoenixTracingEndToEndIT
Tests run: 15, Failures: 0, Errors: 0, Skipped: 0, Time elapsed: 198.9 sec - in org.apache.phoenix.end2end.TenantIdTypeIT
Tests run: 99, Failures: 0, Errors: 0, Skipped: 0, Time elapsed: 384.301 sec - in org.apache.phoenix.end2end.SortMergeJoinIT

Results :

Failed tests: 
  ServerExceptionIT.testServerExceptionBackToClient:62 null

Tests run: 1322, Failures: 1, Errors: 0, Skipped: 0

[INFO] 
[INFO] --- maven-failsafe-plugin:2.19:integration-test (NeedTheirOwnClusterTests) @ phoenix-core
---

-------------------------------------------------------
 T E S T S
-------------------------------------------------------
Running org.apache.phoenix.end2end.ConnectionUtilIT
Running org.apache.phoenix.iterate.RoundRobinResultIteratorWithStatsIT
Running org.apache.phoenix.end2end.ViewIT
Running org.apache.phoenix.end2end.TenantSpecificTablesDMLIT
Tests run: 1, Failures: 0, Errors: 0, Skipped: 0, Time elapsed: 17.055 sec - in org.apache.phoenix.iterate.RoundRobinResultIteratorWithStatsIT
Running org.apache.phoenix.execute.PartialCommitIT
Tests run: 1, Failures: 0, Errors: 0, Skipped: 0, Time elapsed: 37.27 sec - in org.apache.phoenix.end2end.ConnectionUtilIT
Tests run: 12, Failures: 0, Errors: 0, Skipped: 0, Time elapsed: 15.528 sec - in org.apache.phoenix.execute.PartialCommitIT
Running org.apache.phoenix.end2end.index.MutableIndexFailureIT
Running org.apache.phoenix.end2end.index.txn.TxWriteFailureIT
Running org.apache.phoenix.end2end.index.ImmutableIndexWithStatsIT
Tests run: 16, Failures: 0, Errors: 0, Skipped: 0, Time elapsed: 61.973 sec - in org.apache.phoenix.end2end.TenantSpecificTablesDMLIT
Tests run: 1, Failures: 0, Errors: 0, Skipped: 0, Time elapsed: 15.506 sec - in org.apache.phoenix.end2end.index.ImmutableIndexWithStatsIT
Tests run: 22, Failures: 0, Errors: 0, Skipped: 0, Time elapsed: 86.851 sec - in org.apache.phoenix.end2end.ViewIT
Running org.apache.phoenix.end2end.index.MutableIndexReplicationIT
Tests run: 8, Failures: 0, Errors: 0, Skipped: 0, Time elapsed: 53.865 sec - in org.apache.phoenix.end2end.index.txn.TxWriteFailureIT
Running org.apache.phoenix.end2end.QueryTimeoutIT
Running org.apache.phoenix.end2end.QueryWithLimitIT
Running org.apache.phoenix.end2end.StatsCollectorIT
Tests run: 1, Failures: 0, Errors: 0, Skipped: 0, Time elapsed: 27.178 sec - in org.apache.phoenix.end2end.QueryTimeoutIT
Tests run: 1, Failures: 0, Errors: 0, Skipped: 0, Time elapsed: 38.699 sec - in org.apache.phoenix.end2end.index.MutableIndexReplicationIT
Tests run: 2, Failures: 0, Errors: 0, Skipped: 0, Time elapsed: 36.46 sec - in org.apache.phoenix.end2end.QueryWithLimitIT
Running org.apache.phoenix.end2end.ContextClassloaderIT
Running org.apache.phoenix.end2end.KeyOnlyIT
Running org.apache.phoenix.end2end.UnionAllIT
Tests run: 3, Failures: 0, Errors: 0, Skipped: 0, Time elapsed: 12.625 sec - in org.apache.phoenix.end2end.ContextClassloaderIT
Tests run: 3, Failures: 0, Errors: 0, Skipped: 0, Time elapsed: 25.347 sec - in org.apache.phoenix.end2end.KeyOnlyIT
Running org.apache.phoenix.end2end.MultiCfQueryExecIT
Tests run: 5, Failures: 0, Errors: 0, Skipped: 0, Time elapsed: 79.39 sec - in org.apache.phoenix.end2end.StatsCollectorIT
Running org.apache.phoenix.end2end.UserDefinedFunctionsIT
Tests run: 12, Failures: 0, Errors: 0, Skipped: 0, Time elapsed: 49.163 sec - in org.apache.phoenix.end2end.UnionAllIT
Tests run: 7, Failures: 0, Errors: 0, Skipped: 0, Time elapsed: 25.925 sec - in org.apache.phoenix.end2end.MultiCfQueryExecIT
Tests run: 6, Failures: 0, Errors: 0, Skipped: 2, Time elapsed: 189.764 sec - in org.apache.phoenix.end2end.index.MutableIndexFailureIT
Running org.apache.phoenix.end2end.SaltedViewIT
Running org.apache.phoenix.end2end.AlterTableIT
Running org.apache.phoenix.end2end.TenantSpecificTablesDDLIT
Running org.apache.phoenix.end2end.CountDistinctCompressionIT
Tests run: 2, Failures: 0, Errors: 0, Skipped: 0, Time elapsed: 26.05 sec - in org.apache.phoenix.end2end.SaltedViewIT
Tests run: 1, Failures: 0, Errors: 0, Skipped: 0, Time elapsed: 19.19 sec - in org.apache.phoenix.end2end.CountDistinctCompressionIT
Tests run: 13, Failures: 0, Errors: 0, Skipped: 0, Time elapsed: 56.514 sec - in org.apache.phoenix.end2end.UserDefinedFunctionsIT
Running org.apache.phoenix.end2end.SpillableGroupByIT
Running org.apache.phoenix.end2end.StatsCollectorWithSplitsAndMultiCFIT
Running org.apache.phoenix.end2end.ParallelIteratorsIT
Tests run: 1, Failures: 0, Errors: 0, Skipped: 0, Time elapsed: 17.488 sec - in org.apache.phoenix.end2end.SpillableGroupByIT
Tests run: 17, Failures: 0, Errors: 0, Skipped: 0, Time elapsed: 69.461 sec - in org.apache.phoenix.end2end.TenantSpecificTablesDDLIT
Running org.apache.phoenix.mapreduce.IndexToolIT
Tests run: 2, Failures: 0, Errors: 0, Skipped: 0, Time elapsed: 40.228 sec - in org.apache.phoenix.end2end.StatsCollectorWithSplitsAndMultiCFIT
Tests run: 3, Failures: 0, Errors: 0, Skipped: 0, Time elapsed: 47.286 sec - in org.apache.phoenix.end2end.ParallelIteratorsIT
Running org.apache.phoenix.hbase.index.FailForUnsupportedHBaseVersionsIT
Running org.apache.phoenix.monitoring.PhoenixMetricsIT
Running org.apache.phoenix.mapreduce.CsvBulkLoadToolIT
Tests run: 2, Failures: 0, Errors: 0, Skipped: 0, Time elapsed: 19.803 sec - in org.apache.phoenix.hbase.index.FailForUnsupportedHBaseVersionsIT
Running org.apache.phoenix.hbase.index.covered.example.EndToEndCoveredIndexingIT
Tests run: 17, Failures: 0, Errors: 0, Skipped: 0, Time elapsed: 90.769 sec - in org.apache.phoenix.monitoring.PhoenixMetricsIT
Running org.apache.phoenix.hbase.index.covered.example.EndtoEndIndexingWithCompressionIT
Tests run: 11, Failures: 0, Errors: 0, Skipped: 0, Time elapsed: 190.658 sec - in org.apache.phoenix.hbase.index.covered.example.EndToEndCoveredIndexingIT
Running org.apache.phoenix.hbase.index.covered.example.FailWithoutRetriesIT
Tests run: 6, Failures: 0, Errors: 0, Skipped: 0, Time elapsed: 235.555 sec - in org.apache.phoenix.mapreduce.CsvBulkLoadToolIT
Tests run: 1, Failures: 0, Errors: 0, Skipped: 0, Time elapsed: 9.198 sec - in org.apache.phoenix.hbase.index.covered.example.FailWithoutRetriesIT
Running org.apache.phoenix.hbase.index.covered.EndToEndCoveredColumnsIndexBuilderIT
Running org.apache.phoenix.hbase.index.balancer.IndexLoadBalancerIT
Tests run: 2, Failures: 0, Errors: 0, Skipped: 0, Time elapsed: 18.46 sec - in org.apache.phoenix.hbase.index.covered.EndToEndCoveredColumnsIndexBuilderIT
Tests run: 11, Failures: 0, Errors: 0, Skipped: 0, Time elapsed: 162.613 sec - in org.apache.phoenix.hbase.index.covered.example.EndtoEndIndexingWithCompressionIT
Running org.apache.phoenix.rpc.PhoenixClientRpcIT
Tests run: 2, Failures: 0, Errors: 0, Skipped: 0, Time elapsed: 20.923 sec - in org.apache.phoenix.rpc.PhoenixClientRpcIT
Running org.apache.hadoop.hbase.regionserver.wal.WALReplayWithIndexWritesAndCompressedWALIT
Tests run: 1, Failures: 0, Errors: 0, Skipped: 0, Time elapsed: 27.404 sec - in org.apache.hadoop.hbase.regionserver.wal.WALReplayWithIndexWritesAndCompressedWALIT
Running org.apache.hadoop.hbase.regionserver.wal.WALReplayWithIndexWritesAndUncompressedWALInHBase_094_9_IT
Tests run: 1, Failures: 0, Errors: 0, Skipped: 0, Time elapsed: 27.155 sec - in org.apache.hadoop.hbase.regionserver.wal.WALReplayWithIndexWritesAndUncompressedWALInHBase_094_9_IT
Tests run: 56, Failures: 0, Errors: 0, Skipped: 0, Time elapsed: 478.485 sec - in org.apache.phoenix.end2end.AlterTableIT
Tests run: 9, Failures: 0, Errors: 0, Skipped: 0, Time elapsed: 431.267 sec - in org.apache.phoenix.mapreduce.IndexToolIT
Tests run: 9, Failures: 0, Errors: 0, Skipped: 0, Time elapsed: 232.97 sec - in org.apache.phoenix.hbase.index.balancer.IndexLoadBalancerIT
Running org.apache.phoenix.rpc.PhoenixServerRpcIT
Tests run: 2, Failures: 0, Errors: 0, Skipped: 0, Time elapsed: 23.137 sec - in org.apache.phoenix.rpc.PhoenixServerRpcIT

Results :

Tests run: 270, Failures: 0, Errors: 0, Skipped: 2

[INFO] 
[INFO] --- maven-failsafe-plugin:2.19:verify (ClientManagedTimeTests) @ phoenix-core ---
[INFO] ------------------------------------------------------------------------
[INFO] Reactor Summary:
[INFO] 
[INFO] Apache Phoenix .................................... SUCCESS [3.632s]
[INFO] Phoenix Core ...................................... FAILURE [1:15:44.842s]
[INFO] Phoenix - Flume ................................... SKIPPED
[INFO] Phoenix - Pig ..................................... SKIPPED
[INFO] Phoenix Query Server Client ....................... SKIPPED
[INFO] Phoenix Query Server .............................. SKIPPED
[INFO] Phoenix - Pherf ................................... SKIPPED
[INFO] Phoenix - Spark ................................... SKIPPED
[INFO] Phoenix Assembly .................................. SKIPPED
[INFO] Phoenix - Tracing Web Application ................. SKIPPED
[INFO] ------------------------------------------------------------------------
[INFO] BUILD FAILURE
[INFO] ------------------------------------------------------------------------
[INFO] Total time: 1:15:49.167s
[INFO] Finished at: Thu Dec 17 00:34:52 UTC 2015
[INFO] Final Memory: 49M/1047M
[INFO] ------------------------------------------------------------------------
[ERROR] Failed to execute goal org.apache.maven.plugins:maven-failsafe-plugin:2.19:verify
(ClientManagedTimeTests) on project phoenix-core: There are test failures.
[ERROR] 
[ERROR] Please refer to <https://builds.apache.org/job/Phoenix-master/ws/phoenix-core/target/failsafe-reports>
for the individual test results.
[ERROR] -> [Help 1]
[ERROR] 
[ERROR] To see the full stack trace of the errors, re-run Maven with the -e switch.
[ERROR] Re-run Maven using the -X switch to enable full debug logging.
[ERROR] 
[ERROR] For more information about the errors and possible solutions, please read the following
articles:
[ERROR] [Help 1] http://cwiki.apache.org/confluence/display/MAVEN/MojoFailureException
[ERROR] 
[ERROR] After correcting the problems, you can resume the build with the command
[ERROR]   mvn <goals> -rf :phoenix-core
Build step 'Invoke top-level Maven targets' marked build as failure
Archiving artifacts
Compressed 982.92 MB of artifacts by 42.1% relative to #1022
Updating PHOENIX-2527
Recording test results

Mime
View raw message