phoenix-commits mailing list archives

Site index · List index
Message view « Date » · « Thread »
Top « Date » · « Thread »
From Apache Jenkins Server <jenk...@builds.apache.org>
Subject Build failed in Jenkins: Phoenix | Master #940
Date Tue, 03 Nov 2015 02:12:26 GMT
See <https://builds.apache.org/job/Phoenix-master/940/changes>

Changes:

[cmarcel] PHOENIX-2366 - Pherf NPE on Data loader

------------------------------------------
[...truncated 7307 lines...]
Running org.apache.phoenix.end2end.HashJoinLocalIndexIT
Tests run: 11, Failures: 0, Errors: 0, Skipped: 0, Time elapsed: 23.201 sec - in org.apache.phoenix.end2end.LastValueFunctionIT
Running org.apache.phoenix.end2end.UpsertBigValuesIT
Tests run: 1, Failures: 0, Errors: 0, Skipped: 0, Time elapsed: 12.437 sec - in org.apache.phoenix.end2end.DisableLocalIndexIT
Running org.apache.phoenix.end2end.MD5FunctionIT
Tests run: 3, Failures: 0, Errors: 0, Skipped: 0, Time elapsed: 14.792 sec - in org.apache.phoenix.end2end.MD5FunctionIT
Running org.apache.phoenix.end2end.LpadFunctionIT
Tests run: 4, Failures: 0, Errors: 0, Skipped: 0, Time elapsed: 33.862 sec - in org.apache.phoenix.end2end.UpsertBigValuesIT
Running org.apache.phoenix.end2end.SignFunctionEnd2EndIT
Tests run: 12, Failures: 0, Errors: 0, Skipped: 0, Time elapsed: 31.533 sec - in org.apache.phoenix.end2end.LpadFunctionIT
Tests run: 1, Failures: 0, Errors: 0, Skipped: 0, Time elapsed: 55.854 sec - in org.apache.phoenix.end2end.HashJoinLocalIndexIT
Running org.apache.phoenix.end2end.SortOrderIT
Running org.apache.phoenix.end2end.ArrayToStringFunctionIT
Tests run: 2, Failures: 0, Errors: 0, Skipped: 0, Time elapsed: 15.067 sec - in org.apache.phoenix.end2end.SignFunctionEnd2EndIT
Running org.apache.phoenix.end2end.QueryExecWithoutSCNIT
Tests run: 1, Failures: 0, Errors: 0, Skipped: 0, Time elapsed: 10.167 sec - in org.apache.phoenix.end2end.QueryExecWithoutSCNIT
Running org.apache.phoenix.end2end.RegexpReplaceFunctionIT
Tests run: 2, Failures: 0, Errors: 0, Skipped: 0, Time elapsed: 7.617 sec - in org.apache.phoenix.end2end.RegexpReplaceFunctionIT
Running org.apache.phoenix.end2end.DynamicFamilyIT
Tests run: 6, Failures: 0, Errors: 0, Skipped: 0, Time elapsed: 103.69 sec - in org.apache.phoenix.end2end.UpgradeIT
Running org.apache.phoenix.end2end.RoundFloorCeilFunctionsEnd2EndIT
Tests run: 4, Failures: 0, Errors: 0, Skipped: 0, Time elapsed: 17.257 sec - in org.apache.phoenix.end2end.DynamicFamilyIT
Running org.apache.phoenix.end2end.DeleteIT
Tests run: 36, Failures: 0, Errors: 0, Skipped: 0, Time elapsed: 48.485 sec - in org.apache.phoenix.end2end.ArrayToStringFunctionIT
Running org.apache.phoenix.end2end.InListIT
Tests run: 31, Failures: 0, Errors: 0, Skipped: 0, Time elapsed: 21.59 sec - in org.apache.phoenix.end2end.RoundFloorCeilFunctionsEnd2EndIT
Running org.apache.phoenix.end2end.EvaluationOfORIT
Tests run: 2, Failures: 0, Errors: 0, Skipped: 0, Time elapsed: 7.609 sec - in org.apache.phoenix.end2end.EvaluationOfORIT
Running org.apache.phoenix.end2end.ReverseScanIT
Tests run: 3, Failures: 0, Errors: 0, Skipped: 0, Time elapsed: 14.232 sec - in org.apache.phoenix.end2end.ReverseScanIT
Running org.apache.phoenix.end2end.RTrimFunctionIT
Tests run: 15, Failures: 0, Errors: 0, Skipped: 0, Time elapsed: 216.349 sec - in org.apache.phoenix.end2end.TenantIdTypeIT
Running org.apache.phoenix.end2end.NthValueFunctionIT
Tests run: 2, Failures: 0, Errors: 0, Skipped: 0, Time elapsed: 6.708 sec - in org.apache.phoenix.end2end.RTrimFunctionIT
Running org.apache.phoenix.end2end.ReadOnlyIT
Tests run: 1, Failures: 0, Errors: 0, Skipped: 0, Time elapsed: 15.14 sec - in org.apache.phoenix.end2end.ReadOnlyIT
Running org.apache.phoenix.end2end.ArrayPrependFunctionIT
Tests run: 11, Failures: 0, Errors: 0, Skipped: 0, Time elapsed: 19.416 sec - in org.apache.phoenix.end2end.NthValueFunctionIT
Running org.apache.phoenix.end2end.ExecuteStatementsIT
Tests run: 45, Failures: 0, Errors: 0, Skipped: 0, Time elapsed: 108.578 sec - in org.apache.phoenix.end2end.SortOrderIT
Running org.apache.phoenix.iterate.RoundRobinResultIteratorIT
Tests run: 22, Failures: 0, Errors: 0, Skipped: 0, Time elapsed: 79.523 sec - in org.apache.phoenix.end2end.DeleteIT
Running org.apache.phoenix.iterate.PhoenixQueryTimeoutIT
Tests run: 2, Failures: 0, Errors: 0, Skipped: 0, Time elapsed: 7.765 sec - in org.apache.phoenix.iterate.PhoenixQueryTimeoutIT
Tests run: 34, Failures: 0, Errors: 0, Skipped: 0, Time elapsed: 36.152 sec - in org.apache.phoenix.end2end.ArrayPrependFunctionIT
Tests run: 2, Failures: 0, Errors: 0, Skipped: 0, Time elapsed: 35.325 sec - in org.apache.phoenix.end2end.ExecuteStatementsIT
Tests run: 9, Failures: 0, Errors: 0, Skipped: 0, Time elapsed: 104.77 sec - in org.apache.phoenix.iterate.RoundRobinResultIteratorIT
Tests run: 28, Failures: 0, Errors: 0, Skipped: 0, Time elapsed: 211.686 sec - in org.apache.phoenix.end2end.InListIT

Results :




Tests run: 1176, Failures: 0, Errors: 0, Skipped: 0

[INFO] 
[INFO] --- maven-failsafe-plugin:2.18:integration-test (NeedTheirOwnClusterTests) @ phoenix-core
---
[INFO] Failsafe report directory: <https://builds.apache.org/job/Phoenix-master/ws/phoenix-core/target/failsafe-reports>
[INFO] parallel='none', perCoreThreadCount=true, threadCount=0, useUnlimitedThreads=false,
threadCountSuites=0, threadCountClasses=0, threadCountMethods=0, parallelOptimized=true

-------------------------------------------------------
 T E S T S
-------------------------------------------------------
Running org.apache.phoenix.rpc.PhoenixClientRpcIT
Running org.apache.phoenix.rpc.PhoenixServerRpcIT
Running org.apache.phoenix.mapreduce.IndexToolIT
Running org.apache.phoenix.execute.PartialCommitIT
Tests run: 2, Failures: 0, Errors: 0, Skipped: 0, Time elapsed: 13.103 sec - in org.apache.phoenix.rpc.PhoenixClientRpcIT
Running org.apache.phoenix.mapreduce.CsvBulkLoadToolIT
Tests run: 2, Failures: 0, Errors: 0, Skipped: 0, Time elapsed: 20.597 sec - in org.apache.phoenix.rpc.PhoenixServerRpcIT
Tests run: 6, Failures: 0, Errors: 0, Skipped: 0, Time elapsed: 10.877 sec - in org.apache.phoenix.execute.PartialCommitIT
Running org.apache.phoenix.end2end.ConnectionUtilIT
Running org.apache.phoenix.end2end.MultiCfQueryExecIT
Running org.apache.phoenix.end2end.ViewIT
Tests run: 7, Failures: 0, Errors: 0, Skipped: 0, Time elapsed: 23.63 sec - in org.apache.phoenix.end2end.MultiCfQueryExecIT
Tests run: 1, Failures: 0, Errors: 0, Skipped: 0, Time elapsed: 28.059 sec - in org.apache.phoenix.end2end.ConnectionUtilIT
Running org.apache.phoenix.end2end.StatsCollectorIT
Tests run: 22, Failures: 0, Errors: 0, Skipped: 0, Time elapsed: 94.07 sec - in org.apache.phoenix.end2end.ViewIT
Tests run: 4, Failures: 0, Errors: 0, Skipped: 0, Time elapsed: 64.437 sec - in org.apache.phoenix.end2end.StatsCollectorIT
Running org.apache.phoenix.end2end.SaltedViewIT
Running org.apache.phoenix.end2end.index.ImmutableIndexWithStatsIT
Tests run: 1, Failures: 0, Errors: 0, Skipped: 0, Time elapsed: 14.53 sec - in org.apache.phoenix.end2end.index.ImmutableIndexWithStatsIT
Tests run: 2, Failures: 0, Errors: 0, Skipped: 0, Time elapsed: 24.225 sec - in org.apache.phoenix.end2end.SaltedViewIT
Running org.apache.phoenix.end2end.index.MutableIndexFailureIT
Running org.apache.phoenix.end2end.index.MutableIndexReplicationIT
Tests run: 5, Failures: 0, Errors: 0, Skipped: 0, Time elapsed: 194.052 sec - in org.apache.phoenix.mapreduce.CsvBulkLoadToolIT
Tests run: 3, Failures: 0, Errors: 0, Skipped: 2, Time elapsed: 46.045 sec - in org.apache.phoenix.end2end.index.MutableIndexFailureIT
Running org.apache.phoenix.end2end.SpillableGroupByIT
Tests run: 1, Failures: 0, Errors: 0, Skipped: 0, Time elapsed: 36.05 sec - in org.apache.phoenix.end2end.index.MutableIndexReplicationIT
Tests run: 1, Failures: 0, Errors: 0, Skipped: 0, Time elapsed: 12.169 sec - in org.apache.phoenix.end2end.SpillableGroupByIT
Running org.apache.phoenix.end2end.CountDistinctCompressionIT
Running org.apache.phoenix.end2end.KeyOnlyIT
Tests run: 1, Failures: 0, Errors: 0, Skipped: 0, Time elapsed: 12.294 sec - in org.apache.phoenix.end2end.CountDistinctCompressionIT
Running org.apache.phoenix.end2end.TenantSpecificTablesDDLIT
Running org.apache.phoenix.end2end.TenantSpecificTablesDMLIT
Tests run: 3, Failures: 0, Errors: 0, Skipped: 0, Time elapsed: 23.845 sec - in org.apache.phoenix.end2end.KeyOnlyIT
Running org.apache.phoenix.end2end.ContextClassloaderIT
Tests run: 3, Failures: 0, Errors: 0, Skipped: 0, Time elapsed: 10.859 sec - in org.apache.phoenix.end2end.ContextClassloaderIT
Tests run: 17, Failures: 0, Errors: 0, Skipped: 0, Time elapsed: 62.666 sec - in org.apache.phoenix.end2end.TenantSpecificTablesDDLIT
Running org.apache.phoenix.end2end.QueryTimeoutIT
Tests run: 16, Failures: 0, Errors: 0, Skipped: 0, Time elapsed: 64.411 sec - in org.apache.phoenix.end2end.TenantSpecificTablesDMLIT
Tests run: 1, Failures: 0, Errors: 0, Skipped: 0, Time elapsed: 14.723 sec - in org.apache.phoenix.end2end.QueryTimeoutIT
Running org.apache.phoenix.end2end.UserDefinedFunctionsIT
Running org.apache.phoenix.end2end.QueryWithLimitIT
Running org.apache.phoenix.end2end.StatsCollectorWithSplitsAndMultiCFIT
Tests run: 2, Failures: 0, Errors: 0, Skipped: 0, Time elapsed: 24.804 sec - in org.apache.phoenix.end2end.QueryWithLimitIT
Running org.apache.phoenix.end2end.UnionAllIT
Tests run: 2, Failures: 0, Errors: 0, Skipped: 0, Time elapsed: 35.392 sec - in org.apache.phoenix.end2end.StatsCollectorWithSplitsAndMultiCFIT
Tests run: 13, Failures: 0, Errors: 0, Skipped: 0, Time elapsed: 51.125 sec - in org.apache.phoenix.end2end.UserDefinedFunctionsIT
Tests run: 9, Failures: 0, Errors: 0, Skipped: 0, Time elapsed: 421.117 sec - in org.apache.phoenix.mapreduce.IndexToolIT
Running org.apache.phoenix.hbase.index.covered.EndToEndCoveredColumnsIndexBuilderIT
Running org.apache.phoenix.end2end.ParallelIteratorsIT
Running org.apache.phoenix.iterate.RoundRobinResultIteratorWithStatsIT
Tests run: 2, Failures: 0, Errors: 0, Skipped: 0, Time elapsed: 18.515 sec - in org.apache.phoenix.hbase.index.covered.EndToEndCoveredColumnsIndexBuilderIT
Tests run: 1, Failures: 0, Errors: 0, Skipped: 0, Time elapsed: 13.341 sec - in org.apache.phoenix.iterate.RoundRobinResultIteratorWithStatsIT
Tests run: 12, Failures: 0, Errors: 0, Skipped: 0, Time elapsed: 44.562 sec - in org.apache.phoenix.end2end.UnionAllIT
Running org.apache.phoenix.hbase.index.covered.example.EndtoEndIndexingWithCompressionIT
Running org.apache.phoenix.hbase.index.covered.example.EndToEndCoveredIndexingIT
Running org.apache.phoenix.hbase.index.covered.example.FailWithoutRetriesIT
Tests run: 1, Failures: 0, Errors: 0, Skipped: 0, Time elapsed: 8.126 sec - in org.apache.phoenix.hbase.index.covered.example.FailWithoutRetriesIT
Tests run: 3, Failures: 0, Errors: 0, Skipped: 0, Time elapsed: 45.143 sec - in org.apache.phoenix.end2end.ParallelIteratorsIT
Running org.apache.phoenix.hbase.index.FailForUnsupportedHBaseVersionsIT
Running org.apache.phoenix.hbase.index.balancer.IndexLoadBalancerIT
Tests run: 2, Failures: 0, Errors: 0, Skipped: 0, Time elapsed: 17.528 sec - in org.apache.phoenix.hbase.index.FailForUnsupportedHBaseVersionsIT
Running org.apache.phoenix.monitoring.PhoenixMetricsIT
Tests run: 17, Failures: 0, Errors: 0, Skipped: 0, Time elapsed: 84.24 sec - in org.apache.phoenix.monitoring.PhoenixMetricsIT
Running org.apache.hadoop.hbase.regionserver.wal.WALReplayWithIndexWritesAndCompressedWALIT
Tests run: 1, Failures: 0, Errors: 0, Skipped: 0, Time elapsed: 27.575 sec - in org.apache.hadoop.hbase.regionserver.wal.WALReplayWithIndexWritesAndCompressedWALIT
Running org.apache.hadoop.hbase.regionserver.wal.WALReplayWithIndexWritesAndUncompressedWALInHBase_094_9_IT
Tests run: 11, Failures: 0, Errors: 0, Skipped: 0, Time elapsed: 168.906 sec - in org.apache.phoenix.hbase.index.covered.example.EndToEndCoveredIndexingIT
Tests run: 11, Failures: 0, Errors: 0, Skipped: 0, Time elapsed: 178.108 sec - in org.apache.phoenix.hbase.index.covered.example.EndtoEndIndexingWithCompressionIT
Tests run: 1, Failures: 0, Errors: 0, Skipped: 0, Time elapsed: 27.89 sec - in org.apache.hadoop.hbase.regionserver.wal.WALReplayWithIndexWritesAndUncompressedWALInHBase_094_9_IT
Tests run: 9, Failures: 0, Errors: 0, Skipped: 0, Time elapsed: 252.875 sec - in org.apache.phoenix.hbase.index.balancer.IndexLoadBalancerIT
Running org.apache.phoenix.end2end.AlterTableIT
Tests run: 53, Failures: 0, Errors: 3, Skipped: 0, Time elapsed: 435.489 sec <<<
FAILURE! - in org.apache.phoenix.end2end.AlterTableIT
testDropIndexedColumn(org.apache.phoenix.end2end.AlterTableIT)  Time elapsed: 7.316 sec  <<<
ERROR!
java.sql.SQLException: ERROR 2009 (INT11): Unknown error code 0
	at org.apache.phoenix.exception.SQLExceptionCode$Factory$1.newException(SQLExceptionCode.java:396)
	at org.apache.phoenix.exception.SQLExceptionInfo.buildException(SQLExceptionInfo.java:145)
	at org.apache.phoenix.exception.SQLExceptionCode.fromErrorCode(SQLExceptionCode.java:424)
	at org.apache.phoenix.util.ServerUtil.parseRemoteException(ServerUtil.java:127)
	at org.apache.phoenix.util.ServerUtil.parseServerExceptionOrNull(ServerUtil.java:115)
	at org.apache.phoenix.util.ServerUtil.parseServerException(ServerUtil.java:104)
	at org.apache.phoenix.query.ConnectionQueryServicesImpl.metaDataCoprocessorExec(ConnectionQueryServicesImpl.java:1053)
	at org.apache.phoenix.query.ConnectionQueryServicesImpl.metaDataCoprocessorExec(ConnectionQueryServicesImpl.java:1016)
	at org.apache.phoenix.query.ConnectionQueryServicesImpl.dropColumn(ConnectionQueryServicesImpl.java:1819)
	at org.apache.phoenix.schema.MetaDataClient.dropColumn(MetaDataClient.java:2880)
	at org.apache.phoenix.jdbc.PhoenixStatement$ExecutableDropColumnStatement$1.execute(PhoenixStatement.java:1147)
	at org.apache.phoenix.jdbc.PhoenixStatement$2.call(PhoenixStatement.java:322)
	at org.apache.phoenix.jdbc.PhoenixStatement$2.call(PhoenixStatement.java:314)
	at org.apache.phoenix.call.CallRunner.run(CallRunner.java:53)
	at org.apache.phoenix.jdbc.PhoenixStatement.executeMutation(PhoenixStatement.java:312)
	at org.apache.phoenix.jdbc.PhoenixStatement.execute(PhoenixStatement.java:1435)
	at org.apache.phoenix.end2end.AlterTableIT.testDropIndexedColumn(AlterTableIT.java:285)

testDropCoveredColumn(org.apache.phoenix.end2end.AlterTableIT)  Time elapsed: 8.06 sec  <<<
ERROR!
java.sql.SQLException: ERROR 2009 (INT11): Unknown error code 0
	at org.apache.phoenix.exception.SQLExceptionCode$Factory$1.newException(SQLExceptionCode.java:396)
	at org.apache.phoenix.exception.SQLExceptionInfo.buildException(SQLExceptionInfo.java:145)
	at org.apache.phoenix.exception.SQLExceptionCode.fromErrorCode(SQLExceptionCode.java:424)
	at org.apache.phoenix.util.ServerUtil.parseRemoteException(ServerUtil.java:127)
	at org.apache.phoenix.util.ServerUtil.parseServerExceptionOrNull(ServerUtil.java:115)
	at org.apache.phoenix.util.ServerUtil.parseServerException(ServerUtil.java:104)
	at org.apache.phoenix.query.ConnectionQueryServicesImpl.metaDataCoprocessorExec(ConnectionQueryServicesImpl.java:1053)
	at org.apache.phoenix.query.ConnectionQueryServicesImpl.metaDataCoprocessorExec(ConnectionQueryServicesImpl.java:1016)
	at org.apache.phoenix.query.ConnectionQueryServicesImpl.dropColumn(ConnectionQueryServicesImpl.java:1819)
	at org.apache.phoenix.schema.MetaDataClient.dropColumn(MetaDataClient.java:2880)
	at org.apache.phoenix.jdbc.PhoenixStatement$ExecutableDropColumnStatement$1.execute(PhoenixStatement.java:1147)
	at org.apache.phoenix.jdbc.PhoenixStatement$2.call(PhoenixStatement.java:322)
	at org.apache.phoenix.jdbc.PhoenixStatement$2.call(PhoenixStatement.java:314)
	at org.apache.phoenix.call.CallRunner.run(CallRunner.java:53)
	at org.apache.phoenix.jdbc.PhoenixStatement.executeMutation(PhoenixStatement.java:312)
	at org.apache.phoenix.jdbc.PhoenixStatement.execute(PhoenixStatement.java:1435)
	at org.apache.phoenix.end2end.AlterTableIT.testDropCoveredColumn(AlterTableIT.java:350)

testDropColumnsWithImutability(org.apache.phoenix.end2end.AlterTableIT)  Time elapsed: 14.066
sec  <<< ERROR!
java.sql.SQLException: ERROR 2009 (INT11): Unknown error code 0
	at org.apache.phoenix.exception.SQLExceptionCode$Factory$1.newException(SQLExceptionCode.java:396)
	at org.apache.phoenix.exception.SQLExceptionInfo.buildException(SQLExceptionInfo.java:145)
	at org.apache.phoenix.exception.SQLExceptionCode.fromErrorCode(SQLExceptionCode.java:424)
	at org.apache.phoenix.util.ServerUtil.parseRemoteException(ServerUtil.java:127)
	at org.apache.phoenix.util.ServerUtil.parseServerExceptionOrNull(ServerUtil.java:115)
	at org.apache.phoenix.util.ServerUtil.parseServerException(ServerUtil.java:104)
	at org.apache.phoenix.query.ConnectionQueryServicesImpl.metaDataCoprocessorExec(ConnectionQueryServicesImpl.java:1053)
	at org.apache.phoenix.query.ConnectionQueryServicesImpl.metaDataCoprocessorExec(ConnectionQueryServicesImpl.java:1016)
	at org.apache.phoenix.query.ConnectionQueryServicesImpl.dropColumn(ConnectionQueryServicesImpl.java:1819)
	at org.apache.phoenix.schema.MetaDataClient.dropColumn(MetaDataClient.java:2880)
	at org.apache.phoenix.jdbc.PhoenixStatement$ExecutableDropColumnStatement$1.execute(PhoenixStatement.java:1147)
	at org.apache.phoenix.jdbc.PhoenixStatement$2.call(PhoenixStatement.java:322)
	at org.apache.phoenix.jdbc.PhoenixStatement$2.call(PhoenixStatement.java:314)
	at org.apache.phoenix.call.CallRunner.run(CallRunner.java:53)
	at org.apache.phoenix.jdbc.PhoenixStatement.executeMutation(PhoenixStatement.java:312)
	at org.apache.phoenix.jdbc.PhoenixStatement.execute(PhoenixStatement.java:1435)
	at org.apache.phoenix.end2end.AlterTableIT.testDropColumnsWithImutability(AlterTableIT.java:874)


Results :


Tests in error: 
  AlterTableIT.testDropColumnsWithImutability:874 » SQL ERROR 2009 (INT11): Unkn...
  AlterTableIT.testDropCoveredColumn:350 » SQL ERROR 2009 (INT11): Unknown error...
  AlterTableIT.testDropIndexedColumn:285 » SQL ERROR 2009 (INT11): Unknown error...


Tests run: 248, Failures: 0, Errors: 3, Skipped: 2

[INFO] 
[INFO] --- maven-failsafe-plugin:2.18:verify (ClientManagedTimeTests) @ phoenix-core ---
[INFO] Failsafe report directory: <https://builds.apache.org/job/Phoenix-master/ws/phoenix-core/target/failsafe-reports>
[INFO] ------------------------------------------------------------------------
[INFO] Reactor Summary:
[INFO] 
[INFO] Apache Phoenix .................................... SUCCESS [4.744s]
[INFO] Phoenix Core ...................................... FAILURE [1:04:29.118s]
[INFO] Phoenix - Flume ................................... SKIPPED
[INFO] Phoenix - Pig ..................................... SKIPPED
[INFO] Phoenix Query Server Client ....................... SKIPPED
[INFO] Phoenix Query Server .............................. SKIPPED
[INFO] Phoenix - Pherf ................................... SKIPPED
[INFO] Phoenix - Spark ................................... SKIPPED
[INFO] Phoenix Assembly .................................. SKIPPED
[INFO] Phoenix - Tracing Web Application ................. SKIPPED
[INFO] ------------------------------------------------------------------------
[INFO] BUILD FAILURE
[INFO] ------------------------------------------------------------------------
[INFO] Total time: 1:04:34.497s
[INFO] Finished at: Tue Nov 03 02:08:42 UTC 2015
[INFO] Final Memory: 48M/1099M
[INFO] ------------------------------------------------------------------------
[ERROR] Failed to execute goal org.apache.maven.plugins:maven-failsafe-plugin:2.18:verify
(ClientManagedTimeTests) on project phoenix-core: There are test failures.
[ERROR] 
[ERROR] Please refer to <https://builds.apache.org/job/Phoenix-master/ws/phoenix-core/target/failsafe-reports>
for the individual test results.
[ERROR] -> [Help 1]
[ERROR] 
[ERROR] To see the full stack trace of the errors, re-run Maven with the -e switch.
[ERROR] Re-run Maven using the -X switch to enable full debug logging.
[ERROR] 
[ERROR] For more information about the errors and possible solutions, please read the following
articles:
[ERROR] [Help 1] http://cwiki.apache.org/confluence/display/MAVEN/MojoFailureException
[ERROR] 
[ERROR] After correcting the problems, you can resume the build with the command
[ERROR]   mvn <goals> -rf :phoenix-core
Build step 'Invoke top-level Maven targets' marked build as failure
Archiving artifacts
Compressed 1.28 GB of artifacts by 53.2% relative to #939
Updating PHOENIX-2366
Recording test results

Mime
View raw message